##TITLE=$$ Begin of the data block
##JCAMP-DX=5.00 $$ ACD/SpecManager v 10.08
##SPECTROMETER/DATA SYSTEM=Varian
##DATE=21 Jan 2013 14:53:38
##DATA TYPE=INFRARED SPECTRUM
##DATA CLASS=XYDATA
##ORIGIN=
##OWNER=
##NPOINTS=3735
##FIRSTX=399.26403809
##LASTX=4000.35498047
##MAXX=4000.35498047
##MINX=399.26403809
##MAXY=78.32617188
##MINY=40.40982437
##XFACTOR=1.0000000000
##YFACTOR=0.000000100000000
##FIRSTY=60.75214386
##DELTAX=0.96440572
##XUNITS=1/CM
##YUNITS=TRANSMITTANCE
##XYDATA=(X++(Y..Y))
399.3F07521439l99170P661361J0569153N317536j171189o800880j483879l175011
407F18039360l745079q4724N329055J0885582p56683m700508n569115n915985j902389
415.7F11579514m887734k841263L92571j621590K800064P283592P442246K132988k319565
424.3F19960823q582268k848930M994659m718856q032036L63464K831841j33820J529503
433F05364380M938278K479057N11475m82216k546348r78852l172798k178192j731796
441.7F02202988l821526M285317M460487O15730j989593J109657L347588n972710m930954
450.4E99306984R53941L389817K008247m16603J786766M321747P834015p270050q426094
459.1F03488770J72462j322365P76673O9313Q06160K123375K797622j875343l804665
$$ y = [607521439, 607122269, 614783630, 625352783, 630670319, 629499130, 622698250, 621214371, 618039360, 614294281, 614209557, 619538612, 630424194, 629667511, 624967003, 619397888, 613481903, 611579514, 606691780, 603850517, 604243088, 602621498, 605421562, 612705154, 620147400, 622280388, 619960823, 611378555, 608529625, 613524284, 608805428, 600773392, 601136856, 603968697, 603834877, 605364380, 610302658, 612781715, 613293190, 612810974, 610264626, 609285774, 606112976, 603934784, 602202988, 598381462, 602666779, 607127266, 607742996, 605753403, 606863060, 610210648, 604237938, 599306984, 600260925, 603650742, 605658989, 605242386, 607029152, 611350899, 619184914, 611914864, 603488770, 603661232, 602338867, 603115540, 603184853, 603991013, 606114388, 608912010, 607036667, 603232002]
467.7F03232002l0441l029900j195373O0844L612480m4021k202110J120376o60705
476.4F00863152J433868k288933Q91953J890487o894302k404671Q35114K761917J160316
485.1E98248901P46727N263138O29730m227752l988648j069259k693978n46837J929818
493.8E94291840j672974K39601O06728O82716M555016J772155l082389p31240J946831
502.5E98608284k242088m126168l222198j903610K052765N155830J73721j899109O39267
511.1E93236694p83538p96891q18901k765236k531891J308022K562408J22796J363868
519.8E90897331P02744p12509j985932l539200k158165Q76732J331139k064095r35859
528.5E82412186K250023K943038L42789j835251Q7891n91164j696739k761383k391434
$$ y = [603232002, 603201561, 600171661, 598976288, 599037132, 602649612, 602605591, 600403481, 601523857, 600863152, 602297020, 600008087, 600900040, 602790527, 595896225, 593491554, 594326668, 597088585, 598248901, 598995628, 604258766, 604888496, 600660744, 596672096, 595602837, 592908859, 592362022, 594291840, 592618866, 592858467, 593465195, 594147911, 598702927, 600475082, 597392693, 596661453, 598608284, 596366196, 592240028, 589017830, 587114220, 589166985, 594322815, 594496536, 592597427, 593236694, 592453156, 591656265, 590837364, 588072128, 585540237, 586848259, 589410667, 589533463, 590897331, 591600075, 590887566, 588901634, 585362434, 583204269, 584081001, 585412140, 583348045, 582412186, 584662209, 587605247, 587948036, 586112785, 586200676, 585609512, 583912773, 581151390, 578759956]
537.2E78759956J648751K980804K940941J525040N82924K19879j852303j846619j745758
545.9E83213615j496162j940575p47947K282142J420708J061516J227913j00251j594619
554.5E83326340j380654q91571l676643k638130J241188R52072N45540J689300J524811
563.2E80692253L07236l4943Q7509n35011j901474o40182j00632j622582j50489K137031
572.9E78238716L773918J588364o19087L54957o08177j324539j501160r86175j494637
581.5E77422180n95779K108307O25496J561965K167511q30268r49364j061783k749367
590.2E77698898k744827m1237J502495J023293R03968J650620J177864n53017j02539
598.9E80515518p71522j340714r22699j207809J12724J205330J993446J716690J620789
$$ y = [578759956, 580408707, 583389511, 586330452, 587855492, 588438416, 588658295, 586805992, 584959373, 583213615, 581717453, 579776878, 579028931, 581311073, 582731781, 583793297, 585021210, 584920959, 583326340, 581945686, 581054115, 577377472, 574739342, 575980530, 576932602, 577478142, 579167442, 580692253, 580999489, 580964546, 581052055, 580517044, 578615570, 577975388, 577874756, 576252174, 576101685, 578238716, 582012634, 583600998, 582981911, 583336868, 582728691, 581404152, 579902992, 578916817, 577422180, 576826401, 578934708, 579560204, 581122169, 583289680, 582459412, 581510048, 580448265, 577698898, 574954071, 574912834, 576415329, 577438622, 578342590, 579993210, 581171074, 580618057, 580515518, 579743996, 578403282, 577480583, 576272774, 576385498, 577590828, 579584274, 581300964, 582921753]
607.6E82921753J478805j052894k386398j812363j528702j642189j072807J80511J754341
616.3E76840057K191086J736031J533394K97737j004944j908035o65360R65042m89120
624.9E79495888n40581J522484L039436L188057K186928M53606q04787r61800j669998
633.6E85909233j120987m12559k17247J940918K537498J698303L070984K990265P14073
642.3E97110481o7825j191025l030891j617966O20384P66220J368904K625618J843682
651E98427582J458130J900444j08490j761666j081924j284523j905136n07584J298599
659.7E96435432J19553j74446J474876J751252K7961j431122R1172J745720J83410
668.3F00223808j764145j76353J172562J251220J416168K382241K434234J180382m65393
$$ y = [582921753, 584400558, 583347664, 580961266, 579148903, 577620201, 575978012, 574905205, 575085716, 576840057, 579031143, 580767174, 582300568, 582598305, 581593361, 579685326, 579019966, 579985008, 579495888, 578955307, 580477791, 583517227, 586705284, 588892212, 589345818, 588541031, 587579231, 585909233, 584788246, 584375687, 584158440, 586099358, 588636856, 590335159, 593406143, 596396408, 597110481, 597042656, 595851631, 592820740, 591202774, 591823158, 592589378, 593958282, 596583900, 598427582, 599885712, 601786156, 601677666, 599916000, 598834076, 597549553, 595644417, 595136833, 596435432, 596554985, 596380539, 597855415, 599606667, 599634628, 598203506, 598294678, 600040398, 600223808, 598459663, 598283310, 599455872, 600707092, 602123260, 604505501, 606939735, 608120117, 607654724]
677F07654724j131630p71560R05990J362000J272049J718177J297341J492958J523170
685.7F15323219J490937N66749m63371k90985k3957P84607N39780P15752J406135J233521
695.3F21282387J185379K44522k84805k72179r57527r21059m65317k88276J581154
704F21104279K700500J633225J035270j373o46057p04384n06630l66516l8262J548501
713.7F25758553J441230J206208J673927J019363Q69484J407166P23152r58748p60040
722.3F32380295o99806j37062J118774K031441L117180J539154M33158L89977j11160
731F40061951q5068r33037M0817J130486K1744O26754K307053K484894R60693k57797
740.7F46358490Q8959o63529j096649j146164j517334Q10394J260605J131516J723099
$$ y = [607654724, 606523094, 605751534, 606657524, 608019524, 609291573, 611009750, 612307091, 613800049, 615323219, 616814156, 617380905, 616917534, 616626549, 616602592, 617387199, 617926979, 618642731, 620048866, 621282387, 622467766, 622712288, 622427483, 622155304, 621197777, 620276718, 619811401, 619523125, 621104279, 623804779, 625438004, 626473274, 626471901, 625825844, 625121460, 624614830, 624248314, 624210052, 625758553, 627199783, 628405991, 630079918, 631099281, 631968765, 633375931, 634099083, 633140335, 632380295, 631680489, 631543427, 632662201, 634693642, 637810822, 639349976, 639783134, 640173111, 640061951, 639976883, 639043846, 639084663, 640215149, 640236893, 640863647, 643170700, 645655594, 646616287, 646358490, 646447449, 645783920, 644687271, 643541107, 642023773, 642834167, 644094772, 645226288, 646949387]
749.3F46949387L07083M41665L73230o41174k236252j913605k80532j039963r2392
758F41867447J317062K127152K351761J240921Q87451j14670j279221j875686k456894
766.7F44065323j955719O75049J947555J636658K308502J987686J034088K58179k72293
775.4F51685028j711426k463379j042709J43356P35016O19431J306839K060318K336197
784.1F53668671J673355j42136p86209j631241j830139p13043Q56399R09653J317596
792.7F53322906L110962L199845K061386r44901j474838j347732k366868j566390j754075
801.4F52240295p24868Q39233K731476L342590J437760K15377q50372j038132k443924
810.1F55749435k683029j384048j406098j55639K172851K930222J865539J642075J605988
$$ y = [646949387, 647256470, 647698135, 648071365, 647430191, 645193939, 643280334, 642999802, 641959839, 641867447, 643184509, 645311661, 647663422, 648904343, 649791794, 649677124, 648397903, 646522217, 644065323, 642109604, 642784653, 644732208, 646368866, 648677368, 650665054, 651699142, 651957321, 651685028, 649973602, 647510223, 646467514, 646610870, 647345886, 647965317, 649272156, 651332474, 653668671, 655342026, 655199890, 654413681, 652782440, 650952301, 650239258, 651095657, 652005310, 653322906, 656433868, 659633713, 661695099, 660750198, 659275360, 657927628, 655560760, 653994370, 652240295, 651515427, 652354660, 655086136, 658428726, 659866486, 660081863, 659231491, 658193359, 655749435, 653066406, 651682358, 650276260, 650120621, 652293472, 655223694, 657089233, 658731308, 660337296]
818.8F60337296J50680j904907j787872j101304j392974o0654R97620K273788K463531
827.5F59975204K671738K319336L03345M16870k84042N39093K27356p93763M42276
836.1F65817413R55124K742310K477188K735748K131348k39563n76935j339798j177063
844.8F73525772j282196o30722n19257Q02231K704544R75876L53851m8294n37262j059265
854.5F74285278j499786k055664j893921o2256K20184P63932J435089J377945k86560
863.1F72284241j110688l46221j432648j806030k095414j640167j39236J542511J632690
871.8F66889038m80423o11343k65503n90897r00497p39670j007614j281052j304779
880.5F59707260p50885R19342J28632O8969K78016n79224p27005j723480j651383j377945
$$ y = [660337296, 660487976, 658583069, 656795197, 655693893, 654300919, 654240265, 655237885, 657511673, 659975204, 662646942, 664966278, 665269623, 665686493, 665402451, 665941544, 666168900, 665375137, 665817413, 666772537, 669514847, 671992035, 674727783, 676859131, 676619568, 676042633, 674702835, 673525772, 672243576, 671612854, 671093597, 671895828, 674600372, 675576248, 675930099, 675881805, 675344543, 674285278, 672785492, 670729828, 668835907, 668773651, 668993835, 669757767, 671192856, 672570801, 672284241, 671173553, 670827332, 669394684, 667588654, 665493240, 663853073, 663713837, 665256348, 666889038, 666408615, 665797272, 665531769, 664940872, 664040375, 663300705, 662293091, 661012039, 659707260, 658956375, 659875717, 660004349, 660073318, 660351334, 659772110, 659045105, 657321625, 655670242, 654292297]
890.2F54292297l83834N48782N69839N45884K1896N10483M79202m55780j308060l53164
899.8F54467545O00051P26319J549225R70611Q03757J259689J453171J00479j015243
908.5F60915604o17981j273041r39560n48401M94919Q40225j82495J45569j3199l71475
918.1F58450165j300125j707154j370391j674119k093200j259995O41403M69742J88980
926.8F50345306P97654j01624j308746j646958k357635k797775k257843j891098j190415
935.5F37590866p15065m3907j55907j012764j307831k057685k133828k803497l062630
944.2F24297752k332077k091217j743660j720199o38733L17001l86390j467515k596931
952.8F11638031l815804m241523l157311k510528j944313j252022j118088o12984r98840
$$ y = [654292297, 653908463, 654457245, 655027084, 655572968, 655594864, 656105347, 656584549, 656128769, 654820709, 654467545, 655067596, 655793915, 657343140, 658313751, 659117508, 660377197, 661830368, 661930847, 660915604, 660297623, 659024582, 658085022, 657536621, 658031540, 658871765, 658689270, 658834839, 658821640, 658450165, 657150040, 655442886, 654072495, 652398376, 650305176, 649045181, 649686584, 650156326, 650345306, 651142960, 651041336, 649732590, 648085632, 645727997, 642930222, 640672379, 638781281, 637590866, 636875801, 636831894, 636675987, 635663223, 634355392, 632297707, 630163879, 627360382, 624297752, 621965675, 619874458, 618130798, 616410599, 615771866, 616088867, 615702477, 614234962, 611638031, 607822227, 603580704, 600423393, 597912865, 595968552, 594716530, 593598442, 592985458, 591986618]
961.5E91986618j390800j100846k121467l178330k824898j997680k212219k597542
969.2E74562836j239930K9221Q4152n05981j395722k320671k686996k599564l109207
977.9E60818138l323898k891693k279892k034073j860008j068726j196365k060967
985.6E44102516k804832l160553l528481l368034k695847k257499j956139j953468
993.3E22377663p12967l65868o18286j568375k710762j878776l039894l800049l344422
1002E04338264k610321j883621j816788j035194j637230j435203k052689k928925l126335
1010.7D85811958l200378j981545l115730k599716q91342n65605r28040j035118j065903
1019.4D70428581k101059j502456j777802j451721j259079j459694r98383o08329N64727
$$ y = [591986618, 590595818, 589494972, 587373505, 584195175, 581370277, 579372597, 577160378, 574562836, 573322906, 573352127, 573436279, 572930298, 571534576, 569213905, 566526909, 563927345, 560818138, 557494240, 554602547, 552322655, 550288582, 548428574, 547359848, 546163483, 544102516, 541297684, 538137131, 534608650, 531240616, 528544769, 526287270, 524331131, 522377663, 521664696, 521298828, 520680542, 519112167, 516401405, 514522629, 511482735, 507682686, 504338264, 501727943, 499844322, 498027534, 496992340, 495355110, 493919907, 491867218, 488938293, 485811958, 482611580, 480630035, 477514305, 474914589, 474023247, 473457642, 472529602, 471494484, 470428581, 468327522, 466825066, 465047264, 463595543, 462336464, 460876770, 459878387, 459270058, 459834785]
1028.1D59834785p05337j166077j684761r33342L51639K0828J08910j181107K99301
1036.7D54944839N55344R93157J450309K31819J051484K14157J20582j073532j331024
1045.4D57157135j164093j719322o39916j118049M91180M3297j537666p01600k80075
1054.1D50530891j210098j441192J48277J25732J61209j059150j44349J009560J108437
1062.8D49229317J762733L18642R73015k49291j57852Q37593N10407Q22982L83721
1071.5D54431267J804619J598777J750679N71747Q06275J636657Q393R65957M23775
1080.1D63998146J687622J941452J038551J264916J370811J879654Q9836N21088K87094
1088.8D74079170L88603J21956o87751P94639P57103J731300O55022m0207m05426p18612
$$ y = [459834785, 459129448, 457963371, 456278610, 455345268, 455696907, 455717735, 455826645, 454645538, 454944839, 455500183, 456493340, 457943649, 458175468, 459226952, 459441109, 459561691, 458488159, 457157135, 455993042, 454273720, 453633804, 452515755, 453006935, 453050232, 451512566, 450810966, 450530891, 449320793, 447879601, 448027878, 448153610, 448314819, 447255669, 447111320, 448120880, 449229317, 450992050, 451310692, 452283707, 452034416, 451876564, 452714157, 453224564, 454047546, 454431267, 456235886, 457834663, 459585342, 460157089, 460963364, 462600021, 462608414, 463574371, 463998146, 465685768, 467627220, 468665771, 469930687, 471301498, 473181152, 473270988, 473792076, 474079170, 474467773, 474589729, 473901978, 474696617, 475453720, 477185020, 477840042, 477799835, 477394409, 476675797]
1098.5D76675797M60891n64270o10084o16188L7918l60947N87998J543846l69835J39007
1108.1D76924133K64244J201172M64211n37186N12238J582451K741661K289085K828445
1116.8D88270454K069626K654267L244018J675377J383286Q48198Q41980J300163K371025
1125.5E04658394J799888J811333K554970K255669K744674J427994J336632J594848
1133.2E20184402K48490n88341j07384J380539K585182L032647J182785O83479N98106
1141.9E29199905J9799j75171j307717j090965q48999j79787J40038N52444O94809
1150.5E27004356L0938J207656K11564p92771r54285j242675p54853j079826k69546
1159.2E23360558Q79859J499749J270256K163238K406426J570434K102089J895943
$$ y = [476675797, 477136688, 476572418, 475962334, 475346146, 475384064, 475023117, 475611115, 477154961, 476785126, 476924133, 477188377, 478389549, 478853760, 478316574, 478828812, 480411263, 483152924, 485442009, 488270454, 490340080, 492994347, 496238365, 497913742, 499297028, 500145226, 500987206, 502287369, 504658394, 506458282, 508269615, 510824585, 513080254, 515824928, 517252922, 518589554, 520184402, 520432892, 519844551, 519737167, 521117706, 523702888, 526735535, 527918320, 528601799, 529199905, 529219704, 529044533, 527736816, 526645851, 525796852, 525617065, 525757103, 526309547, 527004356, 527035294, 528242950, 528454514, 527661743, 526707458, 525464783, 524709930, 523630104, 523360558, 524240417, 525740166, 527010422, 529173660, 531580086, 533150520, 535252609, 537148552]
1166.9E37148552K207031J817475K015953L603134L702469L566093L609390L320580
1174.6E60990677K753601K033920J616936J529503Q70247N96084J278572J690903K347870
1183.3E75708313L333817L205299K263183J422997Q11195O38581l54767o25954l46107
1192E86056557o00510l02429l36189m05045m87823m11683n18264j231842j376267j799278
1201.6E78587227j744232p45850l45917j0948J85471O2523m0741m4442j74598o35605
1211.3E75092888r52988r70764q92258r26246r59168p95021j3885M57306l86124q08830
1220.9E68844910q67348j083336j145630j121521q44307q26034r03931p62825J77727
1229.6E61467705J82228q57048n39246m86793p16706o56814n10826k06642k79999n6229
$$ y = [537148552, 539355583, 541173058, 543189011, 546792145, 550494614, 554060707, 557670097, 560990677, 563744278, 565778198, 567395134, 568924637, 569794884, 570390968, 571669540, 573360443, 575708313, 579042130, 582247429, 584510612, 585933609, 586744804, 587383385, 587028618, 586402664, 586056557, 585456047, 585153618, 584817429, 584412384, 583924561, 583512878, 582994614, 581762772, 580386505, 578587227, 576842995, 576097145, 575751228, 575740280, 575925751, 575988274, 575947533, 575903091, 575728493, 575092888, 574139900, 573169136, 572276878, 571350632, 570391464, 569596443, 569582558, 570039864, 569653740, 568844910, 567977562, 566894226, 565748596, 564627075, 563782768, 562956734, 562052803, 561289978, 561467705, 561649933, 560792885, 560253639, 559766846, 559050140, 558393326, 557882500, 557675858, 557395859, 557339630]
1239.3E57339630M60968N64079l20282r70916q79402r63555j184044q65707j30844
1247.9E53049927K09961N73578L40194J86425n9510m88319j60065n12276q42323p62901
1257.6E51534691m65088j47057N5733k2926o18973l67508j09863M0779p01828j171913
1267.2E48026047n00832o63757l04718l28827R4490Q99544P70035N74798M5014K01530
1276.9E48813324K21481J07460J297J12496O50177J009330J311112J455345J875954
1285.5E55557976J425133J066856R34715N93186N48057P61109J146965J188850J638985
1294.2E64861832J656494J924782J533775N16548O96793K19536p1488O1188k9411J63612
1303.9E71533661N51185L99704K17400J285324J088333k57263p96089j034203j190757
$$ y = [557339630, 557800598, 558364677, 558044395, 557073479, 556194077, 555230522, 554046478, 553180771, 553049927, 553259888, 553833466, 554173660, 554360085, 554300575, 553812256, 553652191, 553139915, 552297592, 551534691, 551069603, 550922546, 550978279, 550955353, 550336380, 549968872, 549859009, 549899788, 549197960, 548026047, 547525215, 546861458, 546556740, 546227913, 546322403, 547221947, 547991982, 548566780, 548611794, 548813324, 549034805, 549142265, 549143562, 549256058, 549906235, 550915565, 552226677, 553682022, 555557976, 556983109, 558049965, 558984680, 559577866, 560125923, 560887032, 562033997, 563222847, 564861832, 566518326, 568443108, 569976883, 570493431, 571190224, 571409760, 571338272, 571399460, 571370049, 571533661, 572084846, 572484550, 572701950, 573987274, 575075607, 574818344, 574022255, 572988052, 571797295]
1312.5E71797295q88596m68712k92320K88467Q99277J264916R37690L52516L44773
1321.2E74235306m2649j70097n4397L6735L8872J12495K59476K82783M28086K71683
1330.9E75398293k11182j066856j182786j054115r96399m99191n03502M13513J004868
1339.6E71302643P11822J152649R78165M57916k70576k42234k81181m80499r54N95131
1349.2E73922882M21105K19802Q22907M85992J755m09889p04765q01583j210861j199455
1358.8E71547890r31778m76647l1738M05769n05600q76541j2474p19833p97539j172981
1368.5E66428528j457634o41098n99404J89896O38657J277809N68504L14446R51271
1377.2E67670975L20396K44064N1346M44641O47164N38482J271668J735725K166405
$$ y = [571797295, 570908699, 570439987, 570147667, 570436134, 571335411, 572600327, 573538017, 573890533, 574235306, 574192657, 574022560, 573968163, 574004898, 574043770, 574156265, 574415741, 574698524, 575126610, 575398293, 575187111, 574120255, 572937469, 571883354, 570886955, 570387764, 569884262, 570297775, 571302643, 572014465, 573167114, 574145279, 574603195, 574332619, 574090385, 573809204, 573328705, 573327751, 573922882, 574343987, 574563789, 575386696, 575872688, 575874443, 575464554, 574759789, 573958206, 572747345, 571547890, 570616112, 570139465, 570107727, 570513496, 570007896, 569131355, 569118881, 568399048, 567601509, 566428528, 564970894, 564329796, 563730392, 563920288, 564558945, 565836754, 566405258, 566719704, 567670975, 567991371, 568235435, 568286781, 568731422, 569378586, 569917068, 571188736, 572924461, 575090866]
1385.8E75090866K603111K449646N72968N86853O57272O62842M57192R10530J770134
1394.5E85761414M16488O93779J184159J750869J82991n96618K67067q90541o88744
1403.2E88080864l52554n20363k7809O05316k01607r71718n36537j172600q79516j013718
1412.8E83009758r86176q12721m08516K05345r9105N44662j834106n5809P79914k64167
1422.5E80079079l17269k018470p56493Q1215k34451o8169L88145j29509j090812K42042
1432.1E76175308m28390o52657j65672m3297j340256j313972P73010j5068N78804K98271
1441.8E73866081k73018N5848j082573p94373o47621o9084j457367m7760J448745N55840
1451.4E71554718J265297Q65860J879692J501007J079865J570625N14831K732544r3116
$$ y = [575090866, 577693977, 580143623, 580716591, 581303444, 581960716, 582623558, 583080750, 583991280, 585761414, 586177902, 586871681, 588055840, 589806709, 589989700, 589393082, 589660149, 588769608, 588080864, 587728310, 587207947, 587180138, 587785454, 587583847, 586612129, 586075592, 584902992, 584023476, 583009758, 582023582, 581210861, 580802345, 581007690, 580908585, 581453247, 579619141, 579563332, 580343246, 580079079, 579761810, 577743340, 576986847, 577068062, 576833611, 576765442, 577153587, 577024078, 575933266, 576175308, 575746918, 575094261, 574928589, 574885292, 573545036, 572231064, 573004074, 572989006, 573567810, 573866081, 573593063, 573648911, 572566338, 571771965, 571124344, 571055260, 569597893, 569550133, 570998878, 571554718, 572820015, 573685875, 575565567, 577066574, 578146439, 579717064, 580231895, 582964439, 582871323]
1460.1E82871323J169548R32808J765480K586746R15565J962853J388969K504997J881180
1468.8E97979469K087708K915039L111038M671593L330841M675903K988205K547913
1476.5F24307709K281189K181205J373978R75685J533470N74418J211090J452064J440392
1485.2F37331200J552963J034737M19158Q05054n78689l241730j179619r43108j261863
1493.8F33938103j117592n82085k524185O0577q49151m579773j532631k805481l652458
1502.5F16355324l022881j637153j027451n525627l212433j262855M00428j946296
1510.2E99121056r79577j056480k372703K81105l0899L30085P25174P71942L419342
1518.9F00209045L337403K560730J591491K510796K798042K572289J380577K93007
$$ y = [582871323, 584040871, 584973679, 586739159, 589325905, 590241470, 592204323, 593593292, 596098289, 597979469, 600067177, 602982216, 606093254, 610764847, 614095688, 618771591, 621759796, 624307709, 626588898, 628770103, 630144081, 631119766, 632653236, 633227654, 634438744, 635890808, 637331200, 638884163, 639918900, 640338058, 641143112, 640564423, 637322693, 636143074, 635199966, 633938103, 632820511, 632238426, 629714241, 629774818, 628925667, 624345894, 622813263, 620007782, 616355324, 613332443, 611695290, 610667839, 605142212, 601929779, 600666924, 601067352, 599121056, 598141479, 597084999, 594712296, 594993401, 594962502, 595292587, 596017761, 596789703, 600209045, 603546448, 606107178, 607698669, 610209465, 613007507, 615579796, 616960373, 617253380]
1526.6F17253380K480774K014045J683083K721558K321739K928734K270507J740075
1534.3F35413895K367515J722412J793328K107544K668228J26190J567764Q62046J300735
1543F49929657K021713j220j590348K76413J93863K07214L73078m59519L28598J031342
1552.7F52310791R05685j303100m47922J725006K653122j428375l549118m037857p96662
1561.4F46031570Q69141J38092k55203j740418j295547p34329j107788M27246o091194
1570F36241570k749634j236420k436829j767501r88923K00730r097138k470741k933845
1578.7F12761269m169159l901024m972191l826332m723396l008156m433747m068107
1586.4E79659157l678589l959389k407760l823052k132835l203316j684341j719971
$$ y = [617253380, 619734154, 621748199, 623431282, 626152840, 628474579, 631403313, 633673820, 635413895, 637781410, 639503822, 641297150, 643404694, 646072922, 646199112, 647766876, 648628922, 649929657, 651951370, 651950150, 650359802, 650636215, 650830078, 651037292, 651410370, 650950851, 651279449, 652310791, 653216476, 651913376, 651465454, 653190460, 655843582, 654415207, 650866089, 646828232, 646031570, 646900711, 647038803, 646783600, 645043182, 643747635, 643013306, 641905518, 642332764, 636241570, 633491936, 632255516, 629818687, 628051186, 627062263, 627262993, 618165855, 615695114, 612761269, 608592110, 604691086, 599718895, 595892563, 591169167, 588161011, 583727264, 579659157, 575980568, 572021179, 569613419, 565790367, 563657532, 560454216, 558769875, 557049904]
1594.1E57049904j720123p21245k315483p35169k272415q95958j749229k216454j577492
1602.8E42846336k746734j029091j855202l60947j461334M2992K2049j187172K88238
1611.5E34559135j612396n4321j317177K77481K34909k434044K127724R8610J242561
1620.2E33122482j29699J728019J361962k179871K41928K22283J900291l00636P05070
1628.9E36671829J258469J742363J839104O70471J887169J304283M61540m73747K140007
1637.5E47501488J067390J154709J701050Q29201J903114N70259K047195K378464J159439
1646.2E60312309J088066j745605J861992J454925K439995L127098P55272q70056K387161
1654.9E70811157K664032J243668J475639J157150J345139J458282J567460K168998
$$ y = [557049904, 555329781, 554608536, 552293053, 551557884, 549285469, 548389511, 546640282, 544423828, 542846336, 540099602, 539070511, 537215309, 536854362, 535393028, 535436020, 535458069, 534270897, 534559135, 532946739, 532892418, 531575241, 531852722, 532087631, 529653587, 531781311, 531879921, 533122482, 532992783, 534720802, 536082764, 533902893, 534144821, 534367104, 536267395, 535966759, 536671829, 537930298, 539672661, 541511765, 542182236, 544069405, 545373688, 545835228, 545361481, 547501488, 548568878, 549723587, 551424637, 552253838, 554156952, 554727211, 556774406, 559152870, 560312309, 561400375, 559654770, 561516762, 562971687, 565411682, 568538780, 569294052, 568423996, 570811157, 573475189, 574718857, 576194496, 577351646, 578696785, 580155067, 581722527, 583891525]
1662.6E83891525J552201L015518K615928J958466K180290L341255K312928R81598
1670.3F01849709K621307J533317K886811L535995L068962K245484K993698K973556
1678F23708839K596131K412529Q26454J782799L027229M160690n54237J348686L450279
1686.7F42759399K856064J862641K301178J740265O24694J414872J128463J829148
1694.4F56516724K394943q17871K212066L259507M034881M23737m351731K541886J945267
1703.1F68159409N30853j102677M51050m69742L24250J152496K98843n46722m22211
1711.8F68375549l90472n34134j304703k216186J025619J776657m442138j538163J01166
1720.5F60853195M01230N7144o48269j419449j088181p69653r15604m66156q2626m49524
$$ y = [583891525, 585443726, 588459244, 591075172, 593033638, 595213928, 598555183, 600868111, 601849709, 604471016, 606004333, 608891144, 612427139, 615496101, 617741585, 620735283, 623708839, 626304970, 628717499, 629543953, 631326752, 634353981, 638514671, 637960434, 639309120, 642759399, 645615463, 647478104, 649779282, 651519547, 652144241, 653559113, 654687576, 656516724, 658911667, 658093796, 660305862, 663565369, 667600250, 668023987, 663672256, 666214142, 668159409, 668690262, 667587585, 668038635, 667568893, 667893143, 669045639, 669344482, 668797760, 668375549, 667985077, 667450943, 666146240, 663930054, 664955673, 666732330, 662290192, 660752029, 660853195, 661254425, 661311569, 660663300, 659243851, 658155670, 657386017, 656470413, 656004257, 655921631, 655472107]
1730.1F55472107K47040J963348K492371o38733m310227Q02308J265869l16544N48325
1738.8F57525864R65576j082993J785660K223282J810608J571350J534576J656342
1746.5F67990265J200027K196198Q78982K551728L052215K41547K869644L180542L625870
1755.2F87787018L345947K091827K520524K551498L125076L547516L004303J816406
1762.9G09790115K897797L346100L480530L363571K823486J499024K070922L602753
1770.6G32874298K311783L03421j4877K908859K658462N52216K077560J446457J802063
1779.3G46920242J397629n00107M84009Q92716R82055J23673R55276J776352J561966
1788G54593811P16934J135864J372986K27661r36889j215820J668548J037369N1575
$$ y = [655472107, 655719147, 657682495, 660174866, 659536133, 655225906, 656028214, 657294083, 656977539, 657525864, 658491440, 657408447, 659194107, 661417389, 663227997, 664799347, 666333923, 667990265, 669190292, 671386490, 672265472, 674817200, 677869415, 678110962, 680980606, 684161148, 687787018, 691132965, 693224792, 695745316, 698296814, 701421890, 704969406, 707973709, 709790115, 712687912, 716034012, 719514542, 722878113, 725701599, 727200623, 729271545, 732874298, 735186081, 735489502, 735474625, 738383484, 741041946, 741594162, 743671722, 745118179, 746920242, 748317871, 747817764, 748301773, 749194489, 750176544, 750300217, 751255493, 753031845, 754593811, 755310745, 756446609, 757819595, 758047256, 757110367, 755894547, 757563095, 758600464, 758652039]
1796.7G58652039J063079J332322J342239L12500J381226j37253k50321Q45490J77841
1805.3G64719162N21164M84238J041870J077499J483841J54419R0485J212616l2349
1814G70752945M28467l8224j15661o5231O23626J633835R94492J217346K12707N77393
1823.7G76221695O88934j997070o52161O27137J201019J173019q03299Q2703J627808
1832.3G78169785O58187j56860J46942K42081j64490j141205j80893j28250K31095
1841G77676392P36312J450196J490783k430648P29217J308823j55411j172485r30176
1849.7G78703003r7199j29547P94373N18646Q43125P90557K73972K20566q01392o99310
1859.3G80416794q28476k67944m84696m0131P01066O36520J635132O79550P82013l26538
$$ y = [758652039, 759715118, 761047440, 762389679, 762702179, 764083405, 763946152, 763695831, 764541321, 764719162, 765240326, 765724564, 766766434, 767843933, 769327774, 769482193, 769572678, 770785294, 770752945, 771181412, 771143188, 771027527, 770962296, 771585922, 773219757, 774214249, 775431595, 775644302, 776221695, 776910629, 774913559, 774261398, 774888535, 776089554, 777262573, 776459274, 776541977, 778169785, 778827972, 778671112, 778818054, 779060135, 778895645, 777754440, 777573547, 777445297, 777676392, 778412704, 779862900, 781353683, 778923035, 779652252, 780961075, 780805664, 779633179, 778703003, 778605804, 778476257, 779270630, 779789276, 780632401, 781422958, 781696930, 781917496, 781116104, 780416794, 779588318, 779320374, 778835678, 778795547, 779496613, 780133133, 781768265, 782447815, 783229828, 782903290]
1869G82903290j772385m03213q13065k97089J5641L92379N10636O19888P20749P75147
1878.6G82651978L64379o00738l96805j112366r36737o16150o1874O36444N55878J520080
1888.3G82004089O56739k53983M81644J42288j012650q70361m03519q88824J82266
1896.9G80037689M70886Q56019O73599N06973P16553m08936m19845q29926p42340o96793
1906.6G80163879l26004M77143L53012O99081J40457P75147L04642k442k19803j104126
1916.2G81260986K57111j229706j107254M71191P34711J287613J81198k45437K68554
1924.9G81878967K97241n51910p95975r00497q03604K24457N71365N80597J50757O89163
1934.6G81340561L90854j57318j51062p95746n33295p30286j46789k05994m20456P94297
$$ y = [782903290, 781130905, 780727692, 779914627, 779617538, 779633179, 780025558, 780536194, 781156082, 781876831, 782651978, 783016357, 782415619, 782018814, 780906448, 779969711, 779353561, 779291687, 779928131, 780484009, 782004089, 782660828, 782406845, 782888489, 783030777, 782018127, 781147766, 780744247, 779855423, 780037689, 780508575, 781364594, 782038193, 782545166, 783261719, 782852783, 782432938, 781603012, 780860672, 780163879, 779837875, 780315018, 780668030, 781367111, 781507568, 782282715, 782587357, 782584915, 782365112, 781260986, 781518097, 780288391, 779181137, 779652328, 780387039, 781674652, 781855850, 781610413, 781878967, 782176208, 781624298, 780828323, 779927826, 779124222, 779348679, 779920044, 780500641, 780651398, 781340561, 781731415, 781574097, 781423035, 780627289, 780093994, 779363708, 779216919, 779010925, 778590469, 779384766]
1944.2G79384766O53762L58506p9880o8359k48719m85000q57163q28399j20545J01166
1953.8G77810135N72281L27606L37830K49710J7242j47781m19998k60544q18405m42505
1963.5G77225571p2327M07715M18472l99475K24152J30539O10k55966k72827m50058
1973.1G76956406q28400k52991J35346O65970O12335N24063j64108l80631j42670p65991
1982.8G76359329m04205m09393j5183J60904R5825K64664P172P10678K57110r59015
1992.4G76067886j015930j27029q7509o02875K5024J03073L12577N17959N02396K47803
2002.1G75943375k46582m82483n75943l59726o90460m96064k35824J18484N17426N74875
2011.7G74067078O07299l81546n42526m35638o50025o77337l42408J01243J44500M91028
$$ y = [779384766, 780038528, 780397034, 780317154, 780248795, 780000076, 779515076, 778657913, 777829514, 777708969, 777810135, 778382416, 778710022, 779047852, 779297562, 779314804, 779167023, 778747025, 778486481, 777668076, 777225571, 777153244, 777560959, 777979431, 777579956, 777804108, 777934647, 777935257, 777679291, 777406464, 776956406, 776128006, 775875015, 776010361, 776676331, 777288666, 777812729, 777648621, 777267990, 777125320, 776359329, 775955124, 775545731, 775530548, 775691452, 775787277, 776051941, 776059113, 776769791, 777026901, 776067886, 775051956, 774924927, 774837418, 774234543, 774259567, 774362640, 774675217, 775193176, 775695572, 775943375, 775696793, 775214310, 774638367, 774278641, 773588181, 773092117, 772856293, 772974777, 773492203, 774067078, 774674377, 774292831, 773750305, 773314667, 772664642, 771987305, 771644897, 771746140, 771890640, 772381668]
2021.3G72381668J20545K66723L18985r0637l61633j075669o10962l11737j55868J54800
2031G70636215L50952L98789J08719R3994K3498M2878l96653m32434p86819p51877
2040.6G69287262j07956j52359O21109N66101M37393J84708k44141k33001p05948m23966
2050.3G69229202o05468m82789j83639K95486N42145L27683Q63800J76391r5367l64075
2059.9G69703369m71496k77558r18503m56848r2697L05710P03201Q76084K72293j62125
2069.6G69481430P9117n77088m30297m76990n35889m03290J72959Q96988L28750M34037
2079.2G68969727L58276J34048j73721m04129m82941o64520l39355l00904K95563M30298
2088.9G67822342Q11539O95572j70289J19629k37198o61163j215515p96509m1199J27259
$$ y = [772381668, 772502213, 772768936, 773087921, 772997284, 772635651, 771559982, 770949020, 770637283, 770481415, 770636215, 770987167, 771385956, 771494675, 771588669, 771612167, 771655045, 771258392, 770825958, 770039139, 769287262, 769179306, 769026947, 769648056, 770214157, 770651550, 770836258, 770592117, 770359116, 769653168, 769229202, 768623734, 768140945, 767957306, 768252792, 768794937, 769122620, 769986420, 770162811, 770067444, 769703369, 769231873, 768954315, 768035812, 767578964, 767486267, 767791977, 768495178, 769371262, 769643555, 769481430, 769560547, 768983459, 768553162, 768076172, 767540283, 767136993, 767309952, 768206940, 768535690, 768969727, 769328003, 769462051, 769288330, 768884201, 768401260, 767736740, 767397385, 767096481, 767392044, 767822342, 768633881, 769329453, 769159164, 769278793, 769041595, 768380432, 767164917, 766368408, 766327209, 766454468]
2098.5G66454468N97458N08194M73480K78778L04489n49698p46155q4304k22092j4877
2108.1G66999741o65512k0524O51398J92871K84806M59518M16718p25785q53805p19452
2117.8G66019974m66080o4697K07901P30667J9073J88828K59704j27105r842K3880
2127.4G66782303m35181r49936k25906j72501L72925P70569L84064K95181p0267Q4839
2137.1G66836090j80054j53122p64923j017608J4114M77219N99365J51749P46765N12085
2146.7G67221680j77918J32675n89218q99200o40564n32608j83792P09381P14340O34689
2156.4G66389465P14798J16883K22778n18265q10547n50995n57403j50681o1569L45612
2166G65140076M50210N27420N32456N65948K08664m95987o68182q70209k34680j00479
$$ y = [766454468, 767051926, 767560120, 768033600, 768312378, 768616867, 768067169, 767321014, 767236710, 767014618, 766999741, 766334229, 766313705, 766965103, 767157974, 767442780, 767902298, 768319016, 767593231, 766739426, 766019974, 765553894, 765489197, 765697098, 766427765, 766446838, 766635666, 766895370, 766768265, 766758423, 766782303, 766347122, 765397186, 765171280, 764998779, 765371704, 766142273, 766526337, 766821518, 766751251, 766836090, 766656036, 766502914, 765737991, 764720383, 764734497, 765211716, 765811081, 765962830, 766709595, 767221680, 767043762, 767176437, 766587219, 765688019, 765047455, 764514847, 764331055, 765040436, 765754776, 766389465, 767104263, 767221146, 767443924, 766925659, 766115112, 765564117, 765006714, 764856033, 764794464, 765140076, 765590286, 766117706, 766650162, 767216110, 767424774, 766928787, 766260605, 765390396, 765155716, 765055237]
2175.6G65055237J39923O89087O36215P05185K42157J71509j28174n76401p05490m48761
2185.3G65780487j36871m26407K55279Q49762O49567O05240O82144J2741m66995l42865
2194.9G67462082p87048o90995n80978n2490O32858O49567O98776O85196N83038k80609
2204.6G68319397n96924m77753n07049n18799m32968J7929Q6594N90820Q05130N96237
2214.2G67882614k9983m95682k87018m08859m10767r65957l61023M17862N38330Q79058
2223.9G66758575L35770K08817j3123K83356n2414r36127o51474o15463j18790L19138
2233.5G65518265O37817K57111K64892N77164l35007k91900l82233m63409m12369k67334
2243.2G65102997M55627N26886K04315m1046K87628K46430Q8348k05383m44717n67170
$$ y = [765055237, 765195160, 765884247, 766520462, 767225647, 767467804, 767639313, 767511139, 766934738, 766229248, 765780487, 765643616, 765217209, 765472488, 766322250, 766971817, 767577057, 768259201, 768271942, 767804947, 767462082, 766675034, 765984039, 765403061, 765350571, 765983429, 766632996, 767331772, 768016968, 768600006, 768319397, 767722473, 767244720, 766737671, 766218872, 765785904, 765803833, 765890427, 766481247, 767286377, 767882614, 767852631, 767356949, 767069931, 766661072, 766250305, 765284348, 764923325, 765341187, 765879517, 766758575, 767094345, 767303162, 767290039, 767573395, 767520981, 766584854, 765933380, 765317917, 765199127, 765518265, 766156082, 766413193, 766678085, 767255249, 766920242, 766628342, 766246109, 765782700, 765370331, 765102997, 765558624, 766085510, 766289825, 766248779, 766536407, 766782837, 766871185, 766665802, 766221085, 765653915]
2252.8G65653915p13119j7166N7144N85403O79169M14658N75103l02505l32413k05765
2262.4G66394424k94265o61316o85120r1705J29318M94309L54309L03192k2049k58713
2272.1G65662384l99246k48566K65656k1897l66974q30230L93219O60934J10779P50198
2281.7G65976257j89132k96860l52326m56848k25296m92782m3030J46942M64935K59323
2291.4G64791183M68293N72509j23214j55945j80206j33515o68640j44806L81317p9345
2301G64727631j23597o6833L64151K50778M82636j08567o36291K05688K1286K51923
2310.7G65368805L53775K90222L17459j04446k0294K8991K88697M23202O1264l128
2320.3G67004547N2567l72925O4087M75158M79279P33109L9596N9433N6381n3024k59781
$$ y = [765653915, 764940796, 764923630, 764980774, 765566177, 766245346, 766660004, 767235107, 766932602, 766600189, 766394424, 766100159, 765438843, 764753723, 764662018, 764791336, 765285645, 765639954, 765943146, 765921097, 765662384, 765263138, 765014572, 765280228, 765258331, 764891357, 764061127, 764454346, 765115280, 765226059, 765976257, 765787125, 765490265, 765137939, 764681091, 764455795, 763963013, 763919983, 764066925, 764531860, 764791183, 765259476, 765831985, 765708771, 765552826, 765372620, 765239105, 764570465, 764425659, 764806976, 764727631, 764604034, 764537201, 764901352, 765152130, 765634766, 765526199, 764889908, 765095596, 765116882, 765368805, 765722580, 766012802, 766330261, 766225815, 766205521, 766234512, 766523209, 766946411, 767007675, 767004547, 767057114, 766684189, 766748276, 767223434, 767702713, 768435822, 768475418, 768534851, 768591232, 768538208, 768278427]
2330.9G68278427j004028o27289N9204N85327Q0796J85928N01022J95236M8523m24041
2340.6G67879105l46299j044311j004257K50473K27661m196j79749p42493J3581O20498
2350.2G65670013j47171N47028M23431j24435L36761Q04291J735993m9134J450501
2358.9G70647278N27649k210541N569N875j029434j675339n94635o64368k63061P65533
2368.5G65514526r29031q06274j04676o91604j178208q23135r45969q93860l12347
2377.2G58829422k99683l68957m52347l357l14255n79605m94385r45739q74939p61948
2386.8G53734207m63714l84751J88828O18667K59705M75082J21613j62125o86340p10602
2396.5G52990570j58157o76575p41501k79388M03671O43539O56968J63269n67932k18430
$$ y = [768278427, 767274399, 766647110, 766706314, 767291641, 767372437, 767558365, 768059387, 768254623, 768303146, 767879105, 767532806, 766488495, 765484238, 765734711, 765962372, 765958176, 765778427, 765035934, 765049515, 765670013, 765522842, 766069870, 766493301, 766368866, 766705627, 767509918, 769245911, 769196777, 770647278, 771174927, 768964386, 768969955, 768975830, 767946396, 766271057, 765676422, 765012054, 764748993, 765514526, 764585495, 763779221, 763674545, 762982941, 761804733, 760981598, 760035629, 759141769, 758829422, 758529739, 758160782, 757708435, 757705078, 757390823, 756811218, 756316833, 755371094, 754496155, 753734207, 753270493, 752885742, 753074570, 753693237, 753952942, 754428024, 754549637, 754387512, 753701172, 752990570, 752832413, 752155838, 751414337, 751134949, 751538620, 752182159, 752839127, 753002396, 752434464, 752216034]
2406.1G52216034m82941p74383p14569p83005k44370L10746K22778K68936M26712j42746
2415.8G50303192m13437n43899n57480m36325k38571j62812p19680l04108K64511M04663
2425.4G47596054M37470K19345r1172m97207l49427o15844o25458l26920n39703m67071
2435.1G44740067K9907M94003J77994P4005K518m75083o92215m37545l39356o16455
2444.7G42957840j01624J87149J76468R5063J21154J68381m13055n39551p61337m61121
2454.3G41429367n7144j35040j4725k22931K5635L15933K28577j74332k52991m41284
2464G40701065q93326m73633k31781l585K9373L4027N7144j71356j84097j66016o2332
2474.6G38635483o63223o22941k77023j99966J37481q621J48010k15988k66342L128
$$ y = [752216034, 751733093, 750958710, 750244141, 749461136, 749216766, 749527512, 749750290, 750019226, 750445938, 750303192, 749889755, 749345856, 748788376, 748352051, 748113480, 747950668, 747230988, 746926880, 747191391, 747596054, 748033524, 748252869, 748161697, 747664490, 747315063, 746699219, 746073761, 745746841, 745207138, 744740067, 744769974, 745263977, 745441971, 745515976, 745518494, 745043411, 744351196, 743913651, 743574295, 742957840, 742856216, 743043365, 743219833, 743314896, 743436050, 743604431, 743191376, 742651825, 741890488, 741429367, 741372223, 741237183, 741222458, 740999527, 741025162, 741341095, 741569672, 741395340, 741142349, 740701065, 739807739, 739334106, 739102325, 739098740, 739128113, 739162140, 739219284, 739047928, 738863831, 738697815, 738635483, 737972260, 737349319, 737072296, 736872330, 737009811, 737001190, 737149200, 736933212, 736666870, 736669998]
2484.2G36669998l66897m32129m13056m27551n16968j26953J18103K83661J52130o9351
2493.9G34870987j26114q32977k22626j01471q43964m66766J18103K37961j64566O5918
2503.5G32534485Q3313P095j69678m61502k83584o36521o62155m51126K9755P1945
2513.2G30062027k33841M5700L05328K92740m79202m02679k82288n32913m35944n47256
2522.8G27791672k0981K15683K12707r5901j20316K29035j79444m97207p53784o36368
2532.5G26145096m31900j831K34375K0904K09961K15836J09024k93427m57840n70755
2542.1G25179443m97360l21121n49393k10647j40076J08108L16849J95694J39313l44544
2551.7G23876266o15310o50559k89459l79181k95944K00882J26419M16107K02942l89938
$$ y = [736669998, 736303101, 735870972, 735457916, 735030365, 734513397, 734386444, 734504547, 734788208, 734940338, 734870987, 734744873, 733911896, 733689270, 733587799, 732743835, 732277069, 732395172, 732633133, 732468567, 732534485, 732617798, 732624893, 732455215, 731993713, 731710129, 731073608, 730411453, 729960327, 729990082, 730062027, 729828186, 729873886, 730179214, 730471954, 729992752, 729590073, 729307785, 728774872, 728338928, 727791672, 727770691, 727986374, 728199081, 728103180, 727982864, 728211899, 728032455, 727535248, 726781464, 726145096, 725713196, 725711365, 725945740, 725966644, 726176605, 726392441, 726501465, 726208038, 725750198, 725179443, 724682083, 724360962, 723811569, 723600922, 723460846, 723568954, 723885803, 724081497, 724220810, 723876266, 723260956, 722610397, 722320938, 721941757, 721645813, 721846695, 721973114, 722389221, 722592163, 722202225]
2561.4G22202225k22473j01471o94580p70264l12958j48926k2506j96991j16120J76087
2571G19792023N01251J18408l47900k19193q55789q57468l21121Q164j03684m12521
2580.7G17302170m2877J81427L21579Q7432k20413o47278n78308k24685o41098k33002
2590.3G15304947Q7280K71607L24554K1820K05155k27890o15311o97632o88171l01590
2600G13684769k00119m47464k8763K81296o4850K46734K58179m5013m54712p44171
2609.6G12485886p24640n64881j27258n80139q9340O09970L01208L82386L662n64499
2619.3G11132355q15125l88031m41894p14722l79257l58353K365K21100J64566o5613
2628.9G08357391j75094l06854n23072n22079p05719j69525J18789K14920O028n26047
$$ y = [722202225, 721979752, 721878281, 721183701, 720413437, 720100479, 719951553, 719929047, 719732056, 719615936, 719792023, 720293274, 720411682, 720063782, 719844589, 718988800, 718131332, 717810211, 717818375, 717714691, 717302170, 717259293, 717440720, 717762299, 717849731, 717629318, 716982040, 716403732, 716179047, 715537949, 715304947, 715392227, 715663834, 715988388, 716010208, 716215363, 715987473, 715372162, 714674530, 713986359, 713684769, 713484650, 713037186, 713008423, 713289719, 713224869, 713471603, 713729782, 713684769, 713230057, 712485886, 711761246, 711196365, 711069107, 710488968, 710399628, 711009598, 711310806, 711693192, 711696854, 711132355, 710317230, 709929199, 709487305, 708772583, 708393326, 708034973, 708037338, 708258438, 708423004, 708357391, 708182297, 707875443, 707352371, 706830292, 706124573, 705955048, 706073837, 706288757, 706294785, 705768738]
2638.5G05768738j01776j450j13220m18015o02722o27746n86014N6534J82724J70059
2648.2G03727112o87k71530j99585o7749M6234o7596n44281r15299l73840l29819m00619
2658.8G00602341L08609L90548L1510j66779k14691l71323m15954k67182l28521o44684
2668.4F98923874k53677N2337m12597R2620K18811j08947k36283k50854Q1405n47943
2678.1F97558746m30984m4251o65893o61545j21918J80817k1210l77426m29687o3248
2687.7F94923401l16239o98471m73861m6158J76849l56903l35922j81046p4463K1821
2697.4F92639008n26581p70264m56848K0599k94189k73819q4915j10474O7902k81220
2707F89929199j35269k52457k59475k18277m42887n07126p86666r9564L1662p1869
$$ y = [705768738, 705666962, 705665512, 705552292, 705134277, 704531555, 703903809, 703317795, 703374329, 703557053, 703727112, 703726425, 703454895, 703255310, 703187561, 703233795, 703166199, 702621918, 701706619, 701332779, 701002960, 700602341, 700910950, 701301498, 701333008, 701166229, 700951538, 700580215, 700164261, 699897079, 699568558, 698923874, 698670197, 698722534, 698309937, 698402557, 698621368, 698512421, 698276138, 698025284, 698106689, 697558746, 697127762, 697083511, 696417618, 695756073, 695634155, 695814972, 695793762, 695416336, 694986649, 694923401, 694607162, 693908691, 693434830, 693388672, 693565521, 693208618, 692872696, 692691650, 692617187, 692639008, 692112427, 691342163, 690885315, 690905914, 690611725, 690337906, 690252991, 690142517, 690210419, 689929199, 689793930, 689541473, 689281998, 689063721, 688620834, 688113708, 687327042, 687227478, 687259140, 687187271]
2716.6F87187271p4844l82538q1787j66702k45972j75247O790m26636m99344j22604
2726.3F85018387n38712j59988N5847R8114O7444l5935k14614q84552m51889r8954
2735.9F82855148k36587j79672L05786M23126j07117N4932j02768n86548o96106j59759
2745.6F81570435J09481J18790J44730k88163l4866p9956j984k5329m03214k08740
2755.2F80901184m76379l68500j54038P7973j01624m94613j86768k72980J06202K41928
2764.9F79272385j40076l67813o93665l67355P8354Q2855k07367l79028k69776j57775
2774.5F76850739j97297M4022k4567p50732q30994m78210j43280j72043l5400J57928
2784.2F74420166j68610j86233j29318J31073m46854j113586m86985o54831p74002
$$ y = [687187271, 687112427, 686729889, 686648102, 686481400, 686235428, 686060181, 686066971, 685640335, 685140991, 685018387, 684479675, 684319687, 684375534, 684473648, 684541092, 684505157, 684290543, 683405991, 682954102, 682855148, 682618561, 682438889, 682744675, 683167801, 683060684, 683115616, 683012848, 682426300, 681730194, 681570435, 681679916, 681798706, 681943436, 681655273, 681620407, 681540451, 681538467, 681513138, 681109924, 680901184, 680424805, 680056305, 679902267, 679980240, 679878616, 679384003, 679197235, 678924255, 679030457, 679272385, 679132309, 678764496, 678070831, 677703476, 677781830, 677864685, 677657318, 677278290, 677008514, 676850739, 676653442, 676697464, 676672897, 675922165, 675091171, 674612961, 674469681, 674297638, 674262238, 674420166, 674251556, 674065323, 673936005, 674067078, 673620224, 672506638, 672019653, 671364822, 670590820]
2792.8F70590820O3706J58920j16119k64969n82352m12369o72455q70895m31442o84509
2802.5F66778336m91028m68216n16892k96859m16260M0741k03018p36771r96399o29654
2812.1F62063980l32413j166153p22580k28042l65982l22113q30841q58460o84356
2820.8F56553040o55060o19126j106033j364517j054306r57947p36313m76456m98428
2829.5F49084854n83191q42895j050034j468735j415176j123734j027221n11933o56280
2838.2F40405655r63249j084786j377449j152801q89435j186371j504822j234588j121025
2846.8F29891129j420212j272621q37784r26781j048698j022416q91075o26945r38378
2855.5F20906219q07266o81991o73600j42669j27564n04493j073266r04769q38967
$$ y = [670590820, 670654526, 670813446, 670697327, 670432358, 669850006, 669437637, 668765182, 667894287, 667462845, 666778336, 666287308, 665819092, 665302200, 665005341, 664589081, 664629822, 664426804, 663690033, 662693634, 662063980, 661731567, 660565414, 659842834, 659614792, 659248810, 658926697, 658095856, 657237396, 656553040, 655897980, 655278854, 654172821, 652808304, 651753998, 650796051, 650059738, 649583282, 649084854, 648501663, 647658768, 646608734, 645139999, 643724823, 642601089, 641573868, 641061935, 640405655, 639442406, 638357620, 636980171, 635827370, 634937935, 633751564, 632246742, 631012154, 629891129, 628470917, 627198296, 626360512, 625433731, 624385033, 623362617, 622471542, 621844597, 620906219, 620098953, 619416962, 618743362, 618600693, 618473129, 617968636, 616895370, 615990601, 615151634]
2864.2F15151634q05168k68249q90503j336365j119766n95093m36897o65093n74837
2872.9F08459663q47625q31108r30520p44056m66233p17353o55060p26280m86412j92147
2882.5F01862869n25970r00727k37350K32468o09284r43336q07152o12145m51087j82992
2892.2E96825294q8081m16069o35033p13844j03111k07062n92346n36614p96432n58968
2901.8E92177734l72429j90048l66478m78058O4583o599k76222r0638j73950j013832
2911.4E89274063r39293m49905n29862n57670o68221j76735k32658p10259m50935l5095
2921.1E84523430J14670m62571q64524l23677M16450N989l89747J96037L93333K78816
2930.7E83888206J12725k29531k90069L30047K08207j69525K32162L05099Q03452J251869
$$ y = [615151634, 614346466, 614078217, 613187714, 611851349, 610731583, 610136490, 609699593, 609034500, 608459663, 607612038, 606780930, 605850410, 605106354, 604640121, 603922768, 603267708, 602541428, 602055016, 601862869, 601336899, 600436172, 600198822, 600431290, 599822006, 598878670, 598071518, 597459373, 597008286, 596825294, 596737213, 596321144, 595686111, 594972267, 594869156, 594662094, 594069748, 593533134, 592736702, 592177734, 591805305, 591615257, 591248779, 590770721, 590835304, 590828705, 590552483, 590461845, 590287895, 589274063, 588334770, 587884865, 587355003, 586797333, 586129112, 585952377, 585719719, 585009460, 584558525, 584523430, 584638100, 584175529, 583311005, 582987328, 583403778, 583409767, 583020020, 583216057, 583609390, 583888206, 584000931, 583771400, 583481331, 583811378, 584019585, 583850060, 584082222, 584387321, 585190773, 586442642]
2940.4E86442642J203346R01986L49006O29883Q55484M16412M55361R98039J154442
2949.1E93406601J180115J180610J074219Q67653O37665O66122J83296J37902M02488
2957.7E99736671L40500P27806R79653Q93822N09948N71862R20410R84382P43409N64651
2967.4F06973114Q21571M96216N94979J222229J332244J080475R95064R37119N61218
2976.1F15014229R47723R22280P03163N42412J67427Q68949P37229M54140Q13789P07207
2985.7F21878548Q06160O23436J08451N1423L02352R5635J99623N06935P8850k7428
2995.3F24623985K95906L27530q6937l25737j07536K04582J08834m03290l58467K0713
3005F24299583N9739r5406o3286K38877K63671k55088n46112n27955k99873n1346n55038
$$ y = [586442642, 587645988, 588547974, 588896980, 589526863, 590382347, 590798759, 591254120, 592252159, 593406601, 594586716, 595767326, 596841545, 597709198, 598346863, 599012985, 599196281, 599334183, 599736671, 600077171, 600804977, 601784630, 602678452, 603188400, 603760262, 604680672, 605665054, 606408463, 606973114, 607794685, 608290901, 608885880, 610108109, 611440353, 612520828, 613515892, 614453011, 615014229, 615961952, 616884232, 617587395, 618129807, 618297234, 619166183, 619903412, 620357552, 621171341, 621878548, 622684708, 623308144, 623416595, 623468018, 623770370, 623866005, 624065628, 624572563, 624651413, 624623985, 624919891, 625247421, 625160484, 624834747, 624727211, 624931793, 625040627, 624637337, 624278870, 624299583, 624359322, 624263916, 624200630, 624439507, 624703178, 624448090, 623901978, 623374023, 623074150, 623022804, 622467766]
3015.6F22467766l25279Q5220o43730p21054j76659k78702l91235K54097l03192j209679
3025.2F18757553r02367p96470k22588J59340o8016m91371q09021k63863l19061q05168
3034.9F14238968q33702k56348r4032p80869o76803k04773k43683o03447p04117m00390
3044.5F09440804m05732q67233q39844l30352l31116m44336p62825r15718n21660o60439
3054.2F03361549n36880k4376q46939j359291n50156n81970n56793l81279o27480j48353
3063.8E97748032j24321m39682o94962j106987q66432n23148m41627m22211m86984
3072.5E92641678o63986p76596o30722K8419k1629r75304j030464n41992m67758p41272
3082.1E86820374j61973R9640r34295r43909m30107n58510n64613l40653q26606j137047
$$ y = [622467766, 622142487, 622227707, 621583977, 620862923, 620686264, 620407562, 620016327, 620270424, 619967232, 618757553, 617855186, 617058716, 616836128, 616995468, 616927452, 616436081, 615627060, 615363197, 615044136, 614238968, 613405266, 613148918, 613054886, 612274017, 611597214, 611392441, 611148758, 610545311, 609841194, 609440804, 609035072, 608167839, 607327995, 606997643, 606666527, 606222191, 605459366, 604543648, 604021988, 603361549, 602824669, 602800293, 601953354, 600594063, 600043907, 599461937, 598905144, 598523865, 597896385, 597748032, 597623711, 597184029, 596489067, 595382080, 594515648, 593992500, 593550873, 593128662, 592641678, 591977692, 591201096, 590570374, 590598793, 590577164, 589601860, 588571396, 588029404, 587561646, 586820374, 586658401, 586758041, 585823746, 584879837, 584449730, 583891220, 583326607, 582985954, 582159348, 581022301]
3091.8E81022301q02651p28988k34986j86538o70624p53823l5667L61710q15049j442833
3101.4E75712852j110076o41556p14531o34194k66800l71131k04544j043511j238136
3110.1E69488373m53568l32565j82800q95043r56268k90260n35012n47638m79621q69141
3119.8E63946457o46019m35715j029205j078987r06525p60612o17485p92351q05893
3128.4E56873665m12178k55089p01485n27763j046448j202011m07867p11022m76036
3137.1E51133766n03616p40776o75698p65495p75337j074677m61006l65143r47799
3145.8E44824219r39904p73353p51953o67877k16752n20019p87392q03413p12929q56285
3155.4E37794342j050339m21257q33931r51996o87103r40666p43256n39703k87476
$$ y = [581022301, 580219650, 579490662, 579255676, 579069138, 578398514, 577644691, 577609024, 577970734, 577155685, 575712852, 574602776, 573961220, 573246689, 572612495, 572345695, 571974564, 571770020, 570726509, 569488373, 569034805, 568702240, 568519440, 567624397, 566668129, 566377869, 565842857, 565295219, 564815598, 563946457, 563300438, 562864723, 561835518, 560756531, 559850006, 559089394, 558471909, 557679558, 556873665, 556461487, 556206398, 555504913, 554977150, 553930702, 552728691, 552320824, 551609802, 551133766, 550630150, 549889374, 549213676, 548448181, 547672844, 546598167, 546137161, 545772018, 544824219, 543884315, 543110962, 542359009, 541691132, 541474380, 540954361, 540166969, 539363556, 538650627, 537794342, 536744003, 536322746, 535488815, 534536819, 533849716, 532909050, 532165794, 531626091, 531338615]
3164.1E31338615p31735r52377q80547j030388p63893q35037j017303n50461j20583
3172.8E24456291q75664j113243p14531o37168m37241p04041p68356q25577j030502
3181.5E17349968j082726p55767m29917n22728l50570m44146m86106j030388j118012
3190.1E11129608m79660n88760n60150j060791q87948k42576m46892n79872p40967
3198.8E05541992p13920j055222j035423p65305p13310n42870o16645m74625p09763
3207.5D98914909r64126q54225m61312l41034o12831m66995o03981o82678p72438q11882
3217.2D92343407o53458o88667o27480n61828m97208r93614j207009r16824m77333
3225.8D85719986j08261n97000j046677r24530j26381n7754l51601q1940p81746j327133
$$ y = [531338615, 530606880, 529654503, 528773956, 527743568, 526979675, 526144638, 525127335, 524576874, 524456291, 523580627, 522467384, 521752853, 521115685, 520678444, 519974403, 519206047, 518380470, 517349968, 516267242, 515511475, 515081558, 514558830, 514208260, 513764114, 513278008, 512247620, 511129608, 510649948, 510061188, 509501038, 508440247, 507552299, 507309723, 506862831, 506282959, 505541992, 504828072, 503772850, 502737427, 501972122, 501258812, 500715942, 500099297, 499624672, 498914909, 497950783, 497096558, 496635246, 496294212, 495681381, 495214386, 494610405, 493927727, 493155289, 492343407, 491689949, 491001282, 490373802, 489811974, 489314766, 488321152, 487114143, 486197319, 485719986, 485611725, 485014725, 483968048, 483043518, 482917137, 482859383, 482507782, 482425842, 481644096, 480316963]
3235.5D80316963q33320l58277q08754r43374o56090n33257N0774l23830n09720k62146
3245.1D75138969q37936j087646p85294n01900j166649j071167j58157l14064k01836
3253.8D69014320K10190l70064j077652p39364m43611q05016p64542n34133n04113
3262.5D63986015m26483k14996q4915m97246p91206n79987p91588l78647p6675q55980
3272.1D59288292o79855n49088n37338k63481m49295m03748o45828l84407j38207r54055
3281.8D54282990r95713n41878n98220k76795J07880k96402o11420n39017k86178j35079
3291.4D50110168m43153o19354k82288l30887j035804o93627k03247l47404r1057l58009
3301D45705338n64232m06075m62341m41132n46150m60701m0436k52495p28416l70750
$$ y = [480316963, 479483643, 479125366, 478316612, 477373238, 476717148, 476183891, 476234665, 475910835, 475401115, 475138969, 474301033, 473213387, 472428093, 471926193, 470759544, 469688377, 469530220, 469216156, 469014320, 469224510, 468854446, 467776794, 467037430, 466593819, 465788803, 465024261, 464490128, 463986015, 463559532, 463344536, 463259621, 462762375, 461971169, 461391182, 460599594, 460220947, 460144272, 459288292, 458608437, 458059349, 457522011, 457258530, 456809235, 456405487, 455759659, 455375252, 455237045, 454282990, 453287277, 452745399, 452147179, 451870384, 451978264, 451681862, 451070442, 450531425, 450245247, 450110168, 449667015, 449047661, 448765373, 448434486, 447398682, 446705055, 446501808, 446154404, 446063347, 445705338, 445141106, 444735031, 444272690, 443831558, 443285408, 442824707, 442784271, 442531776, 441803360, 441432610]
3310.7D41432610o50750j039772l02734j5564m55589p40319n68542m92897o78406j105804
3320.3D35382233p35588L62968k59895j101570l63694J16120p39250j309090q35190
3329D30517044k99301p9346m82750m42199k17019m20417n97115q04558o37397m74167
3338.7D26062775j64338m69512n90859J29891m08555q80355p16744p25288p46460m33350
3348.3D21057205J80626p7057n86891m81224l06473m44031j60980k60925r15337m80308
3357.9D17524605j35689o06346o72035M1656j76468p91855l43818m0283j3657j64032
3367.6D14622078j92185p53402j019898p2212J88675l11851r06983k79961l4370l02315
3377.2D10937576M63181l11127q46557j99395l51181p04078l21045K28347J0949r8191
$$ y = [441432610, 440781860, 439742088, 439439354, 439423790, 438968201, 438227882, 437659340, 437166443, 436488037, 435382233, 434646645, 435009613, 434749718, 433648148, 433284454, 433400574, 432661324, 431352234, 430517044, 430217743, 430138397, 429655647, 429213448, 428996429, 428576012, 427978897, 427174339, 426536942, 426062775, 425898437, 425428925, 424838066, 424967957, 424559402, 423679047, 422962303, 422237015, 421490555, 421057205, 421237831, 421160774, 420573883, 420092659, 419786186, 419342155, 419181175, 418920250, 418004913, 417524605, 417388916, 416782570, 416110535, 416152191, 415975723, 415183868, 414840050, 414799767, 414786110, 414622078, 414429893, 413676491, 412656593, 412584381, 412773056, 412461205, 411554222, 411274261, 411239891, 410937576, 411400757, 411089630, 410243073, 410043678, 409692497, 408988419, 408667374, 408895721, 408906670, 408808479]
3386.9D08808479k62413n9738k04620o00548J67313J67503k70538l67928j8768K02560
3396.5D07561302o21948m07486J22490k75230m58909k52113l17726j90849M2762n99517
3406.2D04602776n04532K36244L58925M19807K24190M0588l22227n82161J72577K52228
3415.8D04898415l02697o6261K81334M44260J46751l31001l78838M8676N80940J08643
3425.5D05430222j18218l9329k96631L81164N42488j03340k08320j37978L01933O65818
3435.1D06417809O39381K64053l08838K77024K38266l92609M38500M32052J48468L80364
3444.7D08534470N26580P70760n0926r9869K65045M70123P83158L69720L34931M60167
3454.4D12364159L45153J13183L90014Q24890P15370M69513K63329O19278L28331q5793
$$ y = [408808479, 408546066, 408486328, 408281708, 407681160, 407848473, 408015976, 407745438, 407377510, 407358742, 407561302, 406939354, 406531868, 406654358, 406379128, 405920219, 405668106, 405350380, 405159531, 405202293, 404602776, 404098244, 404334488, 404693413, 405113220, 405337410, 405377998, 405055771, 404473610, 404646187, 404898415, 404595718, 404529457, 404810791, 405255051, 405401802, 405070801, 404691963, 404740639, 405321579, 405430222, 405312004, 405272675, 404976044, 405357208, 405899696, 405796356, 405588036, 405450058, 405751991, 406417809, 407057190, 407321243, 407012405, 407289429, 407527695, 407135086, 407573586, 408005638, 408154106, 408534470, 409061050, 409831810, 409780884, 409681015, 409946060, 410416183, 411199341, 411569061, 411903992, 412364159, 412709312, 412822495, 413212509, 414037399, 414752769, 415222282, 415485611, 416104889, 416433220, 416347427]
3464D16347427K04544P84607J000672M16908N26009M44908N69801O00739K61573P41196
3473.7D21898384O03981K93999K08092N00679P87544P19604Q19207R50393P66068R6817
3483.3D27644768Q31680Q24928N19181P94639j22032O15654J021538M16412N04265
3492D33051033P82318J041947O62307P66106L15552K86560J542587J539345P27119
3500.7D40714874P10602J018829O72837M41589K11067K14539O97822J455079R40933
3509.4D47078171L4981J593704J163215O4888P73774R40322R59130R15375Q42819Q15086
3519D55181465Q38509P89909J302834J112747K25258R83772J237602J429405N81055
3527.7D63682556j38092J019478J509170Q95806L66859J059265J331330K161789J173134
$$ y = [416347427, 416551971, 417336578, 418337250, 418754158, 419280167, 419725075, 420294876, 420895615, 421157188, 421898384, 422502365, 422796364, 423004456, 423505135, 424292679, 425012283, 425831490, 426781883, 427547951, 427644768, 428476448, 429301376, 429820557, 430615196, 430493164, 431108818, 432130356, 432546768, 433051033, 433833351, 434875298, 435537605, 436303711, 436619263, 436905823, 438448410, 439987755, 440714874, 441425476, 442444305, 443117142, 443558731, 443769798, 443984337, 444682159, 446137238, 447078171, 447113152, 448706856, 449870071, 449934959, 450708733, 451649055, 452608185, 453523560, 454366379, 455181465, 456019974, 456809883, 458112717, 459225464, 459450722, 460434494, 461672096, 463101501, 463682556, 463544464, 464563942, 466073112, 466968918, 467335777, 468395042, 469726372, 471888161, 473061295]
3536.4D73061295p02057J265335J633644Q33359N46341J283035J760597J722260J338348
3545D82742157m5548J528664P73468O90613J601372J534614K324868q7700O71081J677818
3554.7D93411407J441536J738854N26695J550293J413193O97365N45845J919822K126007
3563.4E05371017Q45986L937111K637558K93312N02052j167450J895333J661109J306229
3572E17282257J919899K190514J262779Q24051J827736R82094J955947K134514J513558
3580.7E31893349J416320J499787J732826O79894L459014L702050Q58764J188355j615486
3589.4E44814873J518516K504540K447738J714020J047631L318138n80178J007614
3597.1E57792892L262024R51271K891427K332611Q41522J334114J168404J450691K735786
$$ y = [473061295, 472359238, 473624573, 475258217, 476091576, 476637917, 477920952, 479681549, 481403809, 482742157, 482696609, 484225273, 484998741, 485689354, 487290726, 488825340, 491150208, 491062508, 491733589, 493411407, 494852943, 496591797, 497118492, 498668785, 500081978, 500779343, 501325188, 503245010, 505371017, 506217003, 510154114, 512791672, 513084984, 513587036, 512419586, 514314919, 515976028, 517282257, 519202156, 521392670, 522655449, 523479500, 525307236, 526289330, 528245277, 530379791, 531893349, 533309669, 534809456, 536542282, 537222176, 540681190, 544383240, 545242004, 546430359, 544814873, 546333389, 548837929, 551285667, 552999687, 554047318, 557365456, 556785278, 557792892, 561054916, 562006187, 564897614, 567230225, 568071747, 569405861, 570574265, 572024956, 574760742]
3605.8E74760742K984467j5068K835388O08826j104088N345497K383957r86481L558197
3614.5E90371437K5063J974220M850731J960029J057778K90375Q86955K933082K418366
3623.1F06768036J527099J970673K451553K450333N375252L651504o442566K197495
3630.9F19949379K563477L926925L149834j131935J523475K785759K893792J244010
3638.6F36904716N12848K482605K878762J893997P51953J831284L485565N568924J648407
3647.3F57959061j996079N317459K976303k56729k940826J715622L657913M454422
3655F70887146O903381m641647o96716M234695J728363J856461M27475J367569J385955
3663.6F83452682K108613K199096Q28858M342727L250275J67541K251587l840789l31040
$$ y = [574760742, 577745209, 577730141, 580565529, 581174355, 580070267, 585415764, 587799721, 586813240, 590371437, 590396500, 592370720, 597221451, 599181480, 600239258, 600529633, 601416588, 604349670, 606768036, 608295135, 610265808, 612717361, 615167694, 620542946, 624194450, 617751884, 619949379, 622512856, 626439781, 629589615, 628457680, 629981155, 632766914, 635660706, 636904716, 637417564, 639900169, 642778931, 644672928, 645424881, 647256165, 650741730, 656310654, 657959061, 655962982, 661280441, 664256744, 664000015, 661059189, 662774811, 666432724, 670887146, 677790527, 673148880, 672452164, 676686859, 678415222, 680271683, 680699158, 682066727, 683452682, 685561295, 687760391, 688589249, 692931976, 696182251, 696349792, 698601379, 694760590, 694429550]
3672.3F94429550N765610Q883209M543457j4079132k068176N217361M285584j620026
3680G05357437p33414J375275J100845J538468J219635J52435K140198N682602l671265
3688.7G14162216l839798O545181k438659k179871K894821L76511J256790R42307l13034
3697.4G17406464R6130k60315J678772L310089j794281l150635K393418J638183L40729
3706.1G21658554K24991J334915L460007n050507K274246O309205j1793976l7537K985001
3714.8G21364899P18689J181335J658478O73675k788925M55017M490509j341705l728332
3723.4G22683640K987365J022873l94363j969605n89828K251739M65622M792938L27759
3732.1G31578140o813659N312805K491836n532074k239914r4146j318665J126480M169998
$$ y = [694429550, 700195160, 709078369, 713621826, 699542694, 697474518, 702691879, 706977463, 705357437, 704624023, 705999298, 707100143, 708638611, 709858246, 710010681, 712150879, 717833481, 714162216, 710322418, 716867599, 714428940, 712249069, 715143890, 715520401, 716777191, 717719498, 717406464, 717502594, 717242279, 718921051, 722231140, 720436859, 717286224, 719679642, 721317825, 721658554, 721883545, 723218460, 726678467, 721627960, 723902206, 730211411, 718417435, 718379898, 721364899, 722083588, 723264923, 724923401, 725597076, 722808151, 723263168, 727753677, 726411972, 722683640, 725671005, 726693878, 726299515, 724329910, 723740082, 725991821, 726457443, 731250381, 731578140, 724764481, 730077286, 732569122, 727037048, 724797134, 724702988, 723384323, 724510803, 728680801]
3740.8G28680801j812057J455002J0840301r14001j7438278M856414K787171L357315
3748.5G31812668j954804p897262Q963241k346649o888504K883835K308121K837982
3756.2G29718628l968201J198578N728989m448471l421326J451187P94754j15356L019790
3764.9G29958572q93402m639969K154160M334488K383880o984252j138459K288208
3772.6G27463226q7661K42919l47824P63626O70243J802597J599960n139465m1351
3781.3G26926270P33871K27814J849594j842423j250076J53198J8845R96780K44446
3790G28058319O5155j23367m3106j66779J069489K848053k051545l638992M12522L177108
3799.6G29606857N555039l811264p681046J210785N89142L484878N649949o172257
$$ y = [728680801, 726868744, 728323746, 739164047, 738250046, 720811768, 725668182, 728455353, 731812668, 729857864, 721960602, 730923843, 728577194, 721688690, 724572525, 726880646, 729718628, 725750427, 726949005, 732677994, 728229523, 724808197, 726259384, 727054138, 726938782, 729958572, 729065170, 724425201, 726579361, 730913849, 733297729, 726313477, 725175018, 727463226, 727375565, 727618484, 727270660, 728034286, 728704529, 730507126, 732107086, 726967621, 726926270, 727660141, 727887955, 729737549, 727895126, 726645050, 726798248, 726817093, 727813873, 728058319, 728123474, 728000107, 727957001, 727790222, 728859711, 731707764, 729656219, 726017227, 726429749, 729606857, 735161896, 731350632, 723669586, 724880371, 725469513, 728954391, 734604340, 728432083]
3807.3G28432083n453415K858353J750259K31095l7461k96554J054916M893341J320725
3816G34753342j1210633J581879L566589L710785N079422j1627502k082977K978057
3823.7G26748962P51267K047195J028519l469009o50330P23801J123047J209487m937896
3832.4G24575043J857300N721359m404984j590271O687546m061584m214097N682755
3840.1G30253067m447708j904144N091018j093750l381576J141205J009140M27322
3847.8G27094574J664734j224594M89502N292053k464600L329621j0920945l798370
3855.6G19461975P011719r17816j535492J351776J641998L189926l560028j011352
3863.3G25632706N644455k894211n765381J392746K907486N567551j114350q442077
$$ y = [728432083, 722978668, 725837021, 727587280, 727818375, 727780914, 727484360, 728539276, 733432617, 734753342, 723542709, 725124588, 728691177, 732401962, 737481384, 725853882, 723770905, 726748962, 727500229, 729547424, 730575943, 727106934, 726456604, 727180405, 728303452, 729512939, 724575043, 726432343, 732153702, 727748718, 726158447, 732845993, 728784409, 724570312, 730253067, 725805359, 723901215, 728992233, 727898483, 724516907, 725658112, 726667252, 727094574, 728759308, 727534714, 728024216, 733316269, 730851669, 734181290, 723260345, 719461975, 726473694, 725555878, 724020386, 725372162, 727014160, 730204086, 726644058, 725632706, 731277161, 728382950, 722617569, 724010315, 726917801, 732485352, 731371002, 722928925]
3871G22928925q545L499755L466721p018814j352234K531586K12555J858825L560410
3879.7G29679184k966995n359192M033127N96237M76456M804687r136353r33990K607422
3888.3G23800583M74167L768387J412429o406631j221771K108459o41556O84891L15781
3897G24294739J448440K515412o460495L388061K053299l639831L843307l562851k742843
3905.7G21137238N20477L65143J195984l12272m61196n09034L39661L42255j66550
3914.4G22451706R08356K860336j180954m212875K374954k00577l217621J388092J304245
3923.1G22475662J889115k10267k802124K46583J166610J293106p60879q39615K198105
3931.7G24656296j310196k283707L93448n58777R53446J558303m93621o70243j190414
$$ y = [722928925, 722920380, 726420135, 729886856, 722868042, 721515808, 724047394, 724259949, 726118774, 729679184, 726712189, 721352997, 725386124, 725982361, 726458817, 731263504, 722127151, 721193161, 723800583, 724274750, 728043137, 729455566, 723048935, 721827164, 723935623, 723294067, 723978958, 724294739, 725743179, 728258591, 721798096, 725186157, 727239456, 723599625, 727442932, 723880081, 721137238, 721657715, 722022858, 723218842, 722906570, 722445374, 721936340, 722276001, 722618256, 722451706, 723360062, 726220398, 725039444, 720826569, 723201523, 723000946, 719783325, 721171417, 722475662, 724364777, 724154510, 721352386, 721598969, 722765579, 724058685, 723297806, 722458191, 724656296, 723346100, 721062393, 721455841, 720897064, 721850510, 723408813, 722915192, 722244949, 721054535]
3940.4G21054535M15878J491623k939758p59201J569748L99170P95059j186752L58123
3949.1G21198425O12412k210236P95670P66830n43136m19770n41458J10321K49939
3957.8G20018997P40814l03955n4016P31735n64804n15594m55399m76684J63116R30710
3967.4G20214920J015015L74756n13382p30439r03930m61579J236267l5476j270600
3976.1G18925552n01251j54266J05362M4021N98603M97970J55945k3270q9264l06854
3985.7G19252548q95996o62308p14035M54026O49032O2485N77850J49460M15878k98614
3995.4G18990326o74362K5558j3733J52512m6158
4000.2G18434143
$$ y = [721054535, 721470413, 722962036, 720022278, 719263077, 720832825, 721231995, 722027054, 720840302, 721198425, 721810837, 719600601, 720396271, 721163101, 720619965, 720200195, 719658737, 719769058, 720018997, 720759811, 720455856, 720401840, 721133575, 720568771, 720053177, 719597778, 719121094, 719284210, 720214920, 721229935, 721604691, 721091309, 720360870, 719456940, 718995361, 720231628, 720196152, 718925552, 718424301, 718270035, 718375397, 718419418, 719018021, 719515991, 719671936, 719648666, 719559402, 719252548, 718356552, 717694244, 716980209, 717434235, 718083267, 718145752, 718723602, 718873062, 719288940, 718990326, 718315964, 718341522, 718327789, 718480301, 718434143]
##END=$$ End of the data block
