##TITLE=$$ Begin of the data block
##JCAMP-DX=5.00 $$ ACD/SpecManager v 10.08
##SPECTROMETER/DATA SYSTEM=Varian
##DATE=21 Jan 2013 15:22:50
##DATA TYPE=INFRARED SPECTRUM
##DATA CLASS=XYDATA
##ORIGIN=
##OWNER=
##NPOINTS=3735
##FIRSTX=399.26403809
##LASTX=4000.35498047
##MAXX=4000.35498047
##MINX=399.26403809
##MAXY=78.22734833
##MINY=28.17646790
##XFACTOR=1.0000000000
##YFACTOR=0.000000100000000
##FIRSTY=51.69946289
##DELTAX=0.96440572
##XUNITS=1/CM
##YUNITS=TRANSMITTANCE
##XYDATA=(X++(Y..Y))
399.3 516994629 500569992 506619110 520245514 508719139 507570877 524538918 524743805 524769096
407 524769096 529845047 523013039 522678680 526833000 520243340 520288849 523997765 515028610 510385208
415.7 510385208 520519066 524579239 524393463 520291824 500241508 497647095 501470222 509410782
423.4 509410782 507649155 501668930 507535400 512551575 512029724 507142296 503333969 504347000 503486252
432.1 503486252 503438568 505116196 503210869 501135597 501653099 500275574 502701149 506648026 505605736
440.7 505605736 502270622 497246017 495973930 498860664 501686363 503052444 506325760 511241379
448.4 511241379 509703865 501729317 496224442 496676216 495640259 493752937 495458794 499084396 499570847
457.1 499570847 491973839 493525772 494712601 494926224 500218124 500122643 496794281 494830170 494290924
465.8 494290924 497078438 499793930 499684219 497013969 493967285 493559189 494344635 491510391 490088997
474.5 490088997 492192497 493982658 491743393 487735596 486455345 490522575 493638458 493005676 494673386
483.2 494673386 492674179 486633186 485838966 489264412 494106483 496434441 494446259 491729851 491059990
491.8 491059990 490121956 486912613 484122849 483515358 484859543 486173744 486744957 487252960 488484879
500.5 488484879 487178154 482749290 480223236 478089142 477475929 477855721 479176483 482248039 485081711
509.2 485081711 484140587 480699120 480832481 480016975 476975403 475840988 477569160 477667847 474459114
517.9 474459114 475853043 477328453 477250595 478287430 477502480 474924088 473085022 471726799 469412766
526.6 469412766 469134064 469590111 470774269 472156868 472760010 472695847 471602364 471295700 471067696
535.2 471067696 473151588 473639412 471980476 473431511 474561768 475687637 475310555 474825058 475404968
543.9 475404968 473669930 471157837 470295677 471688576 470407372 469166107 470184784 470062714 469032364
552.6 469032364 467148285 467273941 466243973 464200058 464039917 464123650 463551712 462557869 462666054
561.3 462666054 462541008 464026299 465479088 465687752 465425034 463898468 463931808 464435349 465938225
570 465938225 466441231 466706772 469265709 470364189 469638634 467648163 466575089 465726128 464865189
578.6 464865189 465503006 465332642 465992851 467682228 469224434 469498024 468129730 466443062 464596481
587.3 464596481 463227921 462959862 463823929 464787560 466353111 467147789 467067947 467404366 467911186 468407555
597 468407555 467398872 466297607 466759529 468340378 469622993 469898758 470081902 469471016 467699471
605.6 467699471 466879768 467402267 465957985 464501381 464884491 464967079 466273499 467439346 468318100
614.3 468318100 469449425 468678017 466817589 465678253 465560989 465444603 466083031 468183975 470532722
623 470532722 471566734 473438911 476069489 475760117 475178947 475823174 476298141 477029991 478727570
631.7 478727570 479819756 480013847 482021141 484389610 485520554 485774269 485400581 485082703 485042381
640.4 485042381 486173973 487839088 489023018 490174751 492318726 494886665 495763969 494186935 493011208
649 493011208 493690529 493584251 493974075 496348572 497902641 497866249 497740097 498044014 497933426 497167320
658.7 497167320 496291771 495203934 494360275 494484062 495007210 495530624 497687912 500777473 501552505
667.4 501552505 495545158 496320648 497154045 497774315 498887978 499897118 502301064 504809723 507742996
676.1 507742996 511348763 513674545 514545670 514300499 514658737 515248718 515609322 517197418 520048485
684.7 520048485 523306236 525793343 526954994 527152481 527814903 527943039 527089119 527565422 528064575
693.4 528064575 528018379 529303780 531364059 533154907 533915138 533363380 532911301 533197670 532901077
702.1 532901077 532203255 532568665 533181686 534269447 536886444 539147377 540130882 540336647 540427856
710.8 540427856 541514091 542042351 540898018 540106239 541114082 543216171 544713554 545902252 548118248
719.5 548118248 549974518 550025673 549185257 548483276 548525505 549016113 550474968 552645950 554553909
728.1 554553909 556715889 558741760 559697952 559864540 559831657 559340515 558365822 557918282 560084343
736.8 560084343 563072472 564005470 565537605 566970711 567202606 567192230 566279221 564975166 563936806
745.5 563936806 564449959 565157280 566663933 568843079 569763107 570510979 570174294 569645958 568274345
754.2 568274345 565882416 563747597 563108444 564769058 565403519 566034470 566744308 567336998 568262596
762.8 568262596 567575150 566571159 565812378 565669746 565212059 565384865 566913948 568649406 570280304
771.5 570280304 570596008 570643158 569823265 569747543 569150276 566685562 566430664 567214813 568674278 570591850
781.2 570591850 572921257 574299431 573802643 574093666 573849678 573488998 573251038 573368797 574428520
789.9 574428520 576239891 578290329 579223633 580875740 582106667 581431656 579389648 577562714 576507912
798.5 576507912 575891724 576021347 575688438 576959457 578962288 579437141 578795166 577588806 576310844
807.2 576310844 574124908 572832489 572128067 571607323 572134781 573273087 574982376 576331367 576343155
815.9 576343155 574834290 573827667 573290138 573872643 575140305 575515633 576515770 577503777 579656715
824.6 579656715 581740036 582677078 583557281 583033562 582289925 582276382 583365288 585083618 587682838
833.3 587682838 589604073 591179581 594880638 597323456 598333702 598080482 596337891 595055389 595703468
841.9 595703468 597415810 597978439 599100304 600943527 601909485 601102676 599654503 598544273 597455406
850.6 597455406 595814247 593568077 593151550 593866463 594309769 593837929 593612328 593611565 592697792 592108498
860.3 592108498 589588394 586998215 586047211 585613594 585637550 585573845 586597214 587130623 586585274 584972649
869.9 584972649 583060684 581908035 580508804 579399261 578512268 578706017 579772797 580720749 580812225
878.6 580812225 579826965 578665009 577037697 575435829 574006691 572940102 571955299 572039795 572621727
887.3 572621727 572025223 571420975 570158806 568891640 567847710 566408081 564799309 563650055 563703499
895.9 563703499 564081955 564851952 565921860 568179512 570445595 571180496 571531715 571312828 570885735
904.6 570885735 570481110 571233444 572141953 573363838 574820938 574976845 575602760 574721947 572959518
913.3 572959518 571352425 569959373 569042358 567150879 566778107 566912651 566811218 566671371 565081024
922 565081024 563343201 561678886 559836464 557520866 555558662 554267998 553089638 552325211 551796532
930.7 551796532 550820656 549238396 547354851 544516563 541619225 539008675 536326981 533725586 531455040
939.3 531455040 530116196 528612556 526881180 524736481 521820831 519077721 516562958 513365784
947.1 513365784 509326477 506612549 504967232 503231430 501659088 499334946 496634178 493907890
954.8 493907890 491096001 487695656 483833008 481025314 478358536 475417900 472904854 471633911
962.5 471633911 470917740 468447952 465827904 463674164 461347237 458844986 456197281 454187698 451778603
971.2 451778603 449683647 448184776 446316299 444112625 441884918 439334908 435773048 432034912
978.9 432034912 427926445 424748917 421601868 417600441 414760628 412256317 410367622 407461967
986.6 407461967 404331665 401676483 398027802 394787979 391816139 389940453 387842140 385772629
994.3 385772629 384259186 382362633 380310173 377543793 375237885 372400970 369670181 367344284
1002 367344284 365148392 362680740 359648323 358101997 356225548 353932915 350850754 347959785 345482559
1010.7 345482559 342364044 339785995 336712608 334747734 332775040 331410866 330254021 328467636
1018.4 328467636 327390289 325288277 323874512 322147446 320747986 319243965 317820225 317463646
1026.1 317463646 316648350 316456718 314905396 314616489 314727573 314142990 313468380 312237644 312389278
1034.8 312389278 311415558 311391029 311729946 312912102 314491959 314635849 315423336 314999599 314421616
1043.5 314421616 313353214 313330650 312538223 311056557 311308117 310784225 310757523 309255562 308691082
1052.2 308691082 307707424 306099606 305794506 304643154 304774761 304284248 305022354 304741058 304782295
1060.9 304782295 306434593 306704483 308001099 307633038 308003292 308818588 310234299 311417904 311324615
1069.5 311324615 313042965 314497128 316546459 317100658 317612228 318251324 318888321 320030899 320020599
1078.2 320020599 321657944 323128815 326248169 328163490 328891602 330728340 331229706 332827454 333517570
1086.9 333517570 334160118 333870811 333878555 335074310 335083694 335815659 336083946 337206993 337335091 336583900
1096.5 336583900 336363258 336654091 337330856 336327629 336258469 336373787 336637535 336556625 337022209 338461685
1106.2 338461685 339095306 339706268 338758736 338931808 339715424 340727882 342523384 344984131 348579826
1114.9 348579826 350831375 353193169 355276146 358021622 360043907 361028290 363111649 365234413
1122.6 365234413 368312759 370460587 373108559 376532135 379428825 381254539 382207069 384727898
1130.3 384727898 386697502 387910194 389043617 390917854 392587624 393587532 395090179 395535812 396325226
1139 396325226 396504402 396107712 396038284 395750122 396183891 396972542 397850647 397585945 397145996 396921082
1148.6 396921082 397415924 398212662 397899857 397484779 396313972 395652275 395267105 395422440 395952873
1157.3 395952873 396291542 397625656 398030853 398458099 398928261 399949532 401548004 402701454 404970169
1166 404970169 408008003 411658134 415342407 419487877 423520355 427005692 430140762 433407135 437520447
1174.6 437520447 440989723 444253883 447834511 451532974 455299454 459111557 462069931 464283600
1182.4 464283600 466395645 467707443 468465843 468945732 470004959 471257324 472352409 473239365 473561134
1191 473561134 473652496 472882767 471815567 470486870 469013138 467506218 465692215 464567223 463757362
1199.7 463757362 462951431 461845551 460873337 460426521 459774437 458858109 457079468 455510597 454614487
1208.4 454614487 454153862 454129066 453879623 453687439 453445435 453098869 452010727 451023178 449748917
1217.1 449748917 447906036 447137413 446276054 445682297 445289993 444966164 444632988 443842850 443164635
1225.8 443164635 441814613 440743370 439334488 438128014 437731781 437247162 437565002 437665901 438089409
1234.4 438089409 438234253 437691879 437102089 436447906 436233444 435829582 435974464 436087341 436166763 436253395
1244.1 436253395 436189232 436552467 436322632 435686340 434656677 434034729 433537636 432646980 432183037 432356682
1253.7 432356682 432842140 432351990 431904335 431376686 430641479 429730606 428404198 427699928 426954422
1262.4 426954422 426688461 426522446 426701279 426618233 426182365 426560745 426226387 425916634 425634880 425645981
1272 425645981 425644226 425774841 426890602 427485847 427886963 428061523 428607979 428966103 429171906 429545059
1281.7 429545059 429616508 430712700 432020111 433599548 435315552 437483330 439547844 440805969 442144623
1290.4 442144623 443090668 444241142 445521164 447249870 448898430 450473289 452276192 453842163
1298.1 453842163 455300865 455518723 455923195 456705513 457037926 457151413 456790581 456483765 456537628 457338791
1307.7 457338791 457767754 457912178 458189812 457976990 457403221 456607056 456004066 455274849 455229950 455695915
1317.4 455695915 456320572 457316513 458034744 458881416 459135399 459232407 459537392 459945259 460420876 460985374
1327 460985374 461844292 462437286 463115044 463307915 463265038 462953720 462427673 462157478 461532936 461474800
1336.7 461474800 461898842 462762947 463550301 464536667 465743523 465614014 465382462 465547943 465814323
1345.3 465814323 465569801 465404167 465695572 465783920 466055832 465959969 465672722 465222092 464612236 463336639
1355 463336639 461626663 460775757 460120049 459499207 458797874 458258209 458019981 457613869 455887833 454281006
1364.6 454281006 453770447 452281189 450959320 449834442 448813553 449134827 449141273 449567070 450677261
1373.3 450677261 452201958 452193031 451819458 452557220 453059578 453932838 454970055 456584816 458219261
1382 458219261 459933319 461745682 463500824 466164398 468655701 470536537 471815147 473460617 474712257
1390.7 474712257 476160431 477947464 479987869 482735519 483312454 483765717 483856201 484341164 483706779
1399.3 483706779 483410378 484755440 484990768 485767593 486633949 486766968 486186638 486280441 486481133 485807915
1409 485807915 485368881 484388046 483660049 482602463 482194595 481947174 481278763 480958557 480084877 480297852
1418.6 480297852 475380707 473441124 473750839 473009415 472890968 471028328 470848770 471099815 470979576
1427.3 470979576 470726051 469469376 467752304 466207199 466099892 464891586 464372482 465469360 466257515
1436 466257515 464271927 462792091 463865738 463284264 462970886 462333260 461653709 461672211 460953026 461603622
1445.6 461603622 461705589 462448730 461951981 461941566 462778168 463071098 464594002 464754639 467184982
1454.3 467184982 469627228 472873192 476993675 475784721 479500198 480445709 483428993 484903336
1462 484903336 486360474 489061737 489192772 492263832 494951630 499358444 503193169 507797699 512713127
1470.7 512713127 516203537 521103973 523624954 528938980 532805557 536401062 540108719 543955040
1478.4 543955040 547738571 550912628 553917542 554869270 556511650 557643623 558678741 560275307
1486.1 560275307 560667381 560614815 562020607 562664452 560272865 559498291 558355789 556722908 555105972
1494.8 555105972 552944031 545644150 544342384 542645760 536256142 534048538 530271492 525867691
1502.5 525867691 522426682 520833931 520386658 511051369 502453117 499806633 499529953 497013245 496236458
1511.2 496236458 495722160 493109207 493472214 494415321 496003189 497477531 497117271 500474205 503873177
1519.9 503873177 508209572 513137321 516838570 521498756 525784225 529792671 532066994 535539436
1527.6 535539436 538328819 541172218 545200043 548882675 554073334 558355370 560418472 562991142
1535.3 562991142 565994415 570099411 574945984 579768944 573279686 577252808 580827065 582103043
1543 582103043 584694595 585804558 585126991 586359634 587543411 588566628 589138641 587283325 588199348
1551.7 588199348 590128517 591587639 590425987 589550247 592200203 594760399 591604385 584437256
1559.4 584437256 580951614 583086281 583800545 583576202 583615303 581027718 578172684 576848564 575456238
1568.1 575456238 574255257 565425186 562604179 561055183 557793503 554758377 552856979 551889877
1575.8 551889877 539465103 536262779 532349892 527758408 523402176 517785301 513783989 508437309
1583.5 508437309 504733582 499662209 495755920 491790543 486734390 482673302 476804390 473526917
1591.2 473526917 468121986 464882126 461580048 457344589 454758301 450563889 448358841 444012032
1599 444012032 441646118 438089256 434721489 432398643 428913269 428244286 425650177 424983940 422688522
1607.6 422688522 422171288 421379051 419039612 419232216 417088814 417543373 416650124 418099976 419955177
1616.3 419955177 416621590 418102188 417751350 419263573 418899574 420541344 421324120 420569382 422043381
1625 422043381 422297897 425287323 425967407 427814751 429509621 431404266 433016968 433725510 436555328
1633.7 436555328 438151970 440390739 440688934 443862724 445608025 447459259 450486183 452167892
1641.4 452167892 455425606 456994553 459399529 461763535 462282410 464844246 466286812 469516296
1649.1 469516296 471631317 475229530 478888130 479687157 478155022 479605751 482028236 483759727
1656.8 483759727 485825768 487289619 489663086 492321014 495475998 498859062 499991035 502822647
1664.5 502822647 505178719 508055687 511219597 515024109 518693428 521156235 525236397 528341179
1672.3 528341179 532695427 537084770 540266571 541727104 545071106 548930473 552792091 557163887
1680 557163887 559838715 563817635 569301758 573457565 571567764 574344864 578444443 581742897 583627281
1688.6 583627281 586074142 588588905 591218605 594441605 597132912 601386032 605513992 603512306
1696.4 603512306 605051460 607169800 610975761 610687561 606551437 610073624 612713547 614066086
1704.1 614066086 614077454 615527725 614044189 612612572 612217484 611335106 609488869 607817650 607385559
1712.8 607385559 607515831 606789360 603702850 604297066 605046501 597994385 596122780 595173378 594265976
1721.4 594265976 593025513 591361771 589710503 588830109 588479652 587589531 586983490 586481667 584634018
1730.1 584634018 583224449 583943253 585406609 583358612 579510155 581288071 583358154 585035057
1737.8 585035057 586486282 587015190 585551147 587174072 589105797 589977684 591207581 593345108 596523399
1746.5 596523399 599010468 602374191 604997902 608381195 611478767 612421799 616738777 620236168
1754.2 620236168 624484558 629630623 633939209 638923492 643734283 648817978 654136810 658990326
1761.9 658990326 662285385 666966858 671295853 675576935 680723572 685197754 688913727 693133621
1769.7 693133621 698939819 703137207 704706573 705352707 708834610 712595520 713488312 716136627 718516693
1778.3 718516693 721618347 724552689 725588684 727127304 728413773 730386276 730687943 731011276 732546234
1787 732546234 733718948 735023422 736809082 738886261 740878448 741149368 740487747 742972794 744211426
1795.7 744211426 743886032 744930420 746587982 747923126 748170166 750718079 751654129 752132874 753816757
1804.4 753816757 754578018 755700531 756481552 757220764 758190918 759890518 760079346 760624695 762418137
1813 762418137 763274460 764771576 765206833 765763397 766097946 766511459 767246323 767271194 768577957 769227371
1822.7 769227371 770899124 772857208 772250443 771920776 772727127 774660797 774830246 771741562 772026520
1831.4 772026520 773964157 774457550 774896164 775927353 776653061 777200928 776397934 776545639 776381531
1840.1 776381531 776233749 776342926 777374344 778939972 776119080 777414780 778844986 779069214 778769455
1848.7 778769455 778386459 778663330 777841263 778044357 778099823 778798523 779650269 779572144 780159073 780203934
1858.4 780203934 780250931 779490128 779093399 778834763 779063950 779668198 779777451 780742416 780616150 781348648
1868 781348648 781105499 779701843 779776001 779640961 780113983 780094528 780344620 780217209 780524750 780904617
1877.7 780904617 781087189 781728363 781061401 781264038 781040421 780533676 780173721 779862442 780471878 780448151
1887.3 780448151 781479568 782164078 781288147 781129761 781256256 780895157 780712357 780761871 780241318 780937576
1896.9 780937576 781327438 781711731 782064819 781935959 782128143 781614456 781469955 781038895 780927277 781139297
1906.6 781139297 781492004 782148056 782273483 782174835 781369324 781586380 781277237 781001129 781038818 780640869
1916.2 780640869 781438446 780547104 780358658 781102295 781563568 782165909 781611023 780951080 780311508 780234451
1925.9 780234451 780044708 780020905 780326843 780694427 780982819 780717392 780969696 780356979 780000610 779607239
1935.5 779607239 778885498 778792343 778573380 779078827 779466095 780608368 780898209 779238663 779051361
1944.2 779051361 778978729 778647614 777956085 777592392 777543335 777768631 777906342 778098984 778381729 777879562
1953.8 777879562 777786484 777343597 776928406 776629333 776325760 776325989 775980072 776206207 776326904 776566467
1963.5 776566467 776564713 776468277 776665573 775855637 774927063 774734268 774959793 774661407 774823532 775297546
1973.1 775297546 775597153 775866318 775291367 774758606 774177780 773808212 773249130 773047791 773450394 773716965
1982.8 773716965 774152603 773876572 774001846 773854446 773339005 772816315 771914215 772089233 772425537 772283325
1992.4 772283325 771991653 772575455 773070908 772949066 772537231 771636963 771426392 770754242 770391541 770187073
2002.1 770187073 769808502 770166855 770457840 770964890 770918579 770657883 770079803 769637985 769417648 768708344
2011.7 768708344 768395920 768093262 768326492 768636475 769153671 769286270 768610153 768240814 767507629 767057648
2021.3 767057648 766784515 766794815 766675034 766687775 766807175 766573639 766993332 766659546 766155930 765506516
2031 765506516 764832458 764679108 764408569 764554596 764624405 764943695 764653244 764463577 764776382 764522629
2040.6 764522629 764012222 763168411 762876816 762562180 762979660 763498230 763260880 763463745 763501740 763354416
2050.3 763354416 762833252 762514420 761768723 761144562 761268005 761342163 761819763 762064514 762427750 762360764
2059.9 762360764 762489777 762509003 761931381 761868515 761458282 761485443 761432648 761694107 761966705 762086334
2069.6 762086334 762764893 762392273 761884537 761447067 761459122 761534729 761516800 761463165 760946579 761265717
2079.2 761265717 761512985 761898422 761896896 761889725 761896667 761139832 761115875 761107941 761240845 761028366 761243896
2089.8 761243896 761734619 761813049 762272568 761794662 761445694 761100845 760981140 760732117 760309143 760697327
2099.5 760697327 760619431 760832214 760830688 760894089 760793915 760448074 760495834 760085678 759944839 759782639
2109.1 759782639 760114517 760253601 760102158 760127411 760073166 760154266 759658890 759742508 759568558 759571686 759668427
2119.7 759668427 759266129 759518967 759440079 759673080 759416656 759154816 759251328 758821793 758577728 758529434
2129.4 758529434 759001160 758941879 758911514 758928146 758862228 758815765 758498611 758542252 758204651 758334961 758236313
2140 758236313 758363953 758647308 758330917 758800125 758820724 758892288 758712692 758461533 758520126 758274460
2149.6 758274460 758258667 758179626 758631973 758633728 758767319 759003143 758784103 758964767 758831787 758849869
2159.3 758849869 758640518 758600845 758720779 758698807 758743134 758886108 759258118 759149933 759501038 759431458
2168.9 759431458 759118881 759193420 759273758 759536972 759391098 759885406 760062637 759995270 760270996 760298843
2178.5 760298843 760169220 759898834 760224228 760193710 760080414 760066376 760222092 760448303 760511627 760844193
2188.2 760844193 760522842 760620956 760555267 760467758 760819931 760639343 760618210 760650330 761070480 761169891 761190186
2198.8 761190186 761118698 761020508 761169891 760611343 760425491 760337143 760664749 760916672 760846558 761099167
2208.4 761099167 761065216 761150208 760901031 761068344 761039124 760584641 760441360 760490265 760650177 760410004
2218.1 760410004 761027756 761328506 761136017 761065521 760857162 760706940 760361481 760748138 760462723 760098114
2227.7 760098114 760337524 760620575 760829926 760495758 760627747 760220413 759831619 759596024 759227905 759219360
2237.4 759219360 759313660 759694214 759629211 760060043 760330353 760192642 759821472 759348373 759385681 759071426
2247 759071426 759426804 759491196 759595184 759909210 760015030 760240097 759247360 758845291 758971634 759037247
2256.7 759037247 758889313 758706436 758925018 758978271 759713516 759811859 759562225 759303207 758987885 758603439
2266.3 758603439 757780685 757982178 758374100 758506317 758280106 758417053 758748703 758837814 758813019 757967072
2275.9 757967072 757631989 757197876 757405014 757763596 757441406 757539139 757654572 758314133 758064194 757736969
2285.6 757736969 757513428 756867981 756807251 756787796 756938324 756422348 756644669 756969986 757009735 757208023
2295.2 757208023 756713257 756797256 756159210 755729599 755631638 755666351 755986481 755797882 755998535 755384827
2304.9 755384827 755358658 755570374 755465317 755004349 754196701 754725342 754203491 754356918 754871063 754415436
2314.5 754415436 754393082 754051666 754338684 754406586 754387054 754128418 753189316 752418976 752248917 752445297
2324.2 752445297 752422867 753187561 753651657 753738556 752883835 752153854 752513275 752485580 752130814 751217041
2333.8 751217041 751318588 751402130 751578979 751856537 751978455 751871338 750338440 749504852 749086914 749709702
2343.4 749709702 749823151 749361191 748951797 747807922 748252335 749264603 749875641 749494324 749462204
2352.1 749462204 748952332 747436829 747962952 747809753 747085495 746193924 746647491 746822128 747062454
2360.8 747062454 748429337 746797256 745971527 744775314 744942017 745947952 745668182 745780792 744749451
2369.5 744749451 744872360 744840851 744254837 744021606 743890762 743433609 742208252 741793060 741968765 742439880
2379.1 742439880 742763519 742835922 742341614 741416397 741083679 740771179 740273437 740026169 740532990 740916061
2388.8 740916061 740805664 740671005 740345230 740055923 739483566 738910522 738440933 738133011 737695694 737369156
2398.4 737369156 737657700 737665329 737634659 737625809 737390976 736572342 735912781 735614624 735103683 734952164
2408.1 734952164 734522629 734259796 734195786 734555359 734796219 734205475 733927612 733104477 732467499 732081909
2417.7 732081909 731738739 731852188 731843262 731842651 731423187 731415558 731080704 730315094 729787674 728986282 728572617
2428.3 728572617 728484421 728634262 728296585 727965240 727793884 727507324 727368088 726704865 726251831 725787506
2438 725787506 725379562 725037079 724910736 725151901 724952393 725056915 725180740 725058517 724580154 723864822
2447.6 723864822 723047409 722505951 722377014 721716080 721598053 721607590 721490860 721373138 720873566 720582886
2457.2 720582886 720236130 720090561 719375229 718596420 718486786 718530121 718538895 718302536 718380356 717974777
2466.9 717974777 717139816 716417770 716048355 715844116 715514984 715427094 715087585 715239716 715431976 715300980
2476.5 715300980 714996414 714213943 713340988 712399673 712451172 712669373 712381973 712279129 712378616 712401962
2486.2 712401962 711939240 711269531 710516739 710272141 709852676 709502106 709429092 709208069 709452591 709262772
2495.8 709262772 709284744 708835602 707832184 707570648 707279816 706848145 706200714 706201324 706095963 705649948
2505.5 705649948 705600586 705208893 704933319 704636536 704252625 703835907 703448181 702948456 702608109 702773514
2515.1 702773514 702696228 702611694 702619247 702692719 702265091 701408997 700746078 700422668 700293427 699883423
2524.7 699883423 699748077 699569397 699642181 699659958 699336395 699204025 698600159 697910995 697123032 696872330
2534.4 696872330 696706543 696348038 696352921 696232834 696527939 696288071 696052094 695838242 695161057 694625473
2544 694625473 693725662 693669739 693879623 693744736 693517990 693137207 693380280 693478699 692671814 692029190
2553.7 692029190 692371445 692003708 691154480 690930557 690815887 690768967 690593414 690389709 690065689 690091171
2563.3 690091171 689788742 689004898 688618393 688218155 688037109 687816010 687759857 687812576 687909927 687754517
2573 687754517 687055588 686775818 686523056 686278458 685882339 685455475 685000763 684836426 685511475 685569611
2582.6 685569611 685270233 685017242 684608459 683817978 683110886 682948761 682661209 682636261 682409363 682246399
2592.2 682246399 682179031 681849136 681373215 680514832 680000916 679704666 679652481 679508057 679056244 678530045
2601.9 678530045 678374100 678574295 678245773 677965546 677427292 677178726 677201538 676829300 676389465 675640411
2611.5 675640411 675462952 675425644 675512238 675440826 675041962 674711838 673877563 673370590 672827988 672664566
2621.2 672664566 672577438 672219772 672272873 671705475 671304474 671165619 670757523 670283203 670206604 670121613
2630.8 670121613 669352112 669005432 668756104 668370438 668242722 668261795 667758789 666933517 666488342 666209793
2640.5 666209793 666404800 666151276 665784073 665608749 664868622 664425430 664348679 663958054 663363800 663406830
2650.1 663406830 663272781 662886963 662780457 662301178 661831436 661484756 661265488 660960541 660746002 660477219
2659.8 660477219 660128098 660054855 659817505 659529724 659206772 659205093 658601074 657805634 657659988 657156067
2669.4 657156067 656765976 656258545 656305313 656539993 656024857 655605240 655274353 655185471 654853363 654416580
2679 654416580 653856583 653394089 653349991 652934189 652468491 651886902 651210022 650811615 650679855 650441513
2688.7 650441513 650377655 650238876 649589462 649256287 648877792 648757782 648591766 647958832 647302628 646743927
2698.3 646743927 646485214 645914688 645644073 645387039 645156784 645241852 644877777 644356918 643772354 643838348
2708 643838348 643646698 642675400 641883698 641592941 641661301 641301041 641058884 640760956 640410080 640342102
2717.6 640342102 640278625 639933319 639263420 638866158 638413124 638218498 637963943 637855415 637927818 637300797
2727.3 637300797 636765366 636493988 636396103 635767708 635224152 635092278 635094147 635485382 635298958 635145607
2736.9 635145607 634613647 634228096 633990364 633300591 633377686 632949486 632499428 632467651 632557602 632840424
2746.5 632840424 632673950 632589455 632541466 632469864 631749191 631093216 631043320 630725784 630449028 630157433
2756.2 630157433 629957809 629672775 629640732 630050964 629899597 629172554 628921852 628769569 628234062 628263474
2765.8 628263474 628058472 627594528 626984329 626314316 626307335 626284294 626455307 626159134 625390816 624763527
2775.5 624763527 624211349 623965950 623659515 623591118 623526077 623213959 622643318 622067528 621630745 621351738
2785.1 621351738 621074028 620046349 619544830 619622498 619548721 619268990 618431931 617518845 616908569 616760902
2794.8 616760902 615944672 615023766 614923096 614389648 613513870 612873650 612355652 611607399 610741310 610004120
2804.4 610004120 609310989 608318787 607468338 606858597 606134605 605589371 604678726 604005051 603094978 601738358
2814 601738358 600945930 600039597 599126015 598008995 597059441 596130524 594898148 593753052 592717896
2822.7 592717896 591914444 590307121 588738136 587347374 586030006 584969063 583419991 582316628
2830.4 582316628 580967331 579446640 578298340 577332115 575993233 574007530 572394409 570490837
2838.2 570490837 568930893 567410622 565665932 564488258 562988739 561459503 559673729 558217087
2845.9 558217087 557003059 554980164 552858696 551067848 549659462 548291130 546821060 545489578
2853.6 545489578 544800911 544008980 542959099 542148705 541221237 540643539 539592094 538076401 536831894
2862.3 536831894 535871277 534851227 533461456 532534103 531428757 529794617 528196144 527122536 526537323
2870.9 526537323 525688858 524674301 523661041 522818108 521981277 521126785 520086784 518968239 517926826
2879.6 517926826 517129555 516879883 516056137 514963226 514198608 513967133 513506546 512173805 511663055
2888.3 511663055 511249657 510333900 509332428 508618660 508414154 508043671 507763519 507049637 506379280
2897 506379280 505799751 504850693 504080353 503224449 502508430 501996422 501993217 501976357 501686668 501385269
2906.6 501385269 500917511 500876503 500408020 499794731 499258957 498151321 497382927 496907921 496477203 495880852
2916.3 495880852 495246353 494890175 493977089 492905540 492664642 492725639 492764282 492700691 492274742 491786346
2925.9 491786346 491794014 492662277 493387222 493445396 493312988 493199005 493279076 493150787 493138275 493947868
2935.6 493947868 495116463 495872650 496715355 497532196 497989578 498718224 499538383 501125107 502751541
2944.2 502751541 503490143 504427185 505841942 507294197 508331909 509961472 511710014 512992020 514130363
2952.9 514130363 514532127 514870987 515545006 516957970 518224411 519226646 520680809 522204437 524039307
2961.6 524039307 525110779 525759621 526630058 527571411 528401604 529409485 531121826 532179070 533392754
2970.3 533392754 535143738 536766548 538629303 540262947 541356659 542290688 543593750 544678040
2978 544678040 545745659 546798782 548050308 549642830 550848389 552026749 552670746 553375778 553908577
2986.7 553908577 554077606 554718781 555344810 556342697 557214127 557917862 558277092 558063583 558071327 558664055
2996.3 558664055 559217377 558753777 558255386 557894592 558039856 558448219 558519096 558329582 557713394 558170204
3006 558170204 558388863 557969589 557835922 557538948 557167015 556437263 556515961 557090874 557348824 556959801
3015.6 556959801 556250038 556014252 555562668 555066795 554315109 553640633 552906990 552318039 552161484 551823044
3025.2 551823044 551584282 550717850 549989586 549597435 549440002 549229202 548059692 547240906 546589890
3033.9 546589890 546132431 545674667 545138245 544559708 543537750 543038673 542322807 541188316 540037498
3042.6 540037498 539344902 539134369 538432503 537752228 537224007 536596146 535654716 534918671 534451447 533438797
3052.2 533438797 532334595 531435471 530729141 530413513 530173607 529337959 528063202 526989288 526330414
3060.9 526330414 525252380 524311180 524153175 523428459 522738457 521859283 520921707 520744400 520064774
3069.6 520064774 519280891 518777237 517999802 516916046 516491890 515954132 514620018 513812447 513147354
3078.3 513147354 512683067 512143669 511632195 511133842 510303230 509708900 508818207 507961884 506742897
3087 506742897 505879173 505580406 504849739 504302254 503433685 502801819 501946449 500910606 500509186 499730911
3096.6 499730911 499141083 498517952 497601242 496970482 496405907 495684357 495025101 494309540 493406067 492397079
3106.2 492397079 491239815 490439682 489439774 488441963 487585030 486737595 486370506 485668411 484963417
3114.9 484963417 484089775 483163338 482457848 481364975 480110512 479162292 478945122 478176079 477180862
3123.6 477180862 476220818 475071373 474637566 473616676 472355881 471503983 470876236 470205879 468944588
3132.3 468944588 467742538 466811638 466172256 465684891 465328026 464509888 463383446 462659149 461577644
3141 461577644 460130119 458855934 458182297 457641258 457175751 456664238 455441818 454094429 453073997
3149.6 453073997 452494392 451489983 450197754 449300270 448435135 447732811 446900330 445658798 444374428
3158.3 444374428 443807297 443282089 442042236 440766640 439884605 439171410 438356628 437788849 436770172
3167 436770172 435538101 434603958 433760223 433142357 432121315 431103096 429824104 428750916 428454170
3175.7 428454170 427921104 427083931 425769196 424893150 424326859 423291168 422179489 421058655 420268745
3184.4 420268745 419794235 419049110 417736244 416569252 415582657 414961166 414522247 413640938 412805977
3193 412805977 411402283 410165710 409352989 408560982 408088455 407199173 406287994 405233192 404380341
3201.7 404380341 403740845 402759743 401767273 400563812 399698486 399036865 398537178 397934608 396921043
3210.4 396921043 396376534 395934181 395228653 393988419 392629814 391856575 391034813 390283432 389738617
3219.1 389738617 388801956 388023758 387456055 386727142 386041183 384859962 384032402 383367157 382061386
3227.8 382061386 381186218 380564194 380165100 379587212 379034843 378579407 377494354 376622009 375722847
3236.4 375722847 374910545 374164238 373248520 372151947 370872040 370596199 370554504 370304756 369982910
3245.1 369982910 369178123 368211212 367066116 366255188 365587692 364922256 364447746 363690681 362801170
3253.8 362801170 362187347 361644745 360973282 360356293 359769325 359309044 358367882 357028923 356210861
3262.5 356210861 355652390 355250092 354873848 354456406 354006996 353532677 352844696 351977272 351386566 350543861
3272.1 350543861 349775505 349456635 349249268 348857956 347945518 347081757 346375237 345724373 345165443 344642601
3281.8 344642601 343835068 342943954 342685013 342234535 341504631 341335831 341632004 341218414 340186310
3290.4 340186310 339894981 339333611 338455467 338189545 337885933 337456551 336847763 336315269 335797806 335106735
3300.1 335106735 334637032 333871231 333307533 333491516 333318138 332519569 331493797 330651093 330186386
3308.8 330186386 329729843 329262619 328603439 327488594 326810493 326766624 326317253 325783310 325473175 325116196
3318.4 325116196 324713364 323685417 322460213 321888084 321786041 321414452 320624428 319863014 318873062
3327.1 318873062 317985382 317512054 317161293 316507435 315808201 315661755 315100269 314227753 313443699 312642136
3336.7 312642136 312183075 311778336 311416206 310665359 309749489 309098949 308759804 308596420 307719288 306770363
3346.4 306770363 306206493 305716362 305276756 304917736 304621601 304143391 303706665 303061924 302529507 302154369
3356 302154369 301594391 301145840 300438118 299824772 299286118 298793240 298659668 298155804 297556705 297353935
3365.7 297353935 297090225 296227722 295244694 295224037 295229340 294230633 293502922 293364143 292911243 292163906
3375.3 292163906 291684227 291400032 290978851 291226902 291221733 290344639 289746590 289153156 289056740 289089928
3384.9 289089928 288768311 288431301 287729549 287447319 287355633 286946926 286550350 286527328 286529160 286026478
3394.6 286026478 285843410 285852604 285443878 284830952 284687500 284882965 284883022 284732132 284552250 284659882 284635849
3405.2 284635849 284159222 283329086 283204994 283631229 283267250 282827415 282490711 282600040 282780094 282477722
3414.8 282477722 282667847 282924843 282672329 282511120 282933960 282504845 281764679 281946087 282116280 282447834
3424.5 282447834 282669353 283108864 283369541 283231525 283138924 282820797 283200550 283358078 283260765 283744678
3434.1 283744678 284329433 284814739 284985943 285418167 285987377 286159515 286023903 286362457 286661720 286763725
3443.8 286763725 287332306 287765579 288699780 288765373 288250027 288718586 288891544 289471951 290410461 290897179
3453.4 290897179 291593552 292615070 293075218 293323421 293766537 293929062 294432220 295215282 296375561
3462.1 296375561 297270203 297771492 298270645 298456573 299233093 299765549 300585365 301798935 302090435
3470.8 302090435 302468319 302719345 303062706 303821163 304332256 304999733 305793896 306315594 307047157 308165436
3480.4 308165436 309474392 310460968 310759563 311663876 312483826 313349648 314689064 314883289 315206184
3489.1 315206184 316262913 317132587 317670689 318595161 319715462 320299683 321153297 322054558 323333015
3497.8 323333015 324588890 325607834 326870117 328069649 329359436 330040092 330670586 331178894 331731834
3506.5 331731834 332786560 333856087 334592590 334961662 336418915 337782478 338972206 340482559 341282082
3515.1 341282082 341961555 343059845 344931717 346297455 347003365 347981186 349374046 350939140 351915512
3523.8 351915512 352849922 353550720 354854851 356437836 357426300 358376732 359467239 360657883 361888351
3532.5 361888351 363729591 365112953 366998291 368749390 369241447 370795708 372463684 373920593
3540.2 373920593 374938927 376752434 378686180 379902763 381479263 382101173 383811226 385160370
3547.9 385160370 386861191 389153214 391141548 393414040 394025459 396017799 397614861 398808327
3555.6 398808327 400827446 402124290 404178505 406038017 407884483 409098587 411763420 414233818
3563.4 414233818 415355682 419567528 421765022 423438530 425196381 425042839 427693214 429836769
3571.1 429836769 431538734 432949982 435034637 437291908 439411850 442401505 444382248 446618118
3578.8 446618118 448670197 450244522 452329903 455151787 457453690 459170341 462860680 465372581
3586.5 465372581 467180481 469564438 469805298 472406120 475561562 478712883 481003876 482798615
3594.2 482798615 486054916 487663460 490885277 494258080 495097237 498105850 500208740 501285553
3601.9 501285553 503926506 506128578 509015884 513297272 517150116 518069267 521369972 522605743
3609.6 522605743 522763672 529156837 531557503 531010475 534795799 535792465 540225945 545524559 548363152
3618.3 548363152 550473099 550243416 551618690 554529724 557802277 560940628 564375267 567298851
3626 567298851 570265884 576544685 578523788 571967239 575142288 580077591 585399704 587746201 587849045
3634.7 587849045 590691605 594276390 597740479 600005989 602298737 605754242 609343185 611902046
3642.4 611902046 613392296 616189537 620459137 625372353 625425797 625223198 631786385 635619125 636656914
3651.1 636656914 636150322 640050964 644245148 648339996 654453049 650381546 651611404 656413116
3658.8 656413116 658810196 661966248 663395157 665886154 668158188 670474701 672814026 674020081
3666.5 674020081 678471222 681809311 682906570 684472885 681151581 683267670 689964752 698347168
3674.3 698347168 700129089 686656265 687992783 694619827 698912582 697682343 698359528 700996475
3682 700996475 702947998 704369583 705312195 705904465 709181747 714920120 708415070 706050186 713231049
3690.6 713231049 709264145 708699951 713175201 714261322 715399551 714939575 714133224 715269470 715606232
3699.3 715606232 717973862 721650696 718238297 715408401 718878174 720422134 720428543 720604782 722286072
3708 722286072 725400467 719500122 722314453 726110535 714506760 718667831 722955093 723578568 724427719
3716.7 724427719 726078644 727316284 723798065 723667068 728339920 726579666 722546310 725756683
3724.4 725756683 727025909 726839218 724800873 724652405 728177872 729130020 732956848 731219788 724707947
3733.1 724707947 730658798 730625000 725486298 725079803 725738220 726087799 728254929 731753235 727689285
3741.8 727689285 729431229 739006348 729164734 718676758 726590118 731066666 736587906 735040512
3749.5 735040512 726355286 734590149 730460892 723556366 727711563 730666504 733590698 730071640
3757.2 730071640 731356583 736001816 729641495 727009125 729058838 729812698 730493698 733623428 731984787
3765.9 731984787 727720184 730350113 734523773 735420990 728429108 728449707 730362167 730031891 730132370
3774.5 730132370 729536819 730713348 731759644 734009476 734479828 728390732 729787903 731232758 731437302
3783.2 731437302 732530670 730018311 729358063 730502396 731245499 731814575 731539230 731316605 731144867
3791.9 731144867 731123734 730215836 731325150 734814301 732670364 729472504 730226669 733145599 739241409
3800.6 739241409 735901566 727752838 729484329 729617615 732615051 737445679 730303726 726322098
3808.3 726322098 729757767 731373672 730919418 730640106 731150055 732495956 736365814 733705139 722766571
3817 722766571 727481537 732411346 736586761 739070206 724414978 724505844 728717957 730410385 731967163
3825.7 731967163 731527634 729114685 729422379 730479050 733004532 734830627 728406754 729818192 735500717
3834.3 735500717 731218719 729623642 735067368 729753418 726292343 731906128 728301010 727938385
3842.1 727938385 733389130 731443939 727737579 728793106 729085159 728783035 730082245 730204620 732193527
3850.7 732193527 736520767 731809845 731526031 720903549 722138367 730101776 728469086 726324081
3858.4 726324081 727938614 729725571 731441574 726865616 727463989 733755569 729050217 722933578
3866.2 722933578 725372086 729661789 735070953 729099350 721834564 724692001 728976517 732048874
3873.9 732048874 724470978 724824295 728425903 728254929 729523697 731587601 726625061 721623764 725990067
3882.6 725990067 726702881 727639008 732379227 723701630 724006577 726805191 726940079 729783936 728661804
3891.2 728661804 722289658 723186951 725525131 723747635 724756851 726677628 728584824 729958267
3898.9 729958267 722800064 726337204 727908478 724376144 727918015 723799973 721886749 722729263
3906.7 722729263 723933182 725880203 724853439 724017105 723867569 723998413 723790588 723701248 724881744
3915.3 724881744 726258392 723282700 720788116 724864883 724661636 720988235 722454605 723770370
3923.1 723770370 725007248 723701172 720857697 721595993 722180710 722867432 723418274 723396301 723995209
3931.7 723995209 721436691 720407486 722040024 721431961 721051254 721538544 721747437 722104721 721964340
3940.4 721964340 723019867 723635788 720499725 719726944 720464630 721242905 722558289 721259155 721870575
3949.1 721870575 722072678 719513550 720634842 721781998 721458054 720615311 720255737 720438766 719797058
3957.8 719797058 720274963 719831772 720323868 721378784 719909363 719752121 719781342 719062042 718579941
3966.5 718579941 718341751 718594131 718512344 718973389 720050659 720008316 719391937 719090195 718750916 718982162
3976.1 718982162 718862076 718420181 717912064 717348099 717838669 718177185 718050613 717837143 717999649 717990036
3985.7 717990036 717872543 718163071 717661667 717991180 718571548 718867187 718935547 718469086 719292984 719366226
3995.4 719366226 718471985 718186493 717867584 716766510 716344147
4000.2 716344147
##END=$$ End of the data block
