##TITLE=FEA $$ Begin of the data block
##JCAMP-DX=5.00 $$ ACD/SpecManager v 10.08
##SPECTROMETER/DATA SYSTEM=Alpha
##DATE=14 Mar 2016 08:06:00
##DATA TYPE=INFRARED SPECTRUM
##DATA CLASS=XYDATA
##ORIGIN=
##OWNER=
##NPOINTS=1667
##FIRSTX=599.64648438
##LASTX=3997.64306641
##MAXX=3997.64306641
##MINX=599.64648438
##MAXY=1.12729824
##MINY=0.78290462
##XFACTOR=1.0000000000
##YFACTOR=0.000000010000000
##FIRSTY=1.05500793
##DELTAX=2.03961372
##XUNITS=1/CM
##YUNITS=ARBITRARY UNITS
##XYDATA=(X++(Y..Y))
599.6A05500793P7725L5572P486L136J6641N0163P4923M9115N471M77J4842J1360j6403
626.2A05831301m6944m8268l1424k2936p736K9230O1321N8234M6277M0912J3376k2817
650.6A05900526j3494L3116N0270L2628J8144J1623p558l1126J896L3295j1814p2658
675.1A05944848j05309o4958K2114O1714N4074M0221J9562L827J192j6213k9861l303
699.6A05927908J5116K766r525k6357n9033r1230r4307o7425m7350n5015o9499n9938
724.1A05366111l8266m5681r1982j50538k06923k66373k84338k17522j20592n4419
744.5A03889477j0860J9014K5642J8132P307k7644o6853m8625Q070N8019R6882J26350
768.9A04094911J47163J45698J23775R6941N5850J7392J884j621N364k742k3901k2579
$$ plain form
599.6 105500793 105578518 105614090 105621576 105624712 105641353 105691516 105766439 105815554 105821025 105821502 105836344 105847704 105831301
626.2 105831301 105784357 105736089 105704665 105681729 105673993 105703223 105764544 105822778 105869055 105909967 105923343 105900526
650.6 105900526 105887032 105920148 105970418 106003046 106021190 106032813 106025255 105994129 105996025 106029320 106017506 105944848
675.1 105944848 105839539 105774581 105796695 105858409 105912483 105952704 105972266 105976093 105977285 105961072 105931211 105927908
699.6 105927908 105943024 105945790 105936265 105909908 105850875 105759645 105665338 105597913 105550563 105495548 105426049 105366111
724.1 105366111 105327845 105282164 105190182 105039644 104832721 104566348 104282010 104064488 103943896 103889477
744.5 103889477 103878617 103897631 103923273 103941405 103948712 103921068 103854215 103805590 103813660 103871679 103968561 104094911
768.9 104094911 104242074 104387772 104511547 104608488 104664338 104681730 104683614 104681993 104687357 104684615 104660714 104638135
793.4A04638135j6641m971M5419J15895J62518J80852J86837J81067J71494J74022
813.8A05834627J78361J63090J48428J45423J31333J13607J01602R1207Q2183O9975
834.2A07059836M1199o20j2362L934k038k8384m0269k7239M899M0412N9939O3908O1285
860.7A07224500N2393M1341M5872N5421M3749J2732l8040q1980q2481o0046m5180l3224
885.2A07135057J646N8341J05953J39344J56068J40786J08064Q3840Q7452J05726J01126
907.6A08223403Q4495O8986L8374N305j0050K575L6669N4085M6707K4616j3137m1771
932.1A08520257m5275l5119k0194m518k218j1921j6868k5320m3833o0713p0823q3339
956.6A08100116j01244j16098j15979j01113q4460o3503m3678l4034j7607K2912P4255
$$ plain form
793.4 104638135 104621494 104616523 104661942 104777837 104940355 105121207 105308044 105489111 105660605 105834627
813.8 105834627 106012988 106176078 106324506 106469929 106601262 106714869 106816471 106907678 106989861 107059836
834.2 107059836 107101035 107100415 107088053 107091987 107089949 107061565 107021296 106994057 106998956 107039368 107099307 107163215 107224500
860.7 107224500 107276893 107318234 107364106 107419527 107463276 107476008 107437968 107355988 107273507 107213461 107168281 107135057
885.2 107135057 107136703 107195044 107300997 107440341 107596409 107737195 107845259 107929099 108016551 108122277 108223403
907.6 108223403 108307898 108376884 108415258 108420563 108410513 108413088 108449757 108503842 108550549 108575165 108562028 108520257
932.1 108520257 108474982 108439863 108419669 108415151 108412933 108401012 108384144 108358824 108314991 108254278 108183455 108100116
956.6 108100116 107998872 107882774 107766795 107665682 107581222 107517719 107474041 107440007 107422400 107445312 107519567
979A07519567J06955J07550P9060L4010j1587m1270m7159m4656n5647p5209q5783q3280
1003.5A07402551q7976j13750j52933k03288k04849j24264q2362j53076k48254k87366
1023.9A05744433k66385k15828j56915q4210j3208L1900M1974J1349m4406r1028j22702
1046.3A04834974j62637k20085k97391l72064l97265l45612k11548l6598J00625J57571
1066.7A03049970J41859J00565Q3124R0099R6595Q7368P3112P8260R9230J09911J12474
1089.2A04122567J34599J70017J81508J58775J14834P1096N5135N3262L7551J7882
1109.6A05117226J752o378R239L2151K5177r680l4010k6036l552J2k8563o3419q1098
1136.1A04932821r9921j26255j34563j16241q1659n0270m3595n8139q5008j20878j49655
$$ plain form
979 107519567 107626522 107734072 107813132 107847142 107835555 107794285 107747126 107702470 107646823 107571614 107485831 107402551
1003.5 107402551 107314575 107200825 107047892 106844604 106639755 106515491 106433129 106280053 106031799 105744433
1023.9 105744433 105478048 105262220 105105305 105021095 105007887 105039787 105081761 105093110 105048704 104957676 104834974
1046.3 104834974 104672337 104452252 104154861 103782797 103385532 103039920 102828372 102791774 102892399 103049970
1066.7 103049970 103191829 103292394 103375518 103465617 103562212 103649580 103722692 103800952 103900182 104010093 104122567
1089.2 104122567 104257166 104427183 104608691 104767466 104882300 104953396 105008531 105061793 105099344 105117226
1109.6 105117226 105118978 105112600 105121839 105153990 105179167 105169487 105135477 105109441 105105889 105105901 105077338 105013919 104932821
1136.1 104932821 104832900 104706645 104572082 104455841 104374182 104323912 104280317 104222178 104137170 104016292 103866637
1158.5A03866637j63484j51265r7453k1839N1212J32036K32268L30042L78430L48843
1178.9A04905427K78270K33364K25687K10702J65737J07574M9949Q083k1124p0274
1199.3A06093395j28222j34575p4875l112L1519K1243j2696l8242m3726m5800n2405
1221.7A05612504n9282o7497p3218p9524r0504r9790r0683n4610j9204o151m471o783
1246.2A04960787l0541p0560r5356j16837j46103j58608j55198j58894j78850k12443
1266.6A03637397k50649k59280j91331m7672J01268J79124J68848J11640N3393j633
1287A03501105n0950p1871q5402j20437j54328j70827j75929j65582j52361j66321
1307.4A02187097k14291k70175k94054k65050j95372j16992p3552r4271j75178k88796
$$ plain form
1158.5 103866637 103703153 103551888 103454435 103432596 103483808 103615844 103848112 104178154 104556584 104905427
1178.9 104905427 105183697 105417061 105642748 105853450 106019187 106126761 106176710 106184793 106163669 106093395
1199.3 106093395 105965173 105830598 105755723 105752611 105784130 105805373 105792677 105754435 105710709 105664909 105612504
1221.7 105612504 105553222 105485725 105412507 105332983 105242479 105142689 105052006 104997396 104978192 104972041 104967570 104960787
1246.2 104960787 104930246 104859686 104764330 104647493 104501390 104342782 104187584 104028690 103849840 103637397
1266.6 103637397 103386748 103127468 102936137 102888465 102989733 103168857 103337705 103449345 103502738 103501105
1287 103501105 103450155 103378284 103292882 103172445 103018117 102847290 102671361 102505779 102353418 102187097
1307.4 102187097 101972806 101702631 101408577 101143527 100948155 100831163 100757611 100663340 100488162 100199366
1327.8A00199366l87472l93606k58016j4740K43693L88962L47901K14553J04928L7515
1348.2A00483084n269l1782n4311p8678j05083j66059k94328m40758n73820p09200
1368.6I8023796p51883o98161n67680k84464N0033L04788M29344M23998L38643K07836
1389I7476250R7775M9204R853j01376k87431m04877l99178l28148j66988K1261J37121
1411.4I6103466J51836R3073k2983j81103k80613l48240m14294m30638m44108m03184
1431.8I3823212l33738l82376m35191l49414l14081l55280m38368n64140o04367n23365
1452.2H9522892l76075k25204l1227J45799K92122O76882J262212J585788J744681
1470.6I4597870J870543J496231Q59440M06104O3974j82194k92581k45184P4119N96243
$$ plain form
1327.8 100199366 99811894 99418288 99160272 99145532 99389225 99778187 100126088 100340641 100445569 100483084
1348.2 100483084 100477815 100446033 100391722 100313044 100207961 100041902 99747574 99306816 98732996 98023796
1368.6 98023796 97271913 96573752 96006072 95721608 95771641 96076429 96505773 96929771 97268414 97476250
1389 97476250 97574025 97623229 97633082 97531706 97244275 96839398 96440220 96112072 95945084 95966345 96103466
1411.4 96103466 96255302 96348375 96325392 96144289 95863676 95515436 95101142 94670504 94226396 93823212
1431.8 93823212 93489474 93107098 92671907 92322493 92008412 91653132 91214764 90650624 90046257 89522892
1452.2 89522892 89146817 88921613 88890386 89036185 89328307 90005189 91267401 92853189 94597870
1470.6 94597870 96468413 97964644 98824084 99230188 99294162 99111968 98819387 98574203 98648322 99244565
1491I9244565Q37236Q16298P32565N53536M01593L13389K62940K32303J79708J38712
1511.4A03712845J09255Q5700Q9276J07657J05978P0273k586q5378j18530j07551m5692
1533.8A03921247P0166J29402R7036L6729L3032J9110j6475n2547p2456q7440j12569
1556.2A03965235k37119l08049j45304j18161j51240j51730j20783n5098p0215j69217
1576.6A02438319j75691j61683k19143k83158l37827m09603m97162n75132o57045p36225
1597I8385650p92790q12917p48361n46795k38818J25593M75312O97755Q53134R19598
1617.4I8317361O84720M36938K84374J39218L3391k9504n3484r4050j83684j75815
1637.8I9359465j26505j44065j90925k96295l27522j94817k83456n32240l51685k40082
$$ plain form
1491 99244565 100081801 100898099 101630664 102184200 102585793 102899182 103162122 103394425 103574133 103712845
1511.4 103712845 103822100 103907800 103997076 104104733 104210711 104280984 104278398 104193020 104074490 103966939 103921247
1533.8 103921247 103991413 104120815 104217851 104254580 104287612 104306722 104290247 104237700 104165244 104077804 103965235
1556.2 103965235 103728116 103420067 103274763 103156602 103005362 102853632 102732849 102677751 102607536 102438319
1576.6 102438319 102262628 102100945 101881802 101598644 101260817 100851214 100354052 99778920 99121875 98385650
1597 98385650 97592860 96779943 96031582 95484787 95245969 95371562 95846874 96544629 97397763 98317361
1617.4 98317361 99002081 99439019 99723393 99862611 99896002 99866498 99813014 99718964 99535280 99359465
1637.8 99359465 99232960 99088895 98897970 98601675 98274153 98079336 97795880 97263640 96911955 96671873
1658.2I6671873l01355l95125m03255l27367l65501m24505l20190k66737k43604j31571
1678.6I3492663m9621j1951L7754J62732K73097L55285L92271M51660N32055O16473
1699I6252418P98207Q11404Q53849R83214R89032R64999R38845R15825R12082P82740
1719.4A05202615N82230M81773M16553L46446K90406K27534J74737J71006J77932J51431
1739.8A08222663J30785J36948J43253J41049J44338J53661J50514J33729J22416J12855
1760.2A09592211R1529Q8406Q4018N8234L5703L7599P0775Q4292O4874N0461N0641
1782.6A10308743L9708L1066L3438J2434j7309q11J8525R108N173J4627J6427L660
1807.1A10474789j2386j2254J0693K2280R477n60J514j681l755P510j323p165R442
$$ plain form
1658.2 96671873 96370518 95975393 95572138 95244771 94879270 94454765 94134575 93867838 93624234 93492663
1678.6 93492663 93443042 93431091 93468845 93631577 93904674 94259959 94652230 95103890 95635945 96252418
1699 96252418 97050625 97862029 98715878 99699092 100688124 101653123 102591968 103507793 104419875 105202615
1719.4 105202615 105784845 106266618 106683171 107029617 107320023 107547557 107722294 107893300 108071232 108222663
1739.8 108222663 108353448 108490396 108633649 108774698 108919036 109072697 109223211 109356940 109479356 109592211
1760.2 109592211 109683740 109772146 109856164 109914398 109950101 109987700 110058475 110142767 110207641 110258102 110308743
1782.6 110308743 110348451 110379517 110412955 110425389 110408080 110407269 110425794 110434902 110440075 110454702 110471129 110474789
1807.1 110474789 110462403 110450149 110460842 110483122 110492599 110492039 110493553 110491872 110488117 110495627 110494304 110487139 110496581
1833.6A10496581P641J144R716K992k8443k7025R310K1208Q738k122l672o926j0932
1860.2A10478210l635N996j812k3353k0349O723J1015k968r096m053M160M828j943
1886.7A10443723j1337j4281p772n269m077k027m947q571r430j2278k2912k3675m876
1913.2A10312271J91j7989j8573j394L171N579O687K301k62k802o771p534q273j3971
1941.7A10252631p165M912k277q023O68L731J669Q22p844j1766n948o688j1074q119
1970.3A10195529k86L839n25p462p916p796j1933q094J681k384j4937j1552j311j740
1998.8A10125113r227j4687j4555j3781j0419m542n889j1742j6093j4901r775j0228
2023.3A09989274r418r060j5914j4425n650n305j1384j2482j0335r847q905o127o569
$$ plain form
1833.6 110496581 110504222 110505366 110515082 110518074 110489631 110462606 110471916 110493124 110501862 110499740 110496068 110489142 110478210
1860.2 110478210 110474575 110480571 110478759 110455406 110435057 110441780 110452795 110449827 110440731 110436678 110440838 110445666 110443723
1886.7 110443723 110432386 110418105 110410333 110405064 110400987 110398960 110394013 110385442 110376012 110363734 110340822 110317147 110312271
1913.2 110312271 110312462 110294473 110275900 110274506 110277677 110283256 110289943 110292244 110291982 110289180 110282409 110274875 110266602 110252631
1941.7 110252631 110245466 110250378 110248101 110240078 110240746 110244477 110246146 110246968 110239124 110227358 110221410 110214722 110203648 110195529
1970.3 110195529 110195243 110199082 110198557 110191095 110183179 110175383 110163450 110155356 110157037 110154653 110139716 110128164 110126853 110125113
1998.8 110125113 110115886 110101199 110086644 110072863 110062444 110057902 110052013 110040271 110024178 110009277 109999502 109989274
2023.3 109989274 109979856 109970796 109954882 109940457 109934807 109929502 109918118 109905636 109895301 109885454 109876549 109870422 109863853
2049.8A09863853r369o366l982m613p081j3769j5366r251l528j192j788p356j4317
2076.4A09765875j4293j0955j1885q750k623l421m733m756p642p939n460j0824j9491
2102.9A09653103j3768k003l350q452n066m757j2135j5116j2958q535N48K062q332
2129.4A09561241j2195o092m613q154q750j0372j3148r322l589m577j0658j0359n495
2155.9A09453917j1147j7476q463j395n329k110K742k241j0157r620J001J419r131
2182.4A09382010j2208r441j1098j2994n102L564m29j0169j2445o878n711j2981j5545
2208.9A09270573j2207r025l480J978J932j514l529o986r477o067P1M900M136m780
2237.5A09226525j0598m971J061Q35k635l159J705L147K50k38m256q297n01M399o640
$$ plain form
2049.8 109863853 109854484 109848118 109844136 109839523 109832442 109818673 109803307 109794056 109790528 109789336 109787548 109780192 109765875
2076.4 109765875 109751582 109740627 109728742 109719992 109717369 109713948 109709215 109704459 109696817 109688878 109683418 109672594 109653103
2102.9 109653103 109639335 109637332 109633982 109625530 109620464 109615707 109603572 109588456 109575498 109566963 109567511 109569573 109561241
2129.4 109561241 109549046 109542954 109538341 109530187 109521437 109511065 109497917 109488595 109485006 109480429 109469771 109459412 109453917
2155.9 109453917 109442770 109425294 109416831 109415436 109410107 109407997 109410739 109408498 109398341 109388721 109389722 109391141 109382010
2182.4 109382010 109369802 109360361 109349263 109336269 109331167 109334731 109334302 109324133 109311688 109304810 109299099 109286118 109270573
2208.9 109270573 109258366 109249341 109245861 109247839 109249771 109248257 109244728 109237742 109228265 109222198 109222269 109227169 109231305 109226525
2237.5 109226525 109215927 109210956 109212017 109212852 109210217 109207058 109208763 109211910 109212160 109211922 109207666 109199369 109198868 109203267 109196627
2268.1A09196627j6534j0944M125R537j705q774n972l326l076j0454j9896j4544K27
2294.6A09115291k563j9396k4247j6296r823j1325j8596k6179k4807j6928j8108k2518
2319.1A08904505j1921J812J2o223q762j4436k1446j9002p748m423j2744j8811M196
2345.6A08785009L1197N019l6108k7907J1575L1972L2067J4687j2171l3057k1768J8776
2370.1A08799291L6788K0325J0276J8489K4331J8727J4270J3959P820k193p188n258
2394.5A08949637k884l541n233o008o497r930j2672p224R29n9o318r215m971J299l469
2425.1A08873844r703l946l434q964n162K313L600j061J419Q523N174k373p128r525
2453.7A08843577o712L82k86o926o938o569q320o295m089o890j1277q917j013j347
$$ plain form
2268.1 109196627 109180093 109169149 109173274 109182811 109181106 109172332 109166360 109163034 109159958 109149504 109129608 109115064 109115291
2294.6 109115291 109112728 109093332 109069085 109052789 109042966 109031641 109013045 108986866 108962059 108945131 108927023 108904505
2319.1 108904505 108892584 108894396 108894408 108888185 108879423 108864987 108843541 108824539 108816791 108812368 108799624 108780813 108785009
2345.6 108785009 108816206 108821225 108785117 108757210 108768785 108800757 108832824 108847511 108835340 108802283 108780515 108799291
2370.1 108799291 108836079 108856404 108866680 108885169 108909500 108928227 108942497 108956456 108964276 108962083 108954895 108949637
2394.5 108949637 108946753 108943212 108937979 108931971 108925474 108915544 108902872 108895648 108896577 108896518 108890200 108880985 108876014 108877313 108873844
2425.1 108873844 108864141 108860195 108856761 108847797 108842635 108844948 108848548 108847487 108848906 108857429 108862603 108860230 108853102 108843577
2453.7 108843577 108836865 108837247 108836961 108830035 108823097 108816528 108808208 108801913 108797824 108790934 108779657 108770740 108769727 108768380
2482.2A08768380p081j1158j5891j1861l529k682k360k170r584j3185q094j0562j3960
2508.7A08656263p295m173q249q225q321j2875p260N532J454j2839q082M637J073o413
2537.3A08585227k587K455L112N889J502p570k217P498P39j2660j3161n793k086m77
2565.8A08559871r06n281o390o115j0515p569k003p129o413k086p177j0609j1266p951
2594.4A08468461j740m769j1778j3005j4055j7941j5593j0633j0503q797p951q655
2618.9A08343041j240Tj4579j5080q952j4318k4020k6727j8597p665j275q488k3580
2645.4A08177280k4390k0015k2984j8262p654q905j9872k5201k1088j8811j8144j5676
2669.9A07956278j7953k7275l7896l6359k1744o926m065j0657j4663j7679k2733k4807
$$ plain form
2482.2 108768380 108761299 108750141 108734250 108722389 108718860 108716178 108713818 108711648 108702064 108688879 108680785 108670223 108656263
2508.7 108656263 108648968 108644795 108636546 108628321 108620000 108607125 108599865 108605397 108606851 108594012 108585930 108590567 108591640 108585227
2537.3 108585227 108582640 108585095 108588207 108594096 108595598 108588028 108585811 108593309 108594048 108581388 108568227 108562434 108560348 108559871
2565.8 108559871 108558965 108553684 108547294 108541179 108530664 108523095 108521092 108513963 108507550 108505464 108498287 108487678 108476412 108468461
2594.4 108468461 108466721 108461952 108450174 108437169 108423114 108405173 108389580 108378947 108368444 108359647 108351696 108343041
2618.9 108343041 108341801 108340561 108325982 108310902 108301950 108287632 108263612 108236885 108218288 108210623 108209348 108200860 108177280
2645.4 108177280 108152890 108132875 108109891 108091629 108083975 108075070 108055198 108029997 108008909 107990098 107971954 107956278
2669.9 107956278 107938325 107911050 107873154 107836795 107815051 107808125 107804060 107793403 107778740 107761061 107738328 107713521
2694.3A07713521k3330k3448k7228l4332l9434l9172m6826n6159m8364l9804m5657
2716.8A07289767o0212p6557q9073q9442n8580k1696j9276k4665j3387N222K0921J9741
2741.2A06882763K503j7118k2006j216J6296M637j4985k8109l1686k8455l5835m5025
2765.7A06681764m4346m8792o3181p0941n0176k0504k4414m8530o6459q8131j05262
2788.2A06051028q8001o5863q5473j14536j10996r4187j03498j31011j53672j70315
2808.6A04933476j63137j47117j57213j76632j91355k15793k45666k66540k89452l21412
2828.9A02759159l64352m16970m67956n29611n74792n85854o23953o87718p24471p34574
2849.3I7048908p44956p51186p24864o73055o13875n77127o25074p45184q11433p03979
$$ plain form
2694.3 107713521 107690191 107666743 107639515 107605183 107565749 107526577 107479751 107423592 107375228 107335424 107289767
2716.8 107289767 107229555 107152998 107063925 106974483 106915903 106894207 106874931 106850266 106836879 106842101 106863022 106882763
2741.2 106882763 106885266 106868148 106846142 106844926 106861222 106865859 106850874 106822765 106791079 106762624 106726789 106681764
2765.7 106681764 106637418 106588626 106525445 106454504 106404328 106383824 106359410 106310880 106244421 106156290 106051028
2788.2 106051028 105963027 105897164 105811691 105697155 105586159 105491972 105388474 105257463 105103791 104933476
2808.6 104933476 104770339 104623222 104466009 104289377 104098022 103882229 103636563 103370023 103080571 102759159
2828.9 102759159 102394807 101977837 101509881 100980270 100405478 99819624 99195671 98507953 97783482 97048908
2849.3 97048908 96303952 95552766 94827902 94154847 93540972 92963845 92338771 91593587 90782154 90078175
2869.7I0078175l62420J81317P02459R52291R35287P78049N47653L11697J15877m0054
2890.1I4200331j63120k51126k83933k83051l15791l94779m78208n53352o40524p42065
2910.5I0094382q24011q62467q77905q89420r03035r04357q54802p59661o01143l14456
2930.9H2303125P5972M91184Q50802J040936R91362P39903L61269j13427o56033j154953
2951.3H4930140j476598j586449j489061j183510p21979j82081L82036R27389J396746
2969.7H0996633J743012J962340K069813K064037J967425J842790J693523J487607
2986I5827180J252949J027507Q44789P21049O08790N03683M28367L47983K74468K21956
3006.4A02058721J51133Q8394Q1456J00553J14250J24562J13546O6173K7645K3758
$$ plain form
2869.7 90078175 89715755 89897072 90599531 91551822 92487109 93265158 93812811 94124508 94240385 94200331
2890.1 94200331 94037211 93786085 93502152 93219101 92903310 92508531 92030323 91476971 90836447 90094382
2910.5 90094382 89270371 88407904 87529999 86640579 85737544 84833187 83978385 83218724 82617581 82303125
2930.9 82303125 82379097 82870281 83721083 84762019 85753381 86493284 86854553 86741126 86085093 84930140
2951.3 84930140 83453542 81867093 80378032 79194522 78472543 78290462 78672498 79599887 80996633
2969.7 80996633 82739645 84701985 86771798 88835835 90803260 92646050 94339573 95827180
2986 95827180 97080129 98107636 98952425 99673474 100282264 100785947 101214314 101562297 101836765 102058721
3006.4 102058721 102209854 102298248 102379704 102480257 102594507 102719069 102832615 102898788 102926433 102950191
3026.8A02950191L207m0602p2611o8617m7803p4994j06931p2491j67M5764L6526M0841
3051.3A02592313P9811Q4257P5758Q9550Q4149N1868K4522L4630O9606O8307K2066
3073.7A03276837l1173n2119j8620K0826J6796J0503J6045L350M637K2888j55m8649
3098.2A03221166m4477r18L469k7692k3294K8694K7883m0817n3966j0920K5296M8817
3122.6A03153241M1830L696l7825l8624j1862k8634q2624r6833m4084k813j8716m1235
3147.1A02795517p2979j16241q9968j2862J1837j8859n0163n3573l9291l6061m9472
3169.6A02267885n8901m8649l8958m9591n5158m4751l8255l7789m6611n0068l0195
3192A01768959j4782j7071k4247l6455l9303k7501k5654k9898j9085j2732l0267l7885
$$ plain form
3026.8 102950191 102953398 102912796 102840185 102771568 102723765 102648771 102541840 102469349 102469182 102514946 102551472 102592313
3051.3 102592313 102672124 102756381 102832139 102921689 103005838 103057706 103082228 103116858 103186464 103254771 103276837
3073.7 103276837 103245664 103193545 103174925 103195751 103212547 103223050 103239095 103242445 103247082 103269970 103269815 103221166
3098.2 103221166 103176689 103175771 103179240 103151548 103128254 103156948 103184831 103144014 103090048 103079128 103104424 103153241
3122.6 103153241 103195071 103198767 103160942 103122318 103110456 103081822 102999198 102902365 102858281 102855468 102836752 102795517
3147.1 102795517 102722538 102606297 102516329 102503467 102515304 102496445 102446282 102392709 102353418 102317357 102267885
3169.6 102267885 102208984 102160335 102121377 102071786 102016628 101971877 101933622 101895833 101849222 101799154 101768959
3192 101768959 101754177 101737106 101712859 101676404 101637101 101609600 101583946 101554048 101534963 101522231 101491964 101454079
3216.5A01454079j7834m839k0183l0970k0743k9122p4423r2113j3053O3693L8302o067
3240.9A01246727k5666n0700m1461J2600L1519j764j9002j454N269L850J5259M542
3265.4A01179719m0829p9072n0807J9241N6815N3048K9492K5559L4165K1780o92l8612
3289.9A01209807m4822J7345N9330O9559O4885j2815q9061m6277O2335J34933J36244
3312.3A01561463P8738M2891N4443M3702P653j2M1652R0707R4962O1655J6677j0788
3336.8A02083743J5986O0319Q1110R8110P3766J4866M0722J27208J31655O2465K5678
3359.2A02815628M9508P4255L5417j6606L2795J57058J91486J15716O7759P6318J00863
3381.7A03700197J20365J04809M5800j5330K2876J34862J45495L1292l9804O2037J97351
$$ plain form
3216.5 101454079 101436245 101431406 101411223 101380253 101359510 101330388 101255965 101163852 101150799 101214492 101252794 101246727
3240.9 101246727 101221061 101170361 101128900 101141500 101173019 101171255 101152253 101150799 101156068 101159918 101175177 101179719
3265.4 101179719 101138890 101059818 101009011 101028252 101085067 101138115 101167607 101193166 101227331 101249111 101248419 101209807
3289.9 101209807 101164985 101182330 101241660 101311219 101376104 101363289 101274228 101227951 101290286 101425219 101561463
3312.3 101561463 101640201 101683092 101737535 101781237 101788890 101788878 101830530 101921237 102016199 102077854 102094531 102083743
3336.8 102083743 102099729 102160048 102241158 102339268 102413034 102427900 102468622 102595830 102727485 102789950 102815628
3359.2 102815628 102865136 102939391 102974808 102958202 102990997 103148055 103339541 103455257 103523016 103599334 103700197
3381.7 103700197 103820562 103925371 103971171 103955841 103978717 104113579 104259074 104290366 104250562 104312599 104509950
3404.1A04509950J69217P9370N7757P1454R4914J04344Q0264O0737P0000P0452M0901
3426.5A05409360J5843K4175L2282K4403O2859J35088J42955Q7810N0485N3549O5052
3449A06103861N6458M0722M2975M4644L6680N0724P2348N5504K7919O4969J42085J46151
3473.4A06885040P9977L1436M4358J03604J20485Q0395O0117P1192P6318O5493N7972
3495.9A07676387N4252L8898M5752R9397J13738P7367N9104L3402K8622P0882Q9622
3518.3A08387423P6127N3370N2809P9620P9489O0487N1081M3392M7183N8258L3509
3540.8A09022748o210J9395R7537J15717P0655O3085Q3685P5710M9329L4213M1401
3563.2A09667265N1618N4479N8698P2444P4529O0082M7731K6083p86K539N5456J07467
$$ plain form
3404.1 104509950 104679167 104758537 104816294 104887748 104982662 105087006 105167270 105228007 105298007 105368459 105409360
3426.5 105409360 105425203 105449378 105481660 105506063 105568922 105704010 105846965 105934775 105985260 106038809 106103861
3449 106103861 106160319 106201041 106244016 106288660 106325340 106376064 106448412 106503916 106531835 106596804 106738889 106885040
3473.4 106885040 106965017 106996453 107040811 107144415 107264900 107345295 107405412 107476604 107552922 107618415 107676387
3495.9 107676387 107730639 107769537 107815289 107914686 108028424 108105791 108164895 108198297 108226919 108297801 108387423
3518.3 108387423 108463550 108516920 108569729 108649349 108728838 108789325 108840406 108883798 108930981 108989239 109022748
3540.8 109022748 109016538 109035933 109133470 109249187 109319842 109382927 109466612 109542322 109591651 109625864 109667265
3563.2 109667265 109718883 109773362 109832060 109904504 109979033 110039115 110086846 110112929 110112143 110114682 110170138 110277605
3587.7A10277605Q0061M9293O8927O1262K9110L8493N1558M1592N2417P4684P3743
3610.1A10898745M8125J7595J6868L0470L0220L2806M3142O1023P7462M7744J8012
3632.5A11322212K2471K7716L4178L2866K0325K0504K6583M900q11M0937M5693Q631
3657A11606205J54L9721O7318M6336K5833K9301J0944m280J5974K7502K9850M2081
3681.5A11936939L8612P271j1539M6253R7263O0725K2686J6033L0828M6754J9026j0622
3706A12300229N341J3756r417N84L0231L4464K0099l839k2614J109L8373K6143j1397
3732.5A12423062m0078m8089R084Q3971R7203L1173j6403k038j5998l8386k0062k826
3756.9A12460613p081K825J7012J108r107p439p200J1849K7764K837k9099p725K6894
$$ plain form
3587.7 110277605 110357666 110406959 110475886 110537148 110566258 110604751 110656309 110697901 110750318 110825002 110898745
3610.1 110898745 110946870 110964465 110981333 111011803 111042023 111074829 111117971 111178994 111256456 111304200 111322212
3632.5 111322212 111344683 111372399 111406577 111439443 111459768 111480272 111506855 111511755 111510944 111551881 111597574 111606205
3657 111606205 111606359 111646080 111713398 111759734 111785567 111814868 111825812 111821532 111837506 111865008 111894858 111936939
3681.5 111936939 111975551 111982822 111971283 112017536 112114799 112175524 112198210 112214243 112245071 112291825 112310851 112300229
3706 112300229 112305570 112319326 112309909 112310493 112340724 112375188 112395287 112391448 112368834 112369943 112408316 112434459 112423062
3732.5 112423062 112382984 112334895 112343979 112427950 112525153 112556326 112539923 112537885 112521887 112483501 112463439 112460613
3756.9 112460613 112453532 112456357 112473369 112474477 112465370 112457931 112450731 112462580 112490344 112493181 112464082 112456357 112483251
3783.5A12483251L6287K6012O556K468Q523J1373J8835P725l1221j8036K4175J2791
3807.9A12588739j4484m994J8072R322j9670k1457l767J3232K0564K0909J0562m184
3832.4A12612844j5593j6439o56J0002L207n949J0944M8184O5386J7894n3990k2602
3856.9A12653232J5759P475j4520j1039J4114L601j6714r846J418J9932P975k5725
3881.4A12645662k3818l839K5106K2566k4426k3663K5702M4989K5749j6105m4191k5999
3905.8A12627733M363J4174J2481O700p034j5294j085J1766K849j0133j0359n806p212
3932.3A12623143n972K765O211L362K885P164R740L636K503O962J192p99M447l34l707
3962.9A12663198l10l887J610K0182J5747j4579k1160O605K3257J7226J0932P045n114
$$ plain form
3783.5 112483251 112519538 112545550 112552106 112554574 112563097 112574470 112593305 112601030 112569809 112551773 112575948 112588739
3807.9 112588739 112574255 112569261 112587333 112596655 112576985 112555528 112551761 112564993 112585557 112606466 112617028 112612844
3832.4 112612844 112597251 112580812 112580156 112590158 112593365 112587416 112598360 112646544 112711930 112729824 112675834 112653232
3856.9 112653232 112668991 112676466 112661946 112650907 112665021 112668622 112651908 112642062 112643480 112663412 112671387 112645662
3881.4 112645662 112621844 112618005 112643111 112665677 112641251 112617588 112643290 112688279 112714028 112697923 112653732 112627733
3905.8 112627733 112632096 112646270 112658751 112665451 112658417 112643123 112642038 112653804 112656653 112646520 112636161 112630355 112623143
3932.3 112623143 112617171 112619936 112626147 112629509 112632394 112639558 112649298 112652934 112655437 112662399 112663591 112662792 112667239 112666905 112663198
3962.9 112663198 112662888 112659001 112660611 112680793 112696540 112681961 112660801 112667406 112690663 112707889 112718821 112725866 112720752
3989.5A12720752j3244j4913j5796l600
3997.6A12673199
$$ plain form
3989.5 112720752 112707508 112692595 112676799 112673199
3997.6 112673199
##END=$$ End of the data block
