##TITLE=FA162 $$ Begin of the data block
##JCAMP-DX=5.00 $$ ACD/SpecManager v 10.08
##SPECTROMETER/DATA SYSTEM=Alpha
##DATE=20 Feb 2015 09:12:38
##DATA TYPE=INFRARED SPECTRUM
##DATA CLASS=XYDATA
##ORIGIN=
##OWNER=
##NPOINTS=1765
##FIRSTX=399.76428223
##LASTX=3997.64306641
##MAXX=3997.64306641
##MINX=399.76428223
##MAXY=0.88644618
##MINY=0.21136057
##XFACTOR=1.0000000000
##YFACTOR=1.000000000000000e-9
##FIRSTY=0.79852635
##DELTAX=2.03961372
##XUNITS=1/CM
##YUNITS=ARBITRARY UNITS
##XYDATA=(X++(Y..Y))
399.8G98526347L865838N36680j673460O55472K493680k10822k866626j542449P86901
418.1H00571561N07355j032830J50085K522349J138210k532780k633571J6510j98006
436.5G98508883l439069m732788l135383l347933o902814q561254o142199l990054
452.8G58257389n026996o150782k910793J440585K165615K165735N247593R164274
469.1G64352620Q999049N543769L661990L904700K286911j523197k591192Q47220L315926
487.5G88797796J407981o23048P73073K175569L3856l079951l187895j664758l113687
505.8G81518936o097853m992843n80132R72271j502514k529144N22912L587007M053950
524.2G74952590M213393N439103N138397J881480j405298j451970L9101o88612k597869
$$ plain form
399.8 798526347 802392185 802928865 801255405 801910877 804404557 804193735 801327109 799784660 800571561
418.1 800571561 801078916 800046086 800196171 802718520 803856730 801323950 798690379 798706889 798508883
436.5 798508883 795069814 790337026 787201643 783853710 776950896 768389642 762247443 758257389
452.8 758257389 753230393 747079611 744168818 745609403 747775018 749940753 755188346 764352620
469.1 764352620 773351669 778895438 782557428 786462128 788749039 787225842 784634650 785481870 788797796
487.5 788797796 790205777 789582729 790355802 792531371 792565227 789485276 786297381 784632623 781518936
505.8 781518936 775421083 770428240 769848108 770820379 769317865 766788721 767311633 770898640 774952590
524.2 774952590 779165983 784605086 789743483 791624963 790219665 788767695 788806796 788118184 785520315
542.5G85520315j838088R09329J364708q75295j667678L70681J527369k64227j794398
560.9G83252716l74854J422704M06444j716435j412451L84390P0155k029002k362132
579.3G77641535o33240k59459k252698l625870k810597k221108l626287m674792k857745
597.6G54679739J77145J438618J207411J542747K091527N69463l052354n800247m812717
616G48041332j952470k786159n612433l403723K328038M319668J876294o65426k110839
634.3G40034282m262268p143081q794844q808016r031177j0109782j0084808p179260
650.6F74621046k708674R21846L511071O767273J0893643J2878298J0536969Q000076
667G25421548O962359L237486l32415k135754j905501j028359j519084l298223n828202
$$ plain form
542.5 785520315 783682227 784591556 785956264 785080969 783413291 783783972 785311341 785047114 783252716
560.9 783252716 782877862 784300566 784707010 782990575 781578124 781962514 782032669 780003667 777641535
579.3 777641535 777008295 776748836 774496138 770870268 768059671 765838563 762212276 757537484 754679739
597.6 754679739 754856884 756295502 757502913 759045660 761137187 761706650 758654296 752854049 748041332
616 748041332 746088862 743302703 737690270 734286547 736614585 740934253 742810547 742145121 740034282
634.3 740034282 735772014 728628933 719834089 711026073 701994896 691885114 681800306 674621046
650.6 674621046 671912372 672834218 676345289 683112562 694006205 706884503 717421472 725421548
667 725421548 732383907 735621393 735288978 733153224 731247723 730219364 728700280 725402057 719573855
685.3G19573855j0721445k0139754l1826674l8620472l4212232j7287195P623971L1377375
701.6F05767429M4421732M3422759L2357693J8810510R080351L884613L43502k602756
717.9G55485833l909171l581822l447413m216492m544974l815770l436446m444301
734.3G24089444n479157m972935l977180m408538o288707q454144j0083556j0575295
750.6F69849932r736359p816255m398406O85692N729676Q648753Q884072O820917L343463
768.9F82011485J01447j422405j571178j630724j423955L80159L256976M586160L412009
787.3F87699974J627683J091957J315594Q66056J46687R81152L708481O017805N452811
805.6G08908200K953828J618325K071977K410471J537562J08719n49913P10249L783345
$$ plain form
685.3 719573855 708852410 688712656 656885982 618265510 584053278 566766083 574390054 605767429
701.6 605767429 650189161 693611920 725969613 744780123 753860474 757745087 758088589 755485833
717.9 755485833 751576662 747994840 744547427 740330935 735785961 731970191 728533745 724089444
734.3 724089444 718610287 713637352 709660172 705251634 698962927 690508783 680425227 669849932
750.6 669849932 660113573 652297318 647898912 648584604 654314280 662963033 671847105 678668022 682011485
768.9 682011485 682112932 680690527 679119349 677488625 676064670 676444829 679701805 684287965 687699974
787.3 687699974 689327657 690419614 691735208 692601264 692747951 693729103 697437584 703455389 708908200
805.6 708908200 711862028 713480353 715552330 717962801 719500363 719609082 719059169 719769418 723552763
824G23552763P224024R608269R938061Q203327N746901L919781L539502M705429O101966
842.4G82540023O140232M413844J783371K77638J493871M181564N496383M584491K915263
860.7H13826680J606882L05116j381516k852083l477692l584624l635823l094912q77202
879.1G96834826K949000O517470Q081376P781923O696820N231321L405154J779675
895.4H39277565Q92818M34578k16425j124441j973212k670288l113985k705574j185060
913.7H27615976N85616J617551J644075J044154M90308J44541l24488q59737j107037
932.1H30850959j082421j150190j433850j646757Tj705050k044738k509057k878845
950.5H14753294l232658l815949m585981n153299n325496n172610m491568k887070
$$ plain form
824 723552763 730776787 740385056 750323117 758526444 764273345 768193126 771732628 776438057 782540023
842.4 782540023 788680255 793094099 794877470 795155108 796648979 800830543 806326926 810911417 813826680
860.7 813826680 815433562 815738678 814357162 811505079 808027387 804442763 800806940 797712028 796834826
879.1 796834826 799783826 806301296 814382672 822164595 828861415 834092736 837497890 839277565
895.4 839277565 840170383 840604961 840388536 839264095 837290883 834620595 831506610 828801036 827615976
913.7 827615976 828201592 829819143 831463218 832507372 832997680 833142221 832817733 831957996 830850959
932.1 830850959 829768538 828618348 827184498 825537741 823890984 822185934 820141196 817632139 814753294
950.5 814753294 811520636 807704687 803118706 797965407 792639911 787467301 782975733 780088663
966.8G80088663m50194K014578L550768L773570K987384J768172N52535m23491j137018
985.1G92724967j701951k254725k959191l898621n201578p077992q530855p614911
1001.4G53485143n516112n455970p097304q185029p999599o379068l295839L72648
1017.8G09928870L383637N074799N064845L890455M008591O599188Q715331P404924
1034.1G54070640L602087p5519k367675l535390m177273m739761n442023o305337p350803
1052.4G23678946q665144j0208726j1630118j2480557j2324571j0961056r449244j0085046
1068.8F37874484j4129043k0316600k5420130k6372492k3520827k0899654k1318346
1083D85897392k2667885k1146148j6128302r916156m262120Q44628N904257J1172354
$$ plain form
966.8 780088663 779638469 781653047 785203815 788977385 791964769 793732941 794285476 793861985 792724967
985.1 792724967 791023016 788768291 785809100 781910479 776708901 769630909 761100054 753485143
1001.4 753485143 747969031 742513061 735415757 727230728 719231129 712852061 709556222 709928870
1017.8 709928870 713312507 718387306 723452151 727342606 731351197 737950385 746665716 754070640
1034.1 754070640 757672727 757597208 755229533 751694143 747516870 742777109 737335086 731029749 723678946
1052.4 723678946 715013802 704805076 693174958 680694401 668369830 657408774 647959530 637874484
1068.8 637874484 623745441 603428841 578008711 551636219 528115392 507215738 485897392
1083 485897392 463229507 442083359 425955057 416038901 411776781 412621409 418525666 429698020
1099.4D29698020J7549396K6909679L8427114M6005667M3723464L2453239J9105494
1113.6F53872073J1401593J1691332J5047848J5248597J0482073K740622n114556j0890662
1129.9G04478920j3405681j2415946q642554l917098j56939K707422N956411R631455
1146.3F84235990J2653709J3617813J1704624Q168697N257547L387272J093626k828598
1162.6G37290680q133649j2531162j2249768n796074K788782P466316O673336L349543
1178.9G18858004J45375k516269m953087o949663p853389p054209m577637j570642
1195.2F83528483K5988j067281m420042q834958j3667286j8745780k3929953k9306054
1211.5E83583117l4843743l9708674m2531133m2341620l9276927l4142763k7067602
$$ plain form
1099.4 429698020 447247416 474157095 512584209 558589876 602313340 634766579 653872073
1113.6 653872073 665273666 676964998 692012846 707261443 717743516 720484138 715369582 704478920
1129.9 704478920 691073239 678657293 670014739 666097641 665940702 668648124 674604535 684235990
1146.3 684235990 696889699 710507512 722212136 730380833 735638380 739025652 740119278 737290680
1162.6 737290680 729157031 716625869 704376101 698580027 701368809 708835125 715508461 718858004
1178.9 718858004 719003379 716487110 711534023 704584360 696730971 689676762 685099125 683528483
1195.2 683528483 683554471 682487190 678067148 669232190 655564904 636819124 612889171 583583117
1211.5 583583117 548739374 509030700 466499567 424157947 384881020 350738257 323670655
1225.8C23670655j7332017m631042R802132K3204983L2913714L8156987L9270490L6904722
1242.1D81960624L3416182L1686545L2236039L3383131L3208609K9939115K1968007
1256.4F97798252R173989o376326j9737303k3283184j3335883L045976J4271736J5681982
1272.7F77239239J0439456L111243m179657j1045992j7053962k0553291j9835591j6173541
1289F01947904j3052225j1660994j0813891r772122q539737p282018n995393m189611
1305.4E30641913q72969M540562J0763050J4656901J4231443J1188865Q222878O341696
1321.7E99714339O399512R467006J5037656K0846545K4448276K4686515K1745324J6355932
1338G38701105R100497J262247m173278l856957K131641P973969Q514225L624737n129933
$$ plain form
1225.8 323670655 306338638 301707596 311509728 334714711 367628425 405785412 445055902 481960624
1242.1 481960624 515376806 547063351 579299390 612682521 645891130 675830245 697798252
1256.4 697798252 706972241 700595915 680858612 657575428 644239545 647285521 661557257 677239239
1272.7 677239239 687678695 690789938 686610281 675564289 658510327 637957036 618121445 601947904
1289 601947904 588895679 577234685 566420794 556648672 548108935 540826917 534831524 530641913
1305.4 530641913 529768944 534309506 545072556 559729457 573960900 585149765 593372643 599714339
1321.7 599714339 606113851 615580857 630618513 651465058 675913334 700599849 722345173 738701105
1338 738701105 747801602 749063849 744890571 741033614 743165255 751139224 759653449 763278186 758148253
1356.4G58148253j6225517k8369844l8100421l6455810k1282733J265049K1876574
1370.6F40855551L0351102K6281655J4547706K712667o263793j2488544j5509009j5217662
1386.9F65269673j0927975n450309l517389m898846o339312o302297n449533n209744
1403.3F17174268m927397l666759m068434o103039n636155j919389J837313L987491
1419.6E96677899L871560K862454J847505n36k506733m368067n976796r188175j1415184
1437.9E71803927j0160803q794248o675542m280567m174471o113470q607804r881139
1454.3E13115883q061469Q32856R167135J2163639J6028881J8859386J6870559J4671206
1470.6E93648076J5097082J4849424J3472080J2598574J1445284R255469N815149K156436
$$ plain form
1356.4 758148253 741922736 713552892 675452471 638996661 617713928 618978977 640855551
1370.6 640855551 671206653 697488308 712036014 714748681 708484888 695996344 680487335 665269673
1386.9 665269673 654341698 648891389 645374000 640475154 634135842 627833545 622384012 617174268
1403.3 617174268 612246871 608580112 604511678 598408639 592772484 590853095 592690408 596677899
1419.6 596677899 600549459 603411913 605259418 605258882 602752149 598384082 592407286 583219111 571803927
1437.9 571803927 561643124 552848876 546173334 541892767 537718296 531604826 522997022 513115883
1454.3 513115883 505054414 505887270 515054405 527218044 543246925 562106311 578976870 593648076
1470.6 593648076 608745158 623594582 637066662 649665236 661110520 670365989 676181138 678337574
1486.9F78337574q82328j405358K176941R448885J8538058K0974994J5817761J0151625
1503.2G53158152P441342Q897424Q731961O018400L936947K305865J480818R90569
1519.5G92961478J071811J799703J446604P59483K51054p06732j191199j014173k321899
1537.9G93056130l872215j937628j28985l72111j171887j991034k563119l381967m394114
1556.2G73243070n520106l295362p80821k069473l482461m358530m573464l820777
1572.6G45342076m714251o335735n863607o425142p914305p361412n706549n586862
1588.9F95434213p594407j0377943j3067544j4752090j4208674j1697352r991288j1449457
1605.2F02295458j5295982j9207120k1585107k2672891k6459337l0028224k2929549
$$ plain form
1486.9 678337574 677455246 676049888 678226829 687675714 706213772 727188766 743006527 753158152
1503.2 753158152 760599494 769496918 778228879 784247279 788184226 790490091 791970909 792961478
1519.5 792961478 794033289 795832992 797279596 798039079 798290133 797583401 796392202 795378029 793056130
1537.9 793056130 789183915 787246287 787117302 786745191 785573304 783582270 781019151 777637184 773243070
1556.2 773243070 767722964 764427602 763646781 761577308 758094847 753736317 749162853 745342076
1572.6 745342076 740627825 734292090 728428483 722003341 714089036 706727624 701021075 695434213
1588.9 695434213 687839806 677461863 664394319 649642229 635433555 623736203 613744915 602295458
1605.2 602295458 586999476 567792356 546207249 523534358 497075021 467046797 444117248
1619.5D44117248j6110957j3126105q288741m125833k177090j294762j587659j548439
1635.8C95857662P91550L559231O842554J1891156K1271259K7834266K1627218J6738385
1652.1E06413281J4565110M893303l565133j0749518j8869132k3995817k5285184l0364782
1668.4D13042128l4031480k6679606k0129293j4743715q237660o066651q366197j2843162
1684.7B81944364j2584716j2337237j3869569j2678310j0816485p298067r99406N353182
1701.1B16713756R660259J5112549K1983102K5679052K7646423K9962033L4209996
1715.3C80967170M2499661M3830604L6733925L4571946L3591270L0031443K6147067
1729.6F28373086K2020579K1422088K0049870J4495552J2290060J1664987J0022282
$$ plain form
1619.5 444117248 428006291 414880186 406591445 402465612 400288522 398993760 397406101 395857662
1635.8 395857662 396649212 400208443 407050997 418942153 440213412 468047678 489674896 506413281
1652.1 506413281 520978391 525871694 522306561 511557043 492687911 468692094 443406910 413042128
1668.4 413042128 379010648 352331042 332201749 317458034 309220374 303153723 294787526 281944364
1684.7 281944364 269359648 257022411 243152842 230474532 219658047 212359980 211360574 216713756
1701.1 216713756 226374015 241486564 263469666 289148718 316795141 346757174 380967170
1715.3 380967170 423466831 467297435 504031360 538603306 572194576 602226019 628373086
1729.6 628373086 650393665 671815753 691865623 706361175 718651235 730316222 740338504
1743.9G40338504Q806348P686973P536590P860243O946862N849659N295813M827500
1760.2G95148492N078435N245209M255175L501415L380418M552365N668342N078613
1776.5H31908464M286468M173935M103303L607035L117740K214193J373529J657188
1792.8H56441855K156675J630366J046538J112938J418889J343667J024902R24647
1809.2H67100477J136899J444638J406610J295030J176536Q02815M53890O75261Q25822
1827.5H76317978P94828J440585J697301J301349R98616O94811R5368K6166Q46684
1845.9H84213686J062036O35802L55304J79350r8646l06070l04341k98262o86228j379669
1866.3H83372962j464784m86493j0252n23031q65757p49350n60402m74453l12329j22309
$$ plain form
1743.9 740338504 749144852 756831825 764368415 772228658 779175520 785025179 790320992 795148492
1760.2 795148492 800226927 805472136 809727311 813228726 816609144 821161509 826829851 831908464
1776.5 831908464 836194932 840368867 844472170 848079205 851196945 853411138 854784667 856441855
1792.8 856441855 858598530 860228896 861275434 862388372 863807261 865150928 866175830 867100477
1809.2 867100477 868237376 869682014 871088624 872383654 873560190 874363005 874816895 875492156 876317978
1827.5 876317978 877112806 878553391 880250692 881552041 882550657 883245468 883340836 883367002 884213686
1845.9 884213686 885275722 885911524 886266828 886446178 886347532 886041462 885737121 885438859 884752631 883372962
1866.3 883372962 881908178 881421685 881411433 880888402 880022645 879273295 878712893 878238440 877926111 877803802
1886.7H77803802M5181L11851L16739J78636L48150M25637K22683J23799J85013J78814
1907.1H80140305O6697N1260L7790j92524m08709l06844k73288k66552j30653l79681
1927.5H78337801p82311r20237r24348j029969j217544j385152j337349q47698l62158
1945.8H69531035j74105M709J82331K47955L39448M66586M92632L56257J28627Q5354
1966.2H71660829L83675O20246N24401M18484M66824M77791L18170J32322M0173P213
1986.6H75050128p9632j67847j4544J99974J38044k1696o3121o2346o8427j00553j70767
2009H74639213k17497k44320l35812l91782l43740l38733m41849m19021n9902K15172
2029.4H72061729J27554k0027q4758j06930p6890J6451P1346L100o4910m5418k5094
$$ plain form
1886.7 877803802 877848983 878160834 878477573 878656209 879004359 879429996 879652679 879776478 879961491 880140305
1907.1 880140305 880207002 880258262 880296052 880103528 879694819 879387975 879114687 878848135 878717482 878337801
1927.5 878337801 877555490 876635253 875710905 874680936 873463392 872078240 870740891 869893193 869531035
1945.8 869531035 869356930 869361639 869543970 869791925 870131373 870597959 871090591 871446848 871575475 871660829
1966.2 871660829 872044504 872664750 873189151 873607635 874074459 874552250 874870420 875002742 875042915 875050128
1986.6 875050128 874970496 874802649 874788105 874988079 875126123 875104427 875041306 874978960 874910533 874809980 874639213
2009 874639213 874421716 874177396 873841584 873449802 873106062 872767329 872325480 871906459 871846557 872061729
2029.4 872061729 872189283 872169256 872084498 871977568 871900678 871917129 871988475 871991575 871926665 871881247 871856153
2051.9H71856153o0439j06514j27613j70708k65479l55661l23653k20180k39849l50594
2072.3H69635463l69251k76268k21490k61069k87711k31207j78098k03848k22743j64688
2092.7H67219090j14977j45733k20597k40028j59383j07229j48296j42395j5319J02520
2113.1H66027653J14322Q3089J39117K43604K32160J17779N8472R6500Q8871l6657
2133.5H67164910j77086j88231j19448j43349k39372k57909j95981j67787k04324k22206
2153.9H65249217j50383q7380j23442j72138j22964n6446r6500j23143l3557M6134
2174.3H64329398J3828o7473q1062l9100o4016j47581j91927j86264j87159k34425
2194.6H63144219k97248k84851k07901k12014k84970k87890k27928k05398k35438k76208
$$ plain form
2051.9 871856153 871795714 871689200 871561587 871390879 871125400 870769739 870446086 870225906 869986057 869635463
2072.3 869635463 869266212 868989944 868768454 868507385 868219674 867988467 867810369 867606521 867383778 867219090
2092.7 867219090 867104113 866958380 866737783 866497755 866338372 866231143 866082847 865940452 865925133 866027653
2113.1 866027653 866141975 866225064 866364181 866607785 866839945 866957724 867016196 867112696 867201567 867164910
2133.5 867164910 866987824 866799593 866680145 866536796 866297424 866039515 865843534 865675747 865471423 865249217
2153.9 865249217 865098834 865011454 864888012 864715874 864592910 864536464 864439964 864316821 864283264 864329398
2174.3 864329398 864343226 864275753 864194691 864155591 864091575 863943994 863752067 863565803 863378644 863144219
2194.6 863144219 862846971 862562120 862354219 862142205 861857235 861569345 861341417 861136019 860900581 860624373
2215H60624373k71022k22803k29537k59638k09927j42456j49846k21788k64824k22981
2235.4H58429551j82450j80959j75000j55151j67787k40922k87473k63810k31087k31207
2255.8H56313705k22563j58847o7532l5524o7473p1466m5836o4849j33217j93774k07305
2278.3H55045319k12729k50101k60473k38478k57909l10421l21508k81870k23279j93119
2298.7H52495432k21133k30074k39253l29078m43339m96387m71652m07755l76046l83496
2319.1H48897219l56257l01242l13640m26590n18978n40972n26309m55379l17037j71542
2339.5H44969273j34349j21057P3313K71440J25408k92659o43015o55829n40197n00918
2359.9H42551410m23312k32398p5460o3360j1682J80483L29315L53635L47495L60191
$$ plain form
2215 860624373 860353351 860130548 859901011 859641373 859431446 859288990 859139144 858917356 858652532 858429551
2235.4 858429551 858247101 858066142 857891142 857735991 857568204 857327282 857039809 856775999 856544912 856313705
2255.8 856313705 856091142 855932295 855864763 855829239 855761766 855690300 855644464 855579615 855446398 855252624 855045319
2278.3 855045319 854832590 854582489 854322016 854083538 853825629 853515208 853193700 852911830 852688551 852495432
2298.7 852495432 852274299 852044225 851804972 851475894 851032555 850536168 850064516 849656761 849280715 848897219
2319.1 848897219 848540962 848239720 847926080 847499490 846980512 846439540 845913231 845457852 845140815 844969273
2339.5 844969273 844834924 844713867 844787180 845058620 845184028 844891369 844248354 843592525 843052328 842551410
2359.9 842551410 842128098 841895700 841820240 841756880 841745198 841925681 842254996 842608631 842956126 843316317
2380.2H43316317L81589L75628K85149J33991K9206m887l8088q0347q8274p9096j14262
2402.7H44116926j76608j74582j12355r1374j25825j52469j42455j25110j54615k10106
2423.1H42651427j98066j15812o7294q9943j20640j36078j73270k20835k52903k44141
2443.5H41032445k23934k77102l51131l27230k54154k47240k63989k22564j58012j44481
2463.9H38562608j92166k46405k71261k79486k90394k96354k61843j96457j75357j79768
2484.3H36173117j50621r7632q7619j67549k36809k08437j72913k21014k87652k93136
2504.7H34249735k83063l21805l79622l85761l51787l56376l91662l79503k97248j93775
2525.1H30909133j49906j62303j71542j80781k15590k50161k57015k45989k51829k84016
$$ plain form
2380.2 843316317 843697906 844073534 844358683 844492674 844521880 844516993 844478905 844398558 844310284 844231188 844116926
2402.7 844116926 843940318 843765736 843653381 843562007 843436182 843283713 843141258 843016148 842861533 842651427
2423.1 842651427 842453361 842337549 842270255 842180312 842059672 841923594 841750324 841529489 841276586 841032445
2443.5 841032445 840808511 840531409 840180278 839853048 839598894 839351654 839087665 838865101 838707089 838562608
2463.9 838562608 838370442 838124037 837852776 837573290 837282896 836986542 836724699 836528242 836352885 836173117
2484.3 836173117 836022496 835924864 835837245 835669696 835432887 835224450 835051537 834830523 834542871 834249735
2504.7 834249735 833966672 833644867 833265245 832879484 832527697 832171321 831779659 831400156 831102908 830909133
2525.1 830909133 830759227 830596924 830425382 830244601 830029011 829778850 829521835 829275846 829024017 828740001
2545.5H28740001k69532j89305j38521j40607j47403j27017r3997j15156j81258k13384
2565.8H27123821j95980j84238k28763k99513l54886l98279m25696m13537l70800l51489
2586.2H23900640l79503m13060m27425m24862l98099l56913l13103k87056k95699l21686
2606.6H20283234l23057k72691k09689k14696k81990l31461l62754l98457m30942m70340
2627H16987157n11050n01931m42147m16577m38392m32551l94702l78311l55244k96831
2647.4H12819421k42769k16544k06053j81020j55568j60336j78099k17915k67744k89261
2667.8H10704112k88904k93135l05236k70247k18570k61784l54469l63767l16322l32355
2688.2H07699323m00842m25934m32313n00381n95271o13451n68271n77271o44267o98208
$$ plain form
2545.5 828740001 828470469 828281164 828142643 828002036 827854633 827727616 827633619 827518463 827337205 827123821
2565.8 827123821 826927841 826743603 826514840 826215327 825860441 825462162 825036466 824622929 824252129 823900640
2586.2 823900640 823521137 823108077 822680652 822255790 821857691 821500778 821187675 820900619 820604920 820283234
2606.6 820283234 819960177 819687486 819477797 819263101 818981111 818649650 818286896 817888439 817457497 816987157
2627 816987157 816476107 815974176 815532029 815115452 814677060 814244509 813849807 813471496 813116252 812819421
2647.4 812819421 812576652 812360108 812154055 811973035 811817467 811657131 811479032 811261117 810993373 810704112
2667.8 810704112 810415208 810122073 809816837 809546590 809328020 809066236 808711767 808348000 808031678 807699323
2688.2 807699323 807298481 806872547 806440234 805939853 805344582 804731131 804162860 803585589 802941322 802243114
2708.6H02243114p14303o85691o90818p75933p91133p02083o63459p04170p48574p43330
2729G95023620p26700p87139q73267q68023q27729q52228q90672q88765q81970r43124
2749.4G86484003j081228j159370j106024j076579j133323j157701j131236j119316
2765.7G77519226j170099j263380j272976j193524j199901j324653j412034j373470
2782G67309189j329303j424074j575351j622796j592040j633883j743257j790881j761913
2800.4G52835691j758039j847506j889467j743257j578331j560151j549602j356363
2816.7G39552975j040995q46148q16822p36833n65409n68271q30114j089811j246751
2835.1G31811821j497209j957357k479791k848745l079593l281295l280044k787053
$$ plain form
2708.6 802243114 801528811 800843120 800152302 799376369 798585236 797883153 797219694 796515524 795766950 795023620
2729 795023620 794296920 793509781 792636514 791768491 790940762 790088534 789197862 788309097 787427127 786484003
2749.4 786484003 785402775 784243405 783137381 782060802 780927479 779769778 778638542 777519226
2765.7 777519226 776349127 775085747 773812771 772619247 771419346 770094693 768682659 767309189
2782 767309189 765979886 764555812 762980461 761357665 759765625 758131742 756388485 754597604 752835691
2800.4 752835691 751077652 749230146 747340679 745597422 744019091 742458940 740909338 739552975
2816.7 739552975 738511980 737665832 736849010 736112177 735546768 734978497 734148383 733058572 731811821
2835.1 731811821 730314612 728357255 725877464 723028719 719949126 716667831 713387787 710600734
2851.4G10600734j893997j083196p75277r82285j451373k005756k498865k622783k090395
2869.7F95196807j134872m66228m69386q97944j441300k056062k757192l431618l933370
2888.1F78608835m306376m710436n097032n280196n202949m754782l767789k380490
2904.4F43108785j157343p52568j291991k301156l199041l721655l931403l889084
2920.7F22864544l529250k846360k007544j196623m55976K70546J017570J712918K183617
2939.1F18013442K322018K020418J200557J17481p57694j126111j067161p46012j77324
2957.4F19799614N02050R41813Q38518K47300m74930j092970j522244j574814r58502
2975.8F16705835N05030K573431M794180O833434Q263707Q742690Q454800P744849
$$ plain form
2851.4 710600734 708706737 707623541 706848264 705865979 704414606 702408850 699909985 697287202 695196807
2869.7 695196807 694061935 693595707 693126321 692228377 690787077 688731015 685973823 682542205 678608835
2888.1 678608835 674302459 669592023 664494991 659214795 654011846 649257064 645489275 643108785
2904.4 643108785 641951442 641198874 639906883 637605727 634406686 630685031 626753628 622864544
2920.7 622864544 619335294 616488934 614481390 613284767 612828791 613099337 614116907 615829825 618013442
2939.1 618013442 620335460 622355878 623556435 623673916 622916222 621790111 620722950 619976938 619799614
2957.4 619799614 620301664 621243477 622081995 622329295 621854365 620761395 619239151 617664337 616705835
2975.8 616705835 617210865 619784296 624578476 631411910 639675617 648418307 656873107 664617956
2992.1F64617956O780743N712271M534841L342867K559363K282620K168715J895785
3008.4F93895161J332045M85480o00398j874864l251076m475593n225718n381525m747391
3026.8F70156121l136515j049400M85420P48098J45793m12106r91523k011836l179193
3045.1F60754859m050850m512847m729211m835069m853309m846513m635572m029095
3061.5F24262393l218949k460301k038718k143561k463162k587676k522111k590955
3077.8F04236960k944290l166318k870739k193629j318872n12004p3850J10924K39908
3096.1E91508090L71159N40197Q13066J273394J794756K095818K155423K324701K623736
3114.5F05500340K688230K570569K439618K306163K352953K606571K840400K919972
$$ plain form
2992.1 664617956 671398699 677110970 681645811 684988678 687548041 689830661 691999376 693895161
3008.4 693895161 695227206 695712686 695112288 693237424 689986348 685510755 680285037 674903512 670156121
3026.8 670156121 667019606 665970206 666455626 667203724 667349517 666937411 665945888 663934052 660754859
3045.1 660754859 656704009 652191162 647461951 642626882 637773573 632927060 628291488 624262393
3061.5 624262393 621043444 618583143 616544425 614400864 611937702 609350026 606827915 604236960
3077.8 604236960 601292670 598126352 595255613 593061984 591743112 591231108 591157258 591268182 591508090
3096.1 591508090 591879249 592419446 593232512 594505906 596300662 598396480 600551903 602876604 605500340
3114.5 605500340 608188570 610759139 613198757 615504920 617857873 620464444 623304844 626224816
3130.8F26224816K968430L166914L452540L538072L291130L045559L003895K925337
3147.1F51616693K715230K350032J724720J084924O49690K02716k92838o81818j030862
3165.5F58338487j477063j933693k238274k471626k786815l134251l353119l472983
3181.8F37470663l639400l847361l994644m083454m173935m234135m244804m185736
3198.1F05067194m004777l758073l528476l275156k938628k504766k055108j658857
3214.4E81343353j267314q50558m10200J9074M21464Q17597J178384J454949J695097
3232.8E84401846J962066K211809K401650K528369K610982K706647K806484K794266
3249.1F04424119K676785K574503K513051K404988K198696J972258J810372J667917
$$ plain form
3130.8 626224816 629193246 632360160 635812700 639350772 642641902 645687461 648691356 651616693
3147.1 651616693 654331923 656681955 658406675 659491599 660141289 660344005 660051167 659369349 658338487
3165.5 658338487 656861424 654927731 652689457 650217831 647431016 644296765 640943646 637470663
3181.8 637470663 633831263 629983902 625989258 621905804 617731869 613497734 609252930 605067194
3198.1 605067194 601062417 597304344 593775868 590500712 587562084 585057318 583002210 581343353
3214.4 581343353 580076039 579225481 578815281 578834355 579255819 580073416 581251800 582706749 584401846
3232.8 584401846 586363912 588575721 590977371 593505740 596116722 598823369 601629853 604424119
3249.1 604424119 607100904 609675407 612188458 614593446 616792142 618764400 620574772 622242689
3265.4F22242689J407385J042902P46906N41270L35157P0631k69949o11246q97765
3283.8F24607980j169204j415849j552224j612842j663804j607538j400709j143277
3300.1F13042533q79228n87225l01718p8798R1136K93314N70834Q31485R97245J155078
3320.5F15134656J394868J678825J953006K207219K443791K645552K812743K906501
3336.8F33177161K854645K665997K415001K148569J794457J363218J040161Q77440
3353.1F48336649P40707N51343L98815L25024J76251q1957k42948k25604k06292l28362
3373.5F49443626n11407o13571o27756o08682n75662m78983l02970j74940J4842M08709
3393.9F45973206P34448Q03411Q01086R68695J193762J193881J007259Q26120P52509
$$ plain form
3265.4 622242689 623650074 624692976 625439882 625981152 626316309 626386940 626116991 625505745 624607980
3283.8 624607980 623438776 622022927 620470703 618857861 617194057 615586519 614185810 613042533
3300.1 613042533 612163305 611576080 611274362 611195564 611286700 611580014 612150848 612982333 613979578 615134656
3320.5 615134656 616529524 618208349 620161355 622368574 624812365 627457917 630270660 633177161
3336.8 633177161 636031806 638697803 641112804 643261373 645055830 646419048 647459209 648336649
3353.1 648336649 649077356 649628699 650027514 650352538 650528789 650446832 650203884 649978280 649771988 649443626
3373.5 649443626 648932219 648318648 647690892 647082210 646506548 646027565 645724595 645549655 645564497 645973206
3393.9 645973206 646707654 647511065 648312151 649280846 650474608 651668489 652675748 653501868 654254377
3412.3F54254377Q13424Q32201O66260N23091O17683P74264P46131O54697O83427Q20994
3432.7F61386549R19223R19760R36687J040101J139700J104891J115024J302600J389325
3451F71253860J256108J106322J062930J079142J039088R89139J043617J100839R82761
3469.4F80913806P52091P29502R24229J061559R57668P39753P84457R84072J011849
3487.7F88858986R71436J001537J053751J104831J058817R15647R08017J044214J067161
3506.1F97984397R77040J061558J342953J405656J192570J070142J107275J198769
3522.4G07340360J203358J114905J240253J526892J569987J456797J402497J383901
3538.7G18238950J406848J317978J145482J227975J449943J441538J399577J506745
$$ plain form
3412.3 654254377 655067801 655900002 656566262 657089353 657707036 658481300 659227431 659882128 660565555 661386549
3432.7 661386549 662305772 663225532 664162219 665202320 666342020 667446911 668561935 669864535 671253860
3451 671253860 672509968 673616290 674679220 675758362 676797450 677786589 678830206 679931045 680913806
3469.4 680913806 681665897 682395399 683319628 684381187 685338855 686078608 686863065 687847137 688858986
3487.7 688858986 689830422 690831959 691885710 692990541 694049358 694965005 695873022 696917236 697984397
3506.1 697984397 698961437 700022995 701365948 702771604 703964174 705034316 706141591 707340360
3522.4 707340360 708543718 709658623 710898876 712425768 713995755 715452552 716855049 718238950
3538.7 718238950 719645798 720963776 722109258 723337233 724787176 726228714 727628291 729135036
3555G29135036J552165J533449J428544J030028O86467J344681K497136K539277J973272
3573.4G43720055J770079J835406J959264K037763J733959J168072J345754K283812
3589.7G57854164K385080J933693J993001K219260K155184K096594J832902J209378
3606G73679256J060069J491725J711071J751363J522422J362264K054692K385377J478434
3624.4G88496673K43604K35379J902044K442717J865030J457274J121580Q19445N07534
3642.7G99091280k04623j041353l60787J910329K436757J412094J154959J498341J105309
3661.1H07002306M76956k2232q12113j126826k28763j04189l79622R35197J731336
3679.4H07472050J312912O52730j51038p51317l20315R18031J333654P81297O7652
$$ plain form
3555 729135036 730687201 732220650 733649194 734679222 735365689 736710370 739207506 741746783 743720055
3573.4 743720055 745490134 747325540 749284804 751322567 753056526 754224598 755570352 757854164
3589.7 757854164 760239244 762172937 764165938 766385198 768540382 770636976 772469878 773679256
3606 773679256 774739325 776231050 777942121 779693484 781215906 782578170 784632862 787018239 788496673
3624.4 788496673 788740277 788975656 790877700 793320417 795185447 796642721 797764301 798583746 799091280
3642.7 799091280 798886657 797845304 797484517 799394846 801831603 803243697 804398656 805896997 807002306
3661.1 807002306 807479262 807457030 806644917 805518091 805289328 805185139 804805517 805740714 807472050
3679.4 807472050 808784962 809437692 809286654 808535337 808215022 809133053 810466707 811248004 811315656
3697.8H11315656l87788k43843L10362J20639p88509j262010l13282J043022J003564
3716.2H10797811J39772m92870n75304k53141K00927K40087n54382j455844j110852
3734.5H06936204M78924J244962K61009j266837j371801j42336l58343n06878J006722
3752.9H06281626J394689M12286J1265M44770L09109l21567m96387k10106L46362N54681
3773.3H08726728R2506m11629m22597r1732k6643k3842J72556J51693j69992o09756
3793.7H07387292q47339p88033r74417o33061M01914M19259L76880O52492O9023r44436
3814.1H05119574j197517p73311p17699M7266R27628N82873P4804l05116n62191o46472
3834.4H02549839r49085p81953J98126P86125Q33631M67658n05924j910687k421975
$$ plain form
3697.8 811315656 810927868 810684025 810994387 811115026 810326517 809064507 808751225 809794247 810797811
3716.2 810797811 810937583 810444713 809869409 809616268 809817195 810057282 809502900 808047056 806936204
3734.5 806936204 807415128 808660090 808921099 807654262 806282461 806140125 805781782 805274904 806281626
3752.9 806281626 807676315 808088601 808099866 808544636 808853745 808532178 808035791 807825685 808172047 808726728
3773.3 808726728 808819234 808407605 807985008 807893276 807866633 807842791 808015347 808167040 807997048 807387292
3793.7 807387292 806539953 805751920 804777503 804144442 804546356 804965615 805342495 805994987 806064010 805119574
3814.1 805119574 803922057 803148746 802431047 802478313 803405941 803988814 804063618 803758502 803196311 802549839
3834.4 802549839 801600754 800818801 801016927 801803052 802636683 803104341 802598417 800687730 798265755
3852.8G98265755M6730J879573J060307j97828p56263l88325j96516n45740j70350
3871.2G98997343N37157O84619J98960o66320n87643j8537L8565J70767m5538k42293
3891.6G99067080K76268K02059p61151j293957q04365K02715J021386J000940M33684
3909.9G99344659l1769l91365o64770m43280M3929O3181j37389k1577l4809l10481
3930.3G97416329j50144K75791K61784n3525l36886l74019j28448n5909j23024J6272
3950.7G96748221J41859Q2791m1664j58965k20478j56462p5400r9182j54376j51575
3971.1G95914769j22487j16051j08480r1493l5942j8954j37270k60591k51591j53542
3991.5G94618368j06156j11222j04427
$$ plain form
3852.8 798265755 798312485 800192058 801252365 801054537 800298274 799909949 799713433 799167693 798997343
3871.2 798997343 799534500 800219119 800418079 799751759 799164116 799145579 799184144 799354911 799309373 799067080
3891.6 799067080 799343348 799545407 798784256 797490299 796685934 796888649 797910035 798910975 799344659
3909.9 799344659 799312890 798921525 798256755 797813475 797857404 797920585 797783196 797761619 797726810 797416329
3930.3 797416329 797266185 797541976 797803760 797750235 797413349 797039330 796910882 796854973 796731949 796748221
3950.7 796748221 796890080 796972871 796931207 796772242 796551764 796395302 796319902 796220720 796066344 795914769
3971.1 795914769 795792282 795676231 795567751 795476258 795440316 795421362 795284092 795023501 794771910 794618368
3991.5 794618368 794512212 794400990 794296563
3997.6G94296563
$$ plain form
3997.6 794296563
##END=$$ End of the data block
