##TITLE=FA156 $$ Begin of the data block
##JCAMP-DX=5.00 $$ ACD/SpecManager v 10.08
##SPECTROMETER/DATA SYSTEM=Alpha
##DATE=20 Feb 2015 09:12:38
##DATA TYPE=INFRARED SPECTRUM
##DATA CLASS=XYDATA
##ORIGIN=
##OWNER=
##NPOINTS=1765
##FIRSTX=399.76428223
##LASTX=3997.64306641
##MAXX=3997.64306641
##MINX=399.76428223
##MAXY=0.87598681
##MINY=0.33370137
##XFACTOR=1.0000000000
##YFACTOR=1.000000000000000e-9
##FIRSTY=0.78534281
##DELTAX=2.03961372
##XUNITS=1/CM
##YUNITS=ARBITRARY UNITS
##XYDATA=(X++(Y..Y))
399.8G85342813K522766J042783Q83341J937568J731515O49155L23057n00322k988934
$$ 785342813 787865579 788908362 789791703 791729271 793460786 794109941 794432998 793932676 790943742
418.1G90943742m153192k466619j157224O53922L234744L645599J308143o30021p22825
$$ 790943742 786790550 784323931 783166707 783820629 787055373 790700972 792009115 791379094 790656269
436.5G90656269j063586k708375l776312m219711n914748p772505p974684p362843
$$ 790656269 789592683 786884308 783107996 778888285 772973537 765201032 757226348 749863505
452.8G49863505o978094o646574n717695n482256n313277n45502P927358J2840152
$$ 749863505 742885411 736238837 730521142 725038886 719725609 719180107 727107465 739947617
469.1G39947617J2640655J1654615J0120512O955802M056454K957463K012908n6207
$$ 739947617 752588272 764242887 774363399 781319201 785375655 788333118 790346026 790289819
485.4G90289819j356780j451373k681017m981160n765856n340278o409466r502769
$$ 790289819 788933039 787481666 784800649 779819489 774053633 768713355 762303889 752801120
501.7G52801120j2564361j5176117j4641106l613115J3490081K0097554J2973070P055163
$$ 752801120 740236759 725060642 710419536 706806421 720296502 740394056 753367126 760422289
518.1G60422289R336412J0402084O107926K540290K239883J529515n72681j046241
$$ 760422289 769758701 780160785 786268711 788809001 791048884 792578399 792005718 790959477
534.4G90959477J18792k17139j509011q50856N56349j82092j422047n09739L84867
$$ 790959477 791078269 790861130 789352119 788501263 789057612 788875520 787453473 786943734 787328601
552.7G87328601j017809k030969o80148J08838j259923j873136o44564n57244k269328
$$ 787328601 786310792 784279823 783599675 783708513 782448590 780575454 779930890 779373646 777104318
571.1G77104318k849698k086282l041804n311369n134643k501249m82082P36654K351462
$$ 777104318 774254620 772168338 769126534 763815165 758680522 756179273 755697191 756433845 758785307
589.4G58785307K958477J113355j059711j071453p91609k374172l588796k510011j736224
$$ 758785307 761743784 762857139 761797428 760725975 759934366 757560194 753971398 751461387 749725163
607.8G49725163l645301n959391n695165m366934o842375j4762938k3619413k0421207
$$ 749725163 746079862 740120471 734425306 730058372 723215997 708453059 684833646 664412439
624.1F64412439L244161K6764632K6268422Q793831q577227j9922316k5727869k3138821
$$ 664412439 667656600 694421232 720689654 729483485 720906258 700983942 675256073 652117252
640.4F52117252o407797J5518904K5640607K2918224J5332878Q531391M549384J665116
$$ 652117252 645709455 661228359 686868966 709787190 725120068 733651459 738200843 739865959
656.8G39865959j19627m93407j538694l908753p534087q831322k662599J874447M185199
$$ 739865959 739746332 739252925 737714231 733805478 726271391 717440069 714777470 716651917 720837116
675.1G20837116N409301M662871K831399J452744m4107l763199j0233760j9308090
$$ 720837116 726246417 730909288 733740687 735193431 735149324 731386125 721152365 701844275
691.4G01844275l1762898m3396533l6573231K342165M5850456N3440272L0636192M341662
$$ 701844275 670081377 626684844 590111613 592453778 638304234 691744506 722380698 726722360
707.7G26722360j3137281j0535538P148742J5528798J2369514R033263N282878O10054
$$ 726722360 713585079 703049541 710198283 725727081 738096595 747129858 752412736 753022790
724.1G53022790l197312o260157q484483r817302j0370195r322584o625831m243672
$$ 753022790 749825478 743565321 735080838 725263536 714893341 705570757 698944926 694701254
740.4F94701254l437936l177941k355218j911521k633512k948939j582504j439154
$$ 694701254 691263318 688085377 685730159 683818638 681185126 678236187 676653683 675214529
756.7F75214529o071508j2109041j1712909m816055N67615J550496J564741K297699
$$ 675214529 669143021 657033980 645321071 640505016 641072631 642623127 644187868 646485567
773F46485567K586186J612186j08063j870453l437638m666269l566325L696978J5606284
$$ 646485567 649071753 650683939 650575876 648705423 645267785 640601516 637035191 640732169 656338453
791.4F56338453K3093224K0558059J2095451M764796J712322K161145L128827J515448
$$ 656338453 679431677 699989736 712085187 716849983 718562305 720723450 723852277 725367725
807.7G25367725m025042j3746381k3871720k0479381J388490J9177914J6913950O861568
$$ 725367725 721342683 707596302 683724582 663245201 664633691 683811605 700725555 707587123
824G07587123L951490J1505008K2249698K5086045J8584431J0353327N430042K969265
$$ 707587123 711538613 723043621 745293319 770379364 788963795 799317122 804747164 807716429
840.3H07716429R24289L8147J560271L603757L497958J550734j98424j199484j794934
$$ 807716429 808640718 808678865 810239136 813842893 817340851 818891585 818693161 817493677 815698743
858.7H15698743j395762J28925Q62658n98252k414703k611995k655685m129827n155742
$$ 815698743 814302981 814431906 815294564 814696312 812281609 809669614 807013929 802884102 797728360
877G97728360m120589k811014k269388o04152K173841K666652m26829m453182p847965
$$ 797728360 793607771 790796757 788527369 787923217 790097058 792763710 792336881 787883699 780035734
895.4G80035734j2321472j8827796k5259197k9326081k9937267k5807083j8783271
$$ 780035734 767714262 748886466 723627269 694301188 664363921 638556838 619773567
909.7F19773567j3631940q492410K312302J7547369L2174886M1029512M0090800L1781971
$$ 619773567 606141627 597649217 599961519 617508888 649683774 690713286 730804086 762586057
926G62586057K1792710J3148665P502199N349278M292309J907170p54297k013444j402319
$$ 762586057 784378767 797527432 805029631 810378909 814671218 816578388 815824091 813810647 812408328
944.3H12408328J970410N879999O122648K924443j037717m044295n953848p486582
$$ 812408328 814378738 820258737 826381385 829305828 828268111 824223816 818269968 810783386
960.7H10783386q795917r458244o635666J192809Q669138J0874509Q960426N194247
$$ 810783386 801987469 792529225 785893559 787086368 795755506 806630015 815590441 820784688
977H20784688J345098p10607j367032k595961l966868l089488o88910m81486l228307
$$ 820784688 822129786 821419179 820052147 817456186 813489318 810399830 809710920 809229434 806001127
995.3H06001127o158114n999207k419174k31326j737952m256904o599724q244634q272231
$$ 806001127 799843013 793843806 791424632 791193306 789455354 785198450 778598726 770354092 762081861
1013.7G62081861p593870o869256l850997J319707L421545J593828K581000Q343995
$$ 762081861 754487991 747618735 743767738 745087445 748508990 750102818 752683818 761027813
1030G61027813J0921478O885112K259194N06998j81854j039803j442373j433671k086758
$$ 761027813 771949291 778834403 781093597 781600595 781418741 780378938 778936565 777502894 775416136
1048.4G75416136l273547l909409m200578n204916o716847p817149q824230j0528922
$$ 775416136 772142589 768233180 764032602 758827686 752110839 744293690 735469460 724940538
1064.7G24940538j2361466j3420403j4235139j5885294j8302262k0796597k3180663
$$ 724940538 712579072 699158669 684923530 669038236 650735974 629939377 606758714
1079F06758714k5364161k6934087k7170301k4446666j7269164p761449j248896l07411
$$ 606758714 581394553 554460466 527290165 502843499 485574335 477812886 476563990 476256579
1095.3D76256579q40217M217387J7602086L4581124M6616555M8641860M1425347K8944552
$$ 476256579 475416362 479633749 497235835 531816959 578433514 627075374 668500721 697445273
1111.6F97445273J7063260J0475398Q910119R329558R441018Q281886N764544K095282
$$ 697445273 714508533 724983931 733894050 743223608 752664626 760946512 766711056 768806338
1127.9G68806338j999914n579353q399844j0400891j0838866r144187o082774k960920
$$ 768806338 766806424 761227071 752827227 742426336 731587470 722443283 716360509 713399589
1144.2G13399589m12524J005471L35157k757430p445812j2545765j6671419j8447161
$$ 713399589 712987065 713992536 714327693 711570263 704124451 691578686 674907267 656460106
1160.5F56460106j7884135j5519500j3180792j6874909k8145314l1945109j1716962
$$ 656460106 638575971 623056471 609875679 593000770 564855456 532910347 521193385
1174.8E21193385K3520887M8330486N1596045M0059746K1989822L223896j0130644
$$ 521193385 544714272 593044758 644640803 684700549 706690371 709914267 699783623
1189.1F99783623j5552342j4067888q844614o513059j1958361k2240281k9259145k6466489
$$ 699783623 684231281 670163393 661318779 654805720 642847359 620607078 591347933 564881444
1205.4E64881444j4894485n450964q639038k0992279l0767560l2472164k6982814j6043692
$$ 564881444 549986959 544535995 535896957 514904678 484137118 451664954 424682140 408638448
1221.7D08638448k106607J1689424K2601038K9019237L1284451L1308711K9412508
$$ 408638448 406531841 418221265 440822303 469841540 501125991 532434702 561847210
1236E61847210K2360504O847918j1624337j6365945J569033K7069926L9902806L7970603
$$ 561847210 584207714 591055632 579431295 563065350 564634383 591704309 631607115 669577718
1252.3F69577718K9921353K1050930J2305855L383637n612493j3760864j9463301j9994199
$$ 669577718 699499071 720550001 732855856 736239493 730627000 716866136 697402835 677408636
1268.6F77408636j2216092L208340J8486797K4244428J9108534R764016J963913l560841
$$ 677408636 665192544 668400884 686887681 711132109 730240643 740004659 741968572 738407731
1285G38407731p796884j1376678j4794052j7889559k0037353k1578610k3379982k4958312
$$ 738407731 730610847 719234169 704440117 686550558 666513205 644934595 621554613 596596301
1301.3E96596301k5311768k4099768j8858730o456674J0688246K5893151L3305645
$$ 596596301 571284533 547184765 528326035 521869361 532557607 558450758 591756403
1315.6E91756403L1886161K5607288J8936097J4213086J2996554J5722871J8066942
$$ 591756403 623642564 649249852 668185949 682399035 695395589 711118460 729185402
1329.8G29185402J5234828Q221746K03252q422733j7038166j8316925n189120J5619158
$$ 729185402 744420230 752641976 752845228 744422495 727384329 709067404 703878284 719497442
1346.2G19497442K7248979K3613632J3873577N216956k157808r537875j9107521l1241894
$$ 719497442 746746421 770360053 784233630 789450586 787292778 777754903 758647382 727405488
1362.5G27405488l3375740j5028536J1582911K6202142K3252786J3316989M744708
$$ 727405488 694029748 679001212 690584123 716786265 740039051 753356040 758100748
1376.7G58100748N424k972186n745291p933319r441256r139419o420851l505230j882851
$$ 758100748 758106172 755133986 749388695 741455376 732014120 722874701 716453850 712948620 711065769
1395.1G11065769k969026o341577r502351j1997879j3962924j4026106j4513909j5511871
$$ 711065769 708096743 701755166 692252815 680254936 666292012 652265906 637751997 622240126
1411.4F22240126j1423945j911164N505264M640401j847268n955159o339312m183829
$$ 622240126 610816181 608905017 614410281 619050682 617203414 611248255 604908943 600725114
1427.7F00725114q39471K978920N561710P653773R121358P789195N881190M110157
$$ 600725114 599885643 602864563 608426273 616080046 625201404 632990599 638871789 642981946
1444.1F42981946K485455L95596m222274j1096120j7271936j8878877l975332J5280426
$$ 642981946 645467401 645862997 641640723 630544603 613272667 594393790 590418458 605698884
1460.4F05698884K0752787K0747960J6817689J0505557O795227O351412P045865P733464
$$ 605698884 626451671 647199631 664017320 674522877 681318104 687669516 694715381 702448845
1476.7G02448845Q621275Q888781O973505K406955k179265k833009R52661M051745
$$ 702448845 711070120 719958901 726932406 729339361 727160096 724327087 725279748 729331493
1493G29331493O813884J1116088J2021780Q719444N312204L879607N889118P156074
$$ 729331493 736145377 747261465 759283245 768002689 773314893 777194500 783083618 790239692
1509.3G90239692N506873L363073J109063j82867m84883q33929j138866j370311j309633
$$ 790239692 795746565 799109638 800218701 800035834 799550951 798717022 797578156 796207845 794898212
1527.7G94898212j117349j421153j101136J40547K61426q4996R42051J631260R92298
$$ 794898212 793780863 792359710 791258574 791399121 791660547 791575551 792517602 794148862 795141160
1546G95141160k40802j128793j462400j991808k808094l988207l377080k015531l276288
$$ 795141160 794900358 793771565 792309165 790317357 787509263 783521056 780143976 778128445 774852157
1564.4G74852157n004228o954371q906782p691682m292130J177311M347801J261354
$$ 774852157 769847929 762893558 753986776 746295094 742002964 743180275 747528076 748789430
1580.7G48789430l094137m632652m426420n915522q893192j2292743j6477883k0024180
$$ 748789430 745695293 741062641 736636221 730720699 721827507 709534764 693056881 673032701
1597F73032701j9783139j6736865j5841425j4806628m886687J1958182K0190299J3332486
$$ 673032701 653249562 636512697 620671272 605864644 600977957 612936139 633126438 646458924
1613.4F46458924Q50797r281517j2052774j3698578j8366098k1148026k3176372k5116384
$$ 646458924 647309721 638028204 625975430 612276852 593910754 572762728 549586356 524469972
1629.7E24469972k3755133k4744630k9774964k3571253r855330O91026J0024041K0462990
$$ 524469972 500714839 475970209 446195245 422623992 412768662 413459688 423483729 443946719
1646D43946719K5427044J7791152R914338K088130o349802j2618453k0583808k8267920
$$ 443946719 469373763 487164915 497079253 499167383 492817581 480199128 459615320 431347400
1662.3D31347400k1128506M187227L2064169M3262124K6093334O602109l144562n739034
$$ 431347400 410218894 414406121 446470290 489732414 515825748 522427857 519283295 513544261
1678.6E13544261o444931r532123j5936464j8368185k1219701k7063757k8515011k8431147
$$ 513544261 507099330 497567207 481630743 463262558 442042857 414979100 386464089 358032942
1694.9C58032942k1514565k817005J5238315J9819558J8056720J3769448M993916l102303
$$ 358032942 336518377 333701372 348939687 368759245 386815965 400585413 405579329 402477026
1711.3D02477026q506328j0745078o708145O068587K1216273L5701454M3800682M1972667
$$ 402477026 393970698 383225620 376517475 382586062 403802335 439503789 483304471 525277138
1727.6E25277138L6189854L0393302L0225695K8171002K0518244J8527686J7702163
$$ 525277138 561466992 591860294 622085989 650256991 670775235 689302921 707005084
1741.9G07005084J4563560J2243390J0700643J0351777R713292P878304O816149O525516
$$ 707005084 721568644 733812034 744512677 754864454 764577746 772456050 779272199 785797715
1758.2G85797715N862773N692422N579233M768849L967762L240168L451764L732443
$$ 785797715 791660488 797352910 802932143 807700992 811668754 814908922 818360686 822093129
1774.5H22093129L044605K439142K498805K577961K505839K884388L080964K816259
$$ 822093129 825137734 827576876 830075681 832653642 835159481 838043869 841124833 843941092
1790.8H43941092K557636K283454J635313Q85546N89311J172006J783014J612901J143635
$$ 843941092 846498728 848782182 850417495 851303041 851892352 853064358 854847372 856460273 857603908
1809.2H57603908J150846J416683J094342O50703P44820R24766O00696L83019O48916
$$ 857603908 858754754 860171437 861265779 861916482 862661302 863586068 864186764 864569783 865218699
1827.5H65218699J054585J361430J282453J237393J252591Q94904L35396L56316Q12233
$$ 865218699 866273284 867634714 868917167 870154560 871407151 872302055 872637451 872993767 873806000
1845.9H73806000O93202L87668M45366L82543j2875j25944J64568K46286j62482n45382
$$ 873806000 874499202 874886870 875332236 875714779 875701904 875575960 875740528 875986814 875824332 875278950
1866.3H75278950m31419p8082k39074o65784r17315j196444j167238l00050P40409
$$ 875278950 874847531 874769449 874530375 873864591 872947276 871750832 870583594 870283544 871023953
1884.6H71023953Q12113K62022J78278K22862m02213j266777j850009k205312j936138
$$ 871023953 871836066 872098088 872276366 872499228 872097015 870830238 868980229 866774917 864838779
1903H64838779l79205J728773K650738J999676R21429L21328N3942j86920l64065k17259
$$ 864838779 864459574 866188347 868839085 870838761 871760190 872081518 872135460 871948540 871584475 871367216
1923.4H71367216j9193l09467n78642m06623k71678n10931p29203o68347o11245o31810
$$ 871367216 871348023 871038556 870459914 870053291 869781613 869270682 868541479 867873132 867261887 866630077
1943.8H66630077n66780n55635q54969j129687n16116Q54611J560748J155853O19590
$$ 866630077 866063297 865507662 864652693 863523006 863006890 863861501 865422249 866578102 867197692
1962.1H67197692M20273K11715l1292j13904k21313n08785n76555L5107Q48114J009941
$$ 867197692 867617965 867829680 867798388 867684484 867463171 866954386 866377831 866412938 867261052 868270993
1982.5H68270993N96345L19719K64466J00910J3173K06351L07501Q3208j28985n6326
$$ 868270993 868867338 869187057 869451523 869552433 869565606 869771957 870079458 870162666 870033681 869977355
2002.9H69977355N1677p0870j87695o2108P212k29656m09067l18646l51310p12931
$$ 869977355 870029032 869958162 869770467 869708359 869715571 869485915 869076848 868758202 868406892 867693961
2023.3H67693961p48635q642M62353P1943k78116k36749k17080k22206n4360J06633
$$ 867693961 866945326 866936684 867399037 867470980 867192864 866956115 866739035 866516829 866462469 866569102
2043.7H66569102J19k34425k60055j17302j13308k06590j72496p7307j38343k59101
$$ 866569102 866569221 866334796 866074741 865957439 865844131 865637541 865465045 865387738 865249395 864990294
2064.1H64990294j83642o8784j26004j70171q0347o4612k33411l64483l06904k32041
$$ 864990294 864806652 864737868 864611864 864441693 864361346 864296734 864063323 863698840 863391936 863159895
2084.5H63159895k52008j84656K0147J33991Q6367M5717M8995k0504j30654j39355
$$ 863159895 862907887 862723231 862743378 862877369 862963736 863009453 863058448 863037944 862907290 862767935
2104.9H62767935q0586r7513j14441L58J28746J34885J36912J96219J76548Q1182O1214
$$ 862767935 862687349 862589836 862475395 862475753 862604499 862739384 862876296 863072515 863249063 863330245 863391459
2127.3H63391459J06454P9870j7285n0962Q523J0550n7637n9426k5034q6308j84715
$$ 863391459 863497913 863577783 863560498 863509536 863518059 863528609 863470972 863411546 863386512 863300204 863115489
2149.8H63115489j58965p1228q3625j28865q8871p5042j65105k19524j13427N1379
$$ 863115489 862956524 862885296 862801671 862672806 862583935 862508893 862343788 862124264 862010837 862062216
2170.2H62062216L6776q0228l1114L7194o7175j24633k4617n424j26958j18613L0577
$$ 862062216 862098992 862018764 861987650 862024844 861957669 861833036 861808419 861802995 861676037 861557424 861588001
2192.6H61588001L1829j11341r8586O9439Q9705m7505r9659m5836j00493k24769j75775
$$ 861588001 861619830 861508489 861409903 861479342 861569047 861521542 861421883 861376047 861275554 861050785 860875010
2215H60875010p8022j97887l45767k46584j13607j97112k85685j82152j31071k81751
$$ 860875010 860796988 860599101 860253334 860006750 859893143 859696031 859410346 859228194 859097123 858815372
2235.4H58815372l41833j63257r8586l04997m11033k51830j73092l16501l40581j46091
$$ 858815372 858473539 858310282 858211696 857906699 857495666 857243836 857070744 856754243 856413662 856267571
2255.8H56267571p2121k23220k71678j17540q3089k21550j84000L4452L9160j70946
$$ 856267571 856195450 855972230 855700552 855583012 855499923 855278373 855094373 855128825 855167985 854997039
2276.2H54997039k26379j37209k25842m23551m21047l23952m07040m97043k98738K1398
$$ 854997039 854770660 854633451 854407609 853984058 853563011 853239059 852832019 852334976 852036238 852057636
2296.6H52057636J08778J5497M3452O0737k05874m75228l92616k28524l37601m79996
$$ 852057636 852166414 852181911 852225363 852286100 852080226 851604998 851212382 850983858 850646257 850166261
2317H50166261l78072k69294l77953l99172j25706J36911J13488m6909q7857q8275
$$ 850166261 849788189 849518895 849140942 848741770 848616064 848752975 848866463 848819554 848731697 848643422
2337.4H48643422j93953k13325L0040L34442M04954K27272n9425m06504p07924p30813
$$ 848643422 848449469 848236144 848266184 848600626 849005580 849232852 849173427 848766923 848058999 847328186
2357.8H47328186n56171n62370o23107m01377j00434n4419j04964K1160J24812j669
$$ 847328186 846772015 846209645 845586538 845185161 845084727 845030308 844925344 844946504 845071316 845069647
2378.2H45069647r3162L9398J25170o8545k83957k47180j77503k57849k58446q0466
$$ 845069647 844976485 845015883 845141053 845072508 844788551 844541371 844363868 844106019 843847573 843767107
2398.6H43767107q464j43409j87099k5928O7711j2279n424J77086K59816J40012P2956
$$ 843767107 843758643 843615234 843428135 843402207 843469918 843457639 843452215 843629301 843889117 844029129 844102085
2421H44102085J20639Q9765n066P391P6472j6391j99854k18451j44124k03789l32534
$$ 844102085 844222724 844312489 844307423 844314814 844391286 844374895 844175041 843956590 843812466 843608677 843276143
2443.5H43276143l28243k55584l14594l74019k19583l8624n1499j25289q6426l1650
$$ 843276143 842947900 842692316 842377722 842003703 841784120 841745496 841693997 841568708 841482282 841450632
2463.9H41450632q6546j21653l8803k4140j79231k81274k01285j30117j67907j43229
$$ 841450632 841364086 841242433 841203630 841179490 841000259 840718985 840517700 840387583 840219676 840076447
2484.3H40076447m1008l0339r1970j02878q5473j28329j95622k05100k02477k78115
$$ 840076447 840035439 840005100 839913130 839810252 839724779 839596450 839400828 839195728 838993251 838715136
2504.7H38715136l64482l44038l12746l89516m31359l43979l04818l78489l59476j82032
$$ 838715136 838350654 838006616 837693870 837304354 836872995 836529016 836224198 835845709 835486233 835304201
2525.1H35304201m4883k7179o378K5511l5465j37687j36316o7472q7440j85311k09153
$$ 835304201 835259318 835232139 835225761 835251272 835215807 835078120 834941804 834874332 834786892 834601581 834392428
2547.5H34392428j51932j52886k20060k37584k22028k48968k74837k38478k30730l49641
$$ 834392428 834240496 834087610 833867550 833629966 833407938 833158970 832884133 832645655 832414925 832065284
2567.9H32065284m40359l73721l31819m22239m88401m25219l25859k96354k57850j51455
$$ 832065284 831624925 831251204 830919385 830497146 830008745 829583526 829257667 828961313 828703463 828552008
2588.3H28552008j09792j81079k03431j24156j14024k28524l04341k89440l17276l96431
$$ 828552008 828442216 828261137 828057706 827933550 827819526 827591002 827286661 826997221 826679945 826283514
2608.7H26283514l40163j51992r5666j40964l9936Q0288J5974p3493j9431J0550j68204
$$ 826283514 825943351 825791359 825695693 825554729 825514793 825595081 825611055 825537562 825518131 825528681 825360477
2631.1H25360477l70085l55721l02255l91304m39644l29197k25723k67386l17097k23338
$$ 825360477 824990392 824634671 824332416 823941112 823501468 823172271 822946548 822679162 822362065 822138727
2651.5H22138727j46270k07603k35796j64807j69873l10183l72290k79308k61306l33071
$$ 822138727 821992457 821784854 821549058 821384251 821214378 820904195 820531905 820252597 819991291 819658220
2671.9H19658220k85328j51038j28269k05517j94669j23798j93358l38375l58403l43740
$$ 819658220 819372892 819221854 819093585 818888068 818693399 818569601 818376243 818037868 817679465 817335725
2692.3H17335725m74811o18994n63920m48703m84288n38945m50552l90887n26071o43134
$$ 817335725 816860914 816241920 815678000 815229297 814745009 814206064 813755512 813364625 812838554 812195420
2712.7H12195420n40971m25518m56095m40180l00706k76684m51863n48959m18663l09884
$$ 812195420 811654449 811228931 810772836 810332656 810031950 809755266 809303403 808754444 808335781 808025897
2733.1H08025897l66986l87848l29435l87191n12362m81903l73781m51088o40094o63340
$$ 808025897 807658911 807271063 806941628 806554437 806042075 805560172 805186391 804735303 804095209 803431869
2753.5H03431869n78285o34968p70032p69318p29918q66175j062751j085758j019299
$$ 803431869 802853584 802218616 801448584 800679266 799949348 799083173 798020422 796934664 795915365
2771.8G95915365j063466j150787j069903q72672q04186q51571q26419q17239r94563
$$ 795915365 794851899 793701112 792631209 791758537 790954351 790102780 789276361 788459122 787464559
2790.2G87464559j166105j133204j084149j193046j323342j345575j386643j500428
$$ 787464559 786298454 785165250 784081101 782888055 781564713 780219138 778832495 777332067
2806.5G77332067j489877j347244j271486j250565j123309r08018p98583q27551q27848
$$ 777332067 775842190 774494946 773223460 771972895 770849586 769941568 769142985 768315434 767487586
2824.9G67487586p89702q94547j096010j153171j130700j276851j549363j727104j802922
$$ 767487586 766697884 765803337 764707327 763554156 762423456 761146605 759597242 757870138 756067216
2843.2G56067216j940488k082348k065242j982808j931488j817525j678466j748741
$$ 756067216 754126728 752044380 749979138 747996330 746064842 744247317 742568851 740820110
2859.5G40820110k100885k466440k550602k344430j879215j187682p02858q39293j348138
$$ 740820110 738719225 736252785 733702183 731357753 729478538 728290856 727587998 726748705 725400567
2877.9G25400567j798630k137482k490520k894402l241658l488898l718973l863394
$$ 725400567 723601937 721464455 718973935 716079533 712837875 709348977 705630004 701766610
2894.2G01766610l857612l838242l808736l568471l062904k530873k271235k284884
$$ 701766610 697908998 694070756 690262020 686693549 683630645 681099772 678828537 676543653
2910.5F76543653k387881k556801k719343k648890k317309j943469j755536j697004
$$ 676543653 674155772 671598971 668879628 666230738 663913429 661969960 660214424 658517420
2926.8F58517420j453042p61926L58522J327634J477659Q55207J311p03394j186729
$$ 658517420 657064378 656302452 656660974 657988608 659466267 660321474 660322785 659619391 658432662
2945.2F58432662j367509j060486m57525k03013m02093m78864k37525m2140k58863
$$ 658432662 657065153 656004667 655547142 655344129 654942036 654463172 654225647 654183507 653924644
2963.6F53924644r29296j849890k801299l446221l282249j948595L31223K579450L883660
$$ 653924644 652995348 651145458 648344159 644897938 641615689 639667094 639998317 642577767 646461427
2981.9F46461427M288495M295468M218221M224419M174173L876329L439247K870083
$$ 646461427 650749922 655045390 659263611 663488030 667662203 671538532 674977779 677847862
2998.2F77847862K222598J765370J615107J817942K219617K312124J811445R55939
$$ 677847862 680070460 681835830 683450937 685268879 687488496 689800620 691612065 692568004
3014.5F92568004K861j102924k295852l127694l202498k323568o41405R64522J659512
$$ 692568004 692570865 691467941 689172089 686044395 682841897 680518329 679876924 680841446 682500958
3032.9F82500958J630426J814961K517522K677202J580000k3484j215041j931131k644718
$$ 682500958 684131384 685946345 688463867 691141069 692721069 692697585 691482544 689551413 686906695
3051.3F86906695l387689l729880l637076l319323k827823k279937j913965j883983
$$ 686906695 683519006 679789126 676152050 672832727 670004904 667724967 665811002 663927019
3067.6F63927019k099336k405703k739906k993882l255009l784180m358053m467726
$$ 663927019 661827683 659421980 656682074 653688192 650433183 646649003 642290950 637823224
3083.9F37823224l908813k773106j718938j378358j420080j392067j319408j225651
$$ 637823224 633914411 631141305 629422367 628044009 626623929 625231862 623912454 622686803
3100.2F22686803r59634m39704J10686L21746Q8274k34186m57526p43746j008988j180708
$$ 622686803 621727169 621287465 621398151 621719897 621808171 621573985 621116459 620372713 619363725 618183017
3120.6F18183017j221061q19206J8716Q32319J392066J912296K551735L091514L243387
$$ 618183017 616961956 616142750 616161466 616993785 618385851 620298147 622849882 625941396 629184783
3139F29184783L136336L170848L317833L333748L320574L284514K893090K260268J867533
$$ 629184783 632321119 635491967 638809800 642143548 645464122 648748636 651641726 653901994 655769527
3157.3F55769527J661658J342297R34303O23166L81649M0173l46005o62267r50038
$$ 655769527 657431185 658773482 659707785 660330951 660712600 660752773 660406768 659744501 658794463
3175.7F58794463j254320j561285j886606k222955k505064k707422k850294k995312
$$ 658794463 657540143 655978858 654092252 651869297 649364233 646656811 643806517 640811205
3192F40811205l164411l259599l203809l119826l125251l069877k843559k622605k484619
$$ 640811205 637646794 634387195 631183386 628063560 624938309 621868432 619024873 616402268 613917649
3210.3F13917649k262652j955211j772821j748204j690090j529098j383841j283169
$$ 613917649 611654997 609699786 607926965 606178761 604488671 602959573 601575732 600292563
3226.7F00292563j119196q56101o77825p27057p22289m56393j69873K4915K49386M65452
$$ 600292563 599173367 598317266 597639441 596912384 596190095 595733702 595563829 595588744 595838130 596303582
3247.1E96303582N69821O86585R64106J322090J606047J889825K324581K789617L126919
$$ 596303582 596873403 597559988 598524094 599846184 601452231 603342056 605666637 608456254 611583173
3265.4F11583173L374875L597259L745497L768146L753364L748774L638208L411412
$$ 611583173 614958048 618555307 622300804 626068950 629822314 633571088 637209296 640620708
3281.7F40620708L161729K961039K827049K644598K401889K186536J934469J614392
$$ 640620708 643782437 646743476 649570525 652215123 654617012 656803548 658738017 660352409
3298F60352409J313209J107812R65476P28846M37200K66135J78635Q2970J728o5029
$$ 660352409 661665618 662773430 663738906 664467752 664904952 665171087 665349722 665432692 665434420 665369391
3318.4F65369391k18451m73678o92546q14200r22381j049459j142145j205027j311123
$$ 665369391 665150940 664677262 663984716 663170516 662248135 661198676 660056531 658851504 657540381
3336.8F57540381j488626j681149j843035k010703k170802k169072k061904k102792
$$ 657540381 656051755 654370606 652527571 650516868 648346066 646176994 644115090 642012298
3353.1F42012298k244770k230406j948238j457095q90255m86314m72605p88808j171053
$$ 642012298 639767528 637537122 635588884 634131789 633241534 632755220 632282615 631493807 630322754
3371.5F30322754j402855j458823j401723j209616r06766n82874k74300N185K14160
$$ 630322754 628919899 627461076 626059353 624849737 623942971 623360097 623085797 623090982 623305142
3389.8F23305142L44396M06265L97384L31819K72691K98798L30091K34783R2864M1782
$$ 623305142 623649538 624055803 624453187 624785006 625057697 625356495 625686586 625921369 626014233 626056015
3410.2F26056015L5227K7656J4306j7941K0623J70350K73704K39313K29061L01897
$$ 626056015 626091242 626118898 626133204 626115263 626135886 626306236 626579940 626819253 627048314 627350211
3430.6F27350211L89516M69625N42224O08325O57678P00354P13647P62283Q84533R59754
$$ 627350211 627739727 628209352 628751576 629359901 630017579 630717933 631431580 632193863 633078396 634038150
3451F34038150R83298J004100J021028J074314J099825J106500J195014J265347J152932
$$ 634038150 635021448 636025548 637046576 638120890 639220715 640327215 641522229 642787576 643940508
3469.4F43940508R63152R72569J137197J285553J277804J139820J137852J242519J255631
$$ 643940508 644903660 645876229 647013426 648298979 649576783 650716603 651854455 653096974 654352605
3487.7F54352605J231432J258731J310051J372575J382590J338839J308441J277566
$$ 654352605 655584037 656842768 658152819 659525394 660907984 662246823 663555264 664832830
3504F64832830J255155J293778J433433J611650J599371J442075J399338J466811J563370
$$ 664832830 666087985 667381763 668815196 670426846 672026217 673468292 674867630 676334441 677897811
3522.4F77897811J515984J377643J478493J700580J781881J802265J759649J665950
$$ 677897811 679413795 680791438 682269931 683970511 685752392 687554657 689314306 690980256
3538.7F90980256J709997J761735J682102J591742J607061J683235J762927J829385
$$ 690980256 692690253 694451988 696134090 697725832 699332893 701016128 702779055 704608440
3555G04608440J831294J830637J821995J607775J382888J817643K537728K537071K205432
$$ 704608440 706439734 708270371 710092366 711700141 713083029 714900672 717438400 719975471 722180903
3573.4G22180903K131760K250493K413928K467990K217174J883030K067864K611577
$$ 722180903 724312663 726563156 728977084 731445074 733662248 735545278 737613142 740224719
3589.7G40224719K602756K366901K468705K622246K524853K393425K215504J842738
$$ 740224719 742827475 745194376 747663081 750285327 752810180 755203605 757419109 759261847
3606G59261847J783371K116918K226591K156377J913071J782000K275288K411008J703024
$$ 759261847 761045218 763162136 765388727 767545104 769458175 771240175 773515463 775926471 777629495
3624.4G77629495Q77082Q84712J954436K210140J760304J458586J212656J057625R12130
$$ 777629495 778506577 779391289 781345725 783555865 785316169 786774755 787987411 789045036 789957166
3642.7G89957166M55141j20521J48654J351178J610756J034140J019538J298070R50575
$$ 789957166 790412307 790291786 790440440 791791618 793402374 794436514 795456052 796754122 797704697
3661.1G97704697M32729J14739l28600n89550o8187K3007k16722N88595J084686Q60810
$$ 797704697 798137426 798252165 797923565 797334015 797265828 797288835 797072113 797660708 798745394 799606204
3681.5G99606204N82457K13742j05441M1604O81639R62436O60598K62201l3080n3704
$$ 799606204 800188661 800402403 800296962 800338566 801020205 801982641 802643239 802905440 802872360 802818656
3701.9H02818656K40982J67727l61681o60002o6519P39455O02305M7922k19583j77622
$$ 802818656 803059638 803227365 802865684 802205682 802139163 802878618 803480923 803528845 803309262 803131640
3722.3H03131640n9843J24454J64330k73108p61628n76973K65300P23124J68323q46684
$$ 803131640 803071797 803196251 803360581 803087473 802325845 801748872 802014172 802737296 802905619 802058935
3742.7H02058935r27806J431j23322l26634N93782R27150L06487q8274J70469J82688
$$ 802058935 801131129 801132560 801009238 800682604 801276386 802203536 802510023 802421749 802592218 802774906
3763.1H02774906j78993k88546j84953P9393K59102P7248j64927k03251p3493n3108
$$ 802774906 802595913 802307367 802122414 802201807 802460909 802538157 802373230 802169979 802096486 802043378
3783.5H02043378n1856Q7321J17064n9665m13775o90699n92231n86927m05193K28942
$$ 802043378 801991522 802078843 802195907 802136242 801722467 801031768 800439537 799852610 799447417 799676359
3803.9G99676359K18630J76668L96490L9935n84900o94931m38273n46634j12415N28455
$$ 799676359 799894989 800071657 800468147 800508082 799923182 799228251 798789978 798243344 798130929 798659384
3824.3G98659384L56734L5584k86937m50670l32237m75943n50508K741M30763M64618
$$ 798659384 799016118 799051702 798764765 798314095 797981858 797505915 796955407 796958148 797388911 797853529
3844.6G97853529K80381k64287j194775j657427q0645J170397O27577j74701m63784
$$ 797853529 798133910 797869623 796674848 795017421 794936776 796107173 796734750 796560049 796096265
3863G96096265j87814j08719l82721j60456K36034L08335J29342k95579k17617P6354
$$ 796096265 795908451 795799732 795417011 795256555 795492589 795800924 795930266 795634687 795417070 795493424
3883.4G95493424o0797p2956j74940k66373J04308J34886l70383o57797m88401M053
$$ 795493424 795432627 795359671 795184731 794918358 795022666 795157552 794787169 794129372 793640971 793645024
3903.8G93645024N91278O93143L39567o3300l49044m45843k66195L7730Q1122j1563
$$ 793645024 794236302 794929445 795269012 795205712 794856668 794410825 794144630 794182360 794263482 794251919
3924.2G94251919P0512L4392k13861j60575J85608K01047o8784k54333k58624j28270
$$ 794251919 794322431 794356823 794142962 793982387 794167995 794369042 794300258 794045925 793787301 793659031
3944.6G93659031j12712j25110N9605J70826N2989l8505n7697j03474o2823J5318k4974
$$ 793659031 793546319 793421209 793480814 793651640 793704629 793666124 793608427 793504953 793442130 793457448 793432474
3967G93432474j18077j36673n6207M1246M1485k5809K861O8069k9862j96576k10703
$$ 793432474 793314397 793177724 793121517 793162763 793204248 793178439 793181300 793249369 793219507 793022931 792812228
3989.5G92812228j30176j16289j23382r4771
$$ 792812228 792682052 792565763 792442381 792347610
3997.6G92347610
$$ 792347610
##END=$$ End of the data block
