##TITLE=FA140 $$ Begin of the data block
##JCAMP-DX=5.00 $$ ACD/SpecManager v 10.08
##SPECTROMETER/DATA SYSTEM=Alpha
##DATE=20 Feb 2015 09:12:38
##DATA TYPE=INFRARED SPECTRUM
##DATA CLASS=XYDATA
##ORIGIN=
##OWNER=
##NPOINTS=1765
##FIRSTX=399.76428223
##LASTX=3997.64306641
##MAXX=3997.64306641
##MINX=399.76428223
##MAXY=0.85694200
##MINY=0.04599106
##XFACTOR=1.0000000000
##YFACTOR=1.000000000000000e-9
##FIRSTY=0.70357692
##DELTAX=2.03961372
##XUNITS=1/CM
##YUNITS=ARBITRARY UNITS
##XYDATA=(X++(Y..Y))
399.8G03576922M267216L45290m187226j364053M827976M780591q96990l410101L65257
$$ 703576922 707844138 708189428 704002202 702638149 707466125 712246716 711349726 707939625 708304882
418.1G08304882L243148k002537o084204k716720J568854m58479m578829l136098J399696
$$ 708304882 711548030 709545493 703461289 700744569 702313423 701854944 697276115 694140017 695539713
436.5F95539713K68221o537497j0693550q844436p557451j0962129j3628244j0357499
$$ 695539713 695807934 689270437 678576887 669732451 662175000 651212871 637584627 627227128
452.8F27227128m669369l574490n349219k988160L072262P174552O550133N134642
$$ 627227128 622557759 618983269 613634050 610645890 613718152 620892704 627442837 632577479
469.1F32577479P478893J0550797P711231J564920m81903J968443K530039j273394
$$ 632577479 640056372 650607169 658318400 659883320 659401417 661369860 663899899 662626505
485.4F62626505l761470j310170J588642k27630m255831m670501k400577l251850p212758
$$ 662626505 658865035 657554865 659143507 658915877 654660046 649989545 647588968 644337118 637124360
503.8F37124360p746816k563596L068388L591299Q84175N99504L396689M244805J363158
$$ 637124360 629377544 626813948 629882336 633473635 634357810 634957314 638354003 642598808 643961966
522.1F43961966m64261K011359M550755K497971j112878j236796J421332J534522k143026
$$ 643961966 643497705 645509064 650059819 652557790 651444912 650208116 651629448 653163970 651020944
540.5F51020944m690826l189623j343727l098369n905569m968583j155079N14865j250207
$$ 651020944 646330118 643140495 641796768 638698399 632792830 627824247 626669168 627184033 625933826
558.9F25933826k379715j38283K143085O18338k577185k653778k53439l04758l578544
$$ 625933826 623554111 623415828 625558913 626177251 623600066 620946288 620692849 620388091 616809547
577.2F16809547n618870m048586k380491m103422p114410p416129n693197o126166
$$ 616809547 611190677 607142091 604761600 600658178 593543768 586127639 580434442 574308276
593.5E74308276r880304j3702274j5002727j3623118r112776j254141P277846J1824727
$$ 574308276 564427972 550725698 535722971 522099853 512987077 511732936 519010782 530835509
609.8E30835509R711027K761007k348721p21991J879811j308203n672991m534841N20945
$$ 530835509 540546536 543307543 540958822 540236831 542116642 540808439 535135448 530600607 531121552
628.2E31121552L652215K301753j330197m846335r146690j5537262k0743400j8528372
$$ 531121552 534773767 537075520 535745323 530898988 521752298 506215036 485471636 466943264
644.5D66943264q640856p36445k099305p167935p596285j847177O470799J1188299
$$ 466943264 458302408 457565963 455466658 448298723 440702438 438855261 445326060 456514359
660.8D56514359R143710L633439l530502j3062000j4967651j3899624j3332486j1376292
$$ 456514359 465658069 469291508 465761006 452699006 437731355 423831731 410499245 399122953
677.2C99122953r270936o068647k790004l414243r703040j9752473l0864596l8500369
$$ 399122953 389852017 383783370 380993366 377579123 367876083 348123610 317259014 278758645
693.5B78758645l6028638k1208913n58078J8855736L5198301M8263609N5584669N4935575
$$ 278758645 242730007 221521094 220963016 239818752 275017053 323280662 378865331 433800906
709.8D33800906M7651023L6512315K3713529J2254059M918576J074493k094627n067289
$$ 433800906 481451929 517964244 541677773 553931832 558850408 559924901 557830274 552762985
726.1E52762985n862653m407764l817439n872964p884264o144286j150250K059996
$$ 552762985 546900332 542492568 538675129 532802165 524917901 518773615 517623365 519683361
742.4E19683361q91328r348452j9048691k6054650k7891547k3495197j3938427j968801
$$ 519683361 518792033 509443581 490394890 464340240 436448693 412953496 399015069 397046268
758.7C97046268R451151J7844826K1863401K1652877J8319070J3387412R040296P198990
$$ 397046268 406497419 424342245 446205646 467858523 486177593 499565005 508605301 515804291
775.1E15804291P629394P960618O668746N116463M997909N053043K624810k223909
$$ 515804291 523433685 531394303 538063049 543179512 548177421 553230464 555855274 553631365
791.4E53631365o601214q860290r721577r517491p114947k066612L808856Q043885
$$ 553631365 547030151 538169861 528448284 518930793 511815846 509749234 513558090 521601975
807.7E21601975J0009646J1011243J1744857J0500372N569279r82642m591227k985060
$$ 521601975 531611621 542622864 554367721 564868093 570437372 569454730 564863503 561878443
824E61878443K221465P899403J1904061J3341308J1806250P806479L705681K146304
$$ 561878443 564099908 571999311 583903372 597244680 609050930 616857409 620563090 622709394
840.3F22709394K887487L022551J018286j290023j817405j576305l074109o428123
$$ 622709394 625596881 628619432 629637718 628347695 626530290 624953985 621879876 615451753
856.6F15451753r582460j2013793j5545189k0626426k4248063k2826374j5586257m659265
$$ 615451753 605869293 593855500 578310311 557683885 533435822 510609448 495023191 490363926
873D90363926P042646J7609686K6208460L2067061L4219741L2836140K9491782K4865865
$$ 490363926 497406572 515016258 541224718 573291779 607511520 640347660 669839442 694705307
889.3F94705307J8067182R794533L457904J011729J48058k146483n181372o302178
$$ 694705307 712772489 722567022 726024926 727036655 727184713 725038230 719856858 713554680
905.6G13554680n540430n168498n438387m195035q32438J960575J419425j567006l612816
$$ 713554680 708014250 702845752 697407365 693212330 692379892 694340467 695759892 694192886 690580070
923.9F90580070l358781k527476k504944k549768k117336k834081o299079j1065364
$$ 690580070 687221289 684693813 682188869 679639101 677521765 674687684 668388605 657323241
940.3F57323241j3720989j2623429r277225o301045n397618p128179j1489868j7700613
$$ 657323241 643602252 630978823 621701598 615400553 610002935 602874756 591384888 573684275
956.6E73684275k3604274k6811480k6775330k4702132k1442354j6227126p606626M577071
$$ 573684275 550080001 523268521 496493191 471791059 450348705 434121579 426514953 431092024
972.9D31092024J8169612K9092103L3174932K8584420J7005682K867401q724749j4606237
$$ 431092024 449261636 478353739 511528671 540113091 557118773 559986174 551261425 536655188
989.2E36655188j5363992j4135956j2147040o134510N223960J6540885K1616697J8610180
$$ 536655188 521291196 507155240 495008200 488873690 494097650 510638535 532255232 550865412
1005.5E50865412J0917723L780842q16167l291010l590465j433730K035916M232704
$$ 550865412 561783135 565563977 564747810 561456800 557866335 556432605 558468521 562701225
1021.8E62701225L380001J170099K343654Q465946J3628781J1943340N555928l00825
$$ 562701225 566081226 567251325 569594979 578060925 591689706 603633046 609188974 608888149
1038.2F08888149m245758p228195r281278j0297060j1285544j3215780j5808999j8215001
$$ 608888149 604642391 597414196 588132918 577835858 566550314 553334534 537525535 519310534
1054.5E19310534k0265460k2315741k3998350k4219065k2690595k0623773j9870102
$$ 519310534 499045074 476729333 452730983 428511918 405821323 385197550 365327448
1068.8C65327448k1499694k4734348k7062416k6223034k2620946j8881082j7029062
$$ 365327448 343827754 319093406 292030990 265807956 243187010 224305928 207276866
1083B07276866j6685441j6106770j4171183j0811135o207347k62171P294029J6557336
$$ 207276866 190591425 174484655 160313472 149502337 143294990 143032819 150326848 166884184
1099.4A66884184K7138859L7943467M6755717N0298094M5928330L4885764K2708952
$$ 166884184 194023043 231966510 278722227 329020321 374948651 409834415 432543367
1113.6D32543367J4667571J1133700Q163900J847773q397311j9698709k7937710l0700565
$$ 432543367 447210938 458344638 466508538 468356311 459959000 440260291 412322581 381622016
1129.9C81622016k8864801k5185853k1789580j9019336j5717625j0379941k495348
$$ 381622016 352757215 327571362 305781782 286762446 271044821 260664880 258169532
1144.2B58169532P003367J6488939K4584651L0636609L4736156L7230373L7493527
$$ 258169532 265172899 281661838 306246489 336883098 371619254 408849627 446343154
1158.5D46343154L3676326K4533123J1380553j474977q056163m974187L834069R759784
$$ 446343154 480019480 504552603 515933156 514458179 506402016 501427829 505261898 515021682
1174.8E15021682Q689761L741682j414955o271184j0664940j3117790j2647420j0118842
$$ 515021682 523711443 527453125 526038170 519766986 509102046 495984256 483336836 473217994
1191.1D73217994p344902n705356n754084p404565j0056436j2964190j5861213j9237727
$$ 473217994 465873092 460167736 454413652 447009087 436952651 423988461 408127248 388889521
1207.5C88889521k3713797k9164433l4448415l8022280l8726107l5993635l0208618
$$ 388889521 365175724 336011291 301562876 263540596 224814489 188820854 158612236
1221.7A58612236k2716179j4901444p650435j417339L595643P335945R924330J1885703
$$ 158612236 135896057 120994613 113344178 111926839 115522482 122858427 132782757 144668460
1238.1A44668460J4171615J7833442K3763448L2204806M2259798N1511079N6559473
$$ 144668460 158840075 176673517 200436965 232641771 274901569 326412648 382972121
1252.3C82972121N4499865M4017374K5835634L355622j6364396k4977535j9524783
$$ 382972121 437471986 481489360 507324994 510680616 494316220 469338685 449813902
1266.6D49813902n606860P389814J3568908J2743682P853627J769930l849894q748382
$$ 449813902 444207042 451596856 465165764 477909446 485763073 487533003 483683109 474934727
1282.9D74934727j3633460j8760383k3261130k6306212k7783811k7445942k4661154
$$ 474934727 461301267 442540884 419279754 392973542 365189731 337743789 313082635
1297.2C13082635j9425779j2967438o891697k030701J914382N713999R960741J4440865
$$ 313082635 293656856 280689418 273797721 271767020 273681402 279395401 289356142 303797007
1313.5C03797007J7976194J9843668K0281345J9896775J9810557K0624400K2433400
$$ 303797007 321773201 341616869 361898214 381794989 401605546 422229946 444663346
1327.8D44663346K5370508K8541267K9822081K7600110K1914005J3340831L540397
$$ 444663346 470033854 498575121 528397202 555997312 577911317 591252148 594792545
1342.1E94792545l305197k912879N146980J4367521J6114176Q116662o231368k3580491
$$ 594792545 591487348 588574469 593721449 608088970 624203146 632319808 626088440 602507949
1358.4F02507949m3622613o2360883o1356693l4033120L715456L4505575M7442526
$$ 602507949 558885336 496524453 435167760 401134640 404850096 439355671 486798197
1372.7D86798197M2808741K4733127M840850j0525584k0568192k4819851k4205833
$$ 486798197 529606938 554340065 559180915 548655331 528087139 503267288 479061455
1386.9D79061455j7884046q964122l732443l035396n942464j0653943j3807892j4962286
$$ 479061455 461177409 452213287 448480844 445445448 439502984 428849041 415041149 400078863
1403.3D00078863j5576243j4348120j2248784j0515034q734584p480145p253140n620033
$$ 400078863 384502620 370154500 357905716 347390682 338656098 331175953 323922813 318302780
1419.6C18302780N74530Q744299J4630765J4955491J1091619N268604m80682n994946
$$ 318302780 318877310 327621609 342252374 357207865 368299484 373568088 373087406 367092460
1435.9C67092460r954810r784966q357883o341994m952550o708741j0457128j3485253
$$ 367092460 357137650 347352684 338994801 332652807 327700257 320991516 310534388 297049135
1452.2B97049135j3090014o686539P032633J5405804J7735004K1968961K4120480K0647436
$$ 297049135 283959121 277272582 284305215 299711019 317446023 339414984 363535464 384182900
1468.5C84182900J7703623J7835468J7908096J8862605K1308273K2665322K0497799
$$ 384182900 401886523 419721991 437630087 456492692 477800965 500466287 520964086
1482.8E20964086J4250994P145166M28260m412473j492440J2615442L2967806L9301991
$$ 520964086 535215080 542360246 542788506 538376033 536883593 549499035 582466841 621768832
1499.1F21768832K8359890J6294122R635210Q140326O550192L901542J909673N59270
$$ 621768832 650128722 666422844 676058054 684198380 690748572 694650114 696559787 697119057
1515.4F97119057K61247r4473j031935j389683j516461j851320k393246l591597m302859
$$ 697119057 697380304 697285831 696253896 694864213 693347752 691496432 689103186 685511589 681208730
1533.8F81208730l347576l624797n526900m731119k606094k267122l033817m218697
$$ 681208730 677861154 674236357 668709457 663978338 661372244 659105122 656071305 651852608
1550.1F51852608m776895n087734n834460q422553q917988n676150o370306q565962
$$ 651852608 647075713 641987979 636153519 627730966 618812978 613136828 606766522 598200560
1566.4E98200560j1188209j3818264j3566316j5434980j9427180j5804649j0867744
$$ 598200560 587012351 573194087 559627771 544192791 524765611 508960962 498093218
1580.7D98093218r273082p404089n501271n332559p408381j0725528j3885438j4708221
$$ 498093218 488820136 481416047 475914776 470582217 463173836 452448308 438562870 423854649
1597D23854649j1749208o790787m485637p419854j3026357j7855465k0264864k0890266
$$ 423854649 412105441 405314654 400829017 393409163 380382806 362527341 342262477 321372211
1613.4C21372211k3950487k8174282k4104028k1021545k2628963k0620630j6854062
$$ 321372211 297421724 269247442 245143414 224121869 201492906 180872276 164018214
1627.6A64018214j3806567r768873o755263m416257m14953K841041M747331N706221
$$ 164018214 150211647 140442774 133687511 129271254 128856301 131697342 136444673 142150894
1643.9A42150894O515592N747333K641872j273066n265459n403281n620226o918058
$$ 142150894 148666486 154413819 157055691 155782625 150517166 145113885 139493659 132575601
1660.3A32575601q066691p761866o565548o909952p725775o695181o584213o741352
$$ 132575601 124508910 116747044 110181496 103271544 95545769 88850588 82266375 75525023
1676.6G5525023n456544m606031m653808n040724l534559k322931j909312j341298
$$ 75525023 70068479 65462448 60808640 55767916 52233357 49910426 48001114 46659816
1692.9D6659816o68760O9309R97565K095044K452705K808180L547393M361916N400434
$$ 46659816 45991056 46060365 47057930 49152974 51605679 54413859 57961252 62323168 67723602
1711.3F7723602P261291J0445044J6523160K0983420K2258267K6712447L1942144L4797639
$$ 67723602 74984893 85429937 101953097 122936517 145194784 171907231 203849375 238647014
1727.6B38647014L6171168L5981596M0644019M0067971L0166209K8147936K7468294
$$ 238647014 274818182 310799778 351443797 391511768 421677977 449825913 477294207
1741.9D77294207K3665905K1182954J9418418J9060195J8449724J5932858J4688789
$$ 477294207 500960112 522143066 541561484 560621679 579071403 595004261 609693050
1756.1F09693050J4333249J3309001J3582767J3014495J1273622J0407865J0042727
$$ 609693050 624026299 637335300 650918067 663932562 675206184 685614049 695656776
1770.4F95656776J1391283J2098610J0604501R681225R746849R506166Q526087P055282
$$ 695656776 707048059 719146669 729751170 739432395 749179244 758685410 767211497 774266779
1786.7G74266779N238653M277706M499376L961205K515257J840412K241790K642632
$$ 774266779 779505432 783783138 788282514 792243719 794758976 796599388 798841178 801483810
1803H01483810K255142J841426K122044K735555K739549K108753J897812K207040K090455
$$ 801483810 803738952 805580378 807702422 810437977 813177526 815286279 817184091 819391131 821481586
1821.4H21481586J491427J445830J995802K856672L587424L258109K851725L113866
$$ 821481586 822973013 824418843 826414645 829271317 832858741 836116850 838968575 842082441
1837.7H42082441K989769J866579J223326J971960K428233J815260Q78513M08232N68688
$$ 842082441 845072210 846938789 848162115 850134075 852562308 854377568 855256081 855664313 856233001
1856.1H56233001O32763P6234o31630r46105j119852j415253j465261j359164j186014
$$ 856233001 856865764 856941998 856310368 855364263 854244411 852829158 851363897 850004733 848818719
1874.4H48818719r05215r07481j020610o36280M3988J27077m02569n23746o3837K53439
$$ 848818719 847913504 847006023 845985413 845349133 845393121 845520198 845117629 844593883 844530046 844783485
1894.8H44783485J54614k05814j93596L28719N58734P7546l68178m9114L49283o1214
$$ 844783485 844938099 844732285 844538689 844867408 845426142 845503688 845135510 845086396 845435679 845374465
1915.2H45374465q18312q17776l31283j53899m32849r43541j001239p30515r38713
$$ 845374465 844556153 843738377 843407094 843253195 842820346 841876805 840875566 840145051 839206338
1933.6H39206338j629174k063215j989185j750231j534641j294792p71105O0141N67138
$$ 839206338 837577164 835513949 833524764 831774533 830239892 828945100 828173995 828234136 828801274
1951.9H28801274M42028L04520O26266J026989Q72671L12626J84715P55728J124799
$$ 828801274 829243302 829547822 830174088 831201077 832073748 832386374 832571089 833326817 834451616
1970.3H34451616P47144L10838M40836Q02458O79492J42396r0301K68161O11067M07636
$$ 834451616 835198760 835509598 835950434 836752892 837432384 837574780 837484479 837752640 838363707 838771343
1990.7H38771343Q6725J80960M50611L83913j02579m86315l28421o6221k59221p12454
$$ 838771343 838858068 839039028 839489639 839873552 839770973 839284658 838956237 838890016 838630795 837918341
2011.1H37918341q49545o05285m18603o08504r49502r52900n30123m4763m0174k77221
$$ 837918341 837068796 836463511 836044908 835436404 834486902 833534002 833003879 832959116 832918942 832641721
2031.5H32641721j07825J60634l6001m04656l48210K0564R7036k58625n18083l23534
$$ 832641721 832533896 832694530 832658529 832253873 831905663 831926227 832023263 831764638 831246555 830923021
2051.9H30923021m4763j79172n62072o52253l77655k34306m82202p72059p16447m16995
$$ 830923021 830878258 830699086 830137014 829484761 829107106 828872800 828390598 827618539 826902092 826485097
2072.3H26485097l82065p09117q66115n71549k73883m21822p62880p52568l72529k12372
$$ 826485097 826103032 825393915 824527800 823956251 823682368 823260546 822497666 821745098 821372569 821160197
2092.7H21160197n05626p31945m87566r7513r6202l92318m03166J3650L16798J14143
$$ 821160197 820654571 819922626 819435060 819337547 819241345 818849027 818445861 818459511 818776309 818890452
2113.1H18890452k03013q8990K71321L14116m4703k87176p8797J77801k8611m79817
$$ 818890452 818687439 818598449 818869770 819183886 819139183 818852007 818773210 818951011 818922400 818442583
2133.5H18442583n82457k92718j62184m85778q07166o25789k54035l06428o82950p86960
$$ 818442583 817860126 817567408 817405224 816919446 816112280 815486491 815232456 814926028 814243078 813456118
2153.9H13456118m52042j61409l28004o24717n32627k17914k15590n19812o30975l68059
$$ 813456118 813004076 812842667 812514663 811889946 811357319 811139405 810923815 810404003 809773028 809404969
2174.3H09404969j27554l18408o78360o33180k47121j07289m23312p09712n12541j50740
$$ 809404969 809277415 808959007 808280647 807647467 807400346 807293057 806869745 806160033 805647492 805496752
2194.6H05496752k22325o40452p85768m76480k73346n33879q12531o64890l14772k84552
$$ 805496752 805274427 804633975 803848207 803371727 803098381 802564502 801751971 801087081 800772309 800487757
2215H00487757n97716p39455m74751j97649l33369p01368p44879m10616k89858n93483
$$ 800487757 799890041 799150586 798675835 798478186 798144817 797443449 796698570 796287954 795998096 795404613
2235.4G95404613q25703o23167l10719l78608p04229p46429m16518k11596m02689o35922
$$ 795404613 794578910 793955743 793645024 793266416 792562187 791815758 791399240 791187644 790784955 790149033
2255.8G90149033m65870r1970n9545l60608m58300j69396L8325j87695n35428n17369
$$ 790149033 789683163 789591193 789531648 789171040 788712740 788543344 788581669 788393974 787858546 787341177
2276.2G87341177k26318j62542m35651o25372m60982k20001l16858o07610n98251k98501
$$ 787341177 787114859 786952317 786516666 785891294 785430312 785210311 784893453 784285843 783687592 783389091
2296.6G83389091j80065m61996p89225p84159o06060o53386r15408r70006o59287l84748
$$ 783389091 783209026 782747030 781957805 781173646 780567586 779914200 778998792 778028786 777369499 776984751
2317G76984751n16593p96080p76350n29707n24163q82328j202881j092970p04825n36680
$$ 776984751 776468158 775672078 774895728 774366021 773841858 772959530 771756649 770663679 769958854 769422174
2337.4G69422174o03855m86016k29299j47284k19702m27604o90997q50260r89437j157939
$$ 769422174 768818319 768332303 768103004 767955720 767736018 767308414 766617417 765767157 764777720 763619781
2357.8G63619781j156748r55343p61211q41200j046956r42349n86629m31717n33282
$$ 763619781 762463033 761507690 760746479 759905279 758858323 757915974 757329345 756897628 756364346
2376.2G56364346n02289k04444M0829k3245k48552k74062m0233J35124O6161l3856
$$ 756364346 755862057 755657613 755698442 755675197 755426645 755152583 755112350 755247474 755313635 755279779
2396.6G55279779O3897K16722J65045m4703j15872J3054R4890l2305k27332k62022
$$ 755279779 755343676 755560398 755725443 755680740 755564868 755577922 755672812 755640507 755413175 755151153
2417G55151153j68264j70470l42190m71890l87311k71201l72112n75244o15060m93169
$$ 755151153 754982889 754812419 754470229 753998339 753611028 753339827 752967715 752392471 751777411 751284242
2437.4G51284242m34041n48244o55591o01948m89354m95076o17623o56426n06342l37839
$$ 751284242 750850201 750301957 749646366 749044418 748555064 748059988 747442365 746785939 746279597 745941758
2457.8G45941758l49045m58598m62055l52204l34978m88579o21498n83649m59134m32432
$$ 745941758 745592713 745134115 744672060 744319856 743984878 743496299 742874801 742291152 741832018 741399586
2478.1G41399586m91380m54665l14653k56836l49701m74274n08904m52161m58181o22630
$$ 741399586 740908206 740453541 740138888 739882052 739532351 739058077 738549173 738097012 737638831 737016201
2498.5G37016201p51138o99520o33836p02083q38577q57294p40826p05958q04543q36074
$$ 737016201 736265063 735565543 734931707 734229624 733391047 732533753 731792927 731086969 730282426 729446352
2518.9G29446352o86348m90725m26173m58658m42982l52025k70307k85268l52978l11315
$$ 729446352 728760004 728269279 727843106 727384448 726941466 726589441 726319134 726033866 725680888 725369573
2539.3G25369573j74046j59442k90871l45707k53975j53840j67847k62200k98560k36154
$$ 725369573 725195527 725036085 724745214 724399507 724145532 723991692 723823845 723561645 723263085 723026931
2559.7G23026931k04444k98380m07219l86835l11434l77655n51879o52671o68883o74785
$$ 723026931 722822487 722524107 722116888 721730053 721418619 721040964 720489085 719836414 719167531 718492746
2580.1G18492746o94930p06077o54101n76079n90086p01130p53939o62505n39244n25772
$$ 718492746 717797816 717091739 716437638 715861559 715271473 714570343 713816404 713153899 712614655 712088883
2600.5G12088883o10471o45280n84364n45740n79178n83172m82082l85821m17114n30242
$$ 712088883 711478412 710833132 710248768 709703028 709123850 708540678 708058596 707672775 707255661 706725419
2620.9G06725419n93424n40853m77314n30243n99324n40197m40717m54068n40555n56707
$$ 706725419 706131995 705591142 705113828 704583585 703984261 703444064 703003347 702549279 702008724 701452017
2641.3G01452017m86255m06206l82483l96311l41475k25723j87218k49922k93195k32935
$$ 701452017 700965762 700559556 700177073 699780762 699439287 699213564 699026346 698776424 698483229 698250294
2661.7F98250294j68085k24352l33786l66271k98142k45393l06189m04596m38750m53174
$$ 698250294 698082209 697857857 697524071 697157800 696859658 696614265 696308076 695903480 695464730 695011556
2682.1F95011556n24640o32107p26998p78735p97510q48710r78768j100362j096785
$$ 695011556 694486916 693854809 693127811 692349076 691551566 690702856 689724088 688623726 687526941
2700.5F87526941j052022j082301j129746j111150j090705j107693j121402j142740
$$ 687526941 686474919 685392618 684262872 683151722 682061017 680953324 679831922 678689182
2716.8F78689182j134038j104415j149654j204610j185477j175701j233042j289248
$$ 678689182 677555144 676450729 675301075 674096465 672910988 671735287 670502245 669212997
2733.1F69212997j303554j299023j285494j311898j393318j444340j472175j568675
$$ 669212997 667909443 666610420 665324926 664013028 662619710 661175370 659703195 658134520
2749.4F58134520j708269j796007j813531j797855j816213j883269j911640j879692
$$ 658134520 656426251 654630244 652816713 651018858 649202645 647319376 645407736 643528044
2765.7F43528044j871943j902163j904667j891732j890242j891077j911401j919747
$$ 643528044 641656101 639753938 637849271 635957539 634067297 632176220 630264819 628345072
2782F28345072j870930j798451j769543j782000j807868j827717j809299j789749j810014
$$ 628345072 626474142 624675691 622906148 621124148 619316280 617488563 615679264 613889515 612079501
2800.4F12079501j823246j783789j729846j682519j587689j434446j242697j041532
$$ 612079501 610256255 608472466 606742620 605060101 603472412 602037966 600795269 599753737
2816.7E99753737r09209q53777q23080q34644r33468j109243j276791j391530j540601
$$ 599753737 598844528 597990751 597167671 596333027 595399559 594290316 593013525 591621995 590081394
2835.1E90081394j784921k028108k217292k440393k699495k864301k858102k768219
$$ 590081394 588296473 586268365 584051073 581610680 578911185 576046884 573188782 570420563
2851.4E70420563k714038k751946k941728l294050l742218m163266m287302l841579
$$ 570420563 567706525 564954579 562012851 558718801 554976583 550813317 546526015 542684436
2867.7E42684436k880395j802742j086354r94265j465917k221823l008425l729343
$$ 542684436 539804041 538001299 536914945 535920680 534454763 532232940 529224515 525495172
2884E25495172m364431m880906n245327n467594n565196n525500n271137m658490l532708
$$ 525495172 521130741 516249835 511004508 505536914 499971718 494446218 489175081 484516591 480983883
2902.4D80983883j964897m54455M02748L57121l78251j359462k305985l148198l853858
$$ 480983883 479018986 478564531 478967279 479324400 478946149 477586687 475280702 472132504 468278646
2920.7D68278646m261255m101038l388375k444714j494825n55515M59522J570284K563268
$$ 468278646 464017391 459916353 456527978 454083264 452588439 452032924 452492446 454062730 456625998
2939.1D56625998L030539K686679J666278L88771o81251j170338r83268l29077M28498
$$ 456625998 459656537 462343216 464009494 464398265 463717014 462546676 461563408 461234331 461662829
2957.4D61662829R57012J006842L90678q85605k549023m088312m901618m528522k831102
$$ 461662829 462619841 463626683 464017361 463131756 460582733 456494421 451592803 447064281 444233179
2975.8D44233179j11848K958238N678296P664234Q834928R223848Q920968Q077085
$$ 444233179 444121331 447079569 452757865 460422099 469257027 478480875 487401843 495478928
2992.1D95478928O947994N764783M616678L647685L023982K714276K547502K250076
$$ 495478928 502426922 508191705 512808383 516456068 519480050 522194326 524741828 526991904
3008.4E26991904J467764M7743j824498l864109n867601p631480q771658q784384p218808
$$ 526991904 528459668 528507411 526682913 522818804 516951203 509319723 500548065 491763681 484544873
3026.8D84544873m206300r20832J339138K096742J701057P80821m61787k007633l505469
$$ 484544873 480338573 479417741 480756879 482853621 484554678 485335499 484873712 482866079 479360610
3045.1D79360610m542947m946887m910439m753411m572332m320800l766626k692670
$$ 479360610 474817663 469870776 464960337 460206926 455634594 451313794 447547168 444854498
3061.5D44854498j310200j03861M73351L46422j17332o52373j231342j892835k645999
$$ 444854498 443544298 443440437 443913788 444260210 444142878 443490505 442259163 440366328 437720329
3079.8D37720329l144354k986759k191514r52184J87486N85407L97414J02401j67489
$$ 437720329 434575975 431589216 429397702 428445518 428633004 429218411 429615825 429718226 429550737
3098.2D29550737l62664l43293j1325N16593Q93712R54599J030921J264871J342028
$$ 429550737 429188073 428844780 428833455 429350048 430243760 431198359 432229280 433494151 434836179
3116.5D34836179J236051J160771J222283J471787J781464J950085J977742K053112
$$ 434836179 436072230 437233001 438455284 439927071 441708535 443658620 445636362 447689474
3132.8D47689474K243280K418518K452254K304793K175063K170741K137304K042114
$$ 447689474 449932754 452351272 454803526 457108319 459283382 461454123 463591427 465633541
3149.2D65633541J883656J593083J236469R04918N54591J94758j51425n18471q64238
$$ 465633541 467517197 469110280 470346749 471251667 471806258 472001016 471849591 471331120 470466882
3167.5D70466882j153976j409918j661032j965136k260267k454639k657294k892286
$$ 470466882 469312906 467902988 466241956 464276820 462016553 459561914 456904620 454012334
3183.8D54012334l061324l174990l302694l436535l496766l503711l493577l446847
$$ 454012334 450951010 447776020 444473326 441036791 437540025 434036314 430542737 427095890
3200.1D27095890l381401l318072l216773l065109k883315k712071k566874k388030
$$ 427095890 423714489 420396417 417179644 414114535 411231220 408519149 405952275 403564245
3216.5D03564245k189726j981020j747787j513898j285762j069993q47250o00934l58403
$$ 403564245 401374519 399393499 397645712 396131814 394846052 393776059 392928809 392327875 391969472
3234.8C91969472j20938J30236L47347M93913O41764Q69900J102209J206130J228749
$$ 391969472 391848534 391978770 392326117 392820030 393461794 394331694 395433903 396640033 397868782
3253.2C97868782J306773J418173J456857J444250J452625J455217J400709J300157
$$ 397868782 399175555 400593728 402050585 403494835 404947460 406402677 407803386 409103543
3269.5D09103543J254767J272917J237690J139343J017213R00954Q06152P05511N42283
$$ 409103543 410358310 411631227 412868917 414008260 415025473 415926427 416732579 417438090 417980373
3287.8D17980373L48598K45124K18987J85192J07944k2501j89692l37273m19467m35740
$$ 417980373 418328971 418574095 418793082 418978274 419086218 419063717 418874025 418536752 418117285 417681545
3308.2D17681545m21375m51356n39601o16849o54548o76840o99312o89208o46830o15895
$$ 417681545 417260170 416808814 416269213 415652364 414997816 414320976 413621664 412932456 412285626 411669731
3328.6D11669731n81384n73039o35475o58154n54174m35889l84122l76880l90232l52889
$$ 411669731 411088347 410515308 409879833 409221679 408667505 408231616 407847494 407470614 407080382 406727493
3349D06727493k05338m6313J3798N7936J49071K54363L22938L59237M58807P05600
$$ 406727493 406522155 406475842 406489640 406547576 406696647 406951010 407273948 407633185 408091992 408797592
3369.4D08797592R97543J144856J238734J391530J575261J836300K173484K498567
$$ 408797592 409795135 410939991 412178725 413570255 415145516 416981816 419155300 421653867
3385.7D21653867K780795L012448L332854L825932M221231M352957M435629M711658
$$ 421653867 424434662 427447110 430779964 434605896 438827127 443180084 447615713 452327371
3402.1D52327371M963696M916906M733384M629343M614354M657238M648120M481345
$$ 452327371 457291067 462207973 466941357 471570700 476185054 480842292 485490412 489971757
3418.4D89971757M336178M327774M295707M166126M075766M069626M033506L914654
$$ 489971757 494307935 498635709 502931416 507097542 511173308 515242934 519276440 523191094
3434.7E23191094L851831L839851L703654L479004L249168L074586K918542K657413
$$ 523191094 527042925 530882776 534586430 538065434 541314602 544389188 547307730 549965143
3451E49965143K336085K077580J832604J553416J345813J219929J077056R43541R26495
$$ 549965143 552301228 554378808 556211412 557764828 559110641 560330570 561407626 562351167 563277662
3469.4E63277662R61900R52363Q97288Q32379P59125P29501P76708Q07941Q31544Q82447
$$ 563277662 564239562 565191925 566089213 566921592 567680717 568410218 569186926 569994867 570826411 571708858
3489.8E71708858R09448Q87453Q58605Q61943Q66175Q58068Q97408R28580R32575J023352
$$ 571708858 572618306 573505759 574364364 575226307 576092482 576950550 577847958 578776538 579709113 580732465
3510.2E80732465J142978J120389R97186R67621J020849J031935R47893Q93891J076817
$$ 580732465 581875443 582995832 583993018 584960639 585981488 587013423 587961316 588855207 589932024
3528.5E89932024J324475J304031J175642J172006J184821J159430J092255J025498
$$ 589932024 591256499 592560530 593736172 594908178 596092999 597252429 598344684 599370182
3544.8E99370182J111269J273274J247048J193405J316547J390874J330614J196683
$$ 599370182 600481451 601754725 603001773 604195178 605511725 606902599 608233213 609429896
3561.1F09429896R22203P03335J187026K020777K070069J703143J581490J623690J717031
$$ 609429896 610352099 611055434 612242460 614263237 616333306 618036449 619617939 621241629 622958660
3579.5F22958660J787961J560688J139044J303196K054394K119839J766085J846612
$$ 622958660 624746621 626307309 627446353 628749549 630803943 632923782 634689867 636536479
3595.8F36536479K025247J973450J990855J867055J393617J234173J520753J676202
$$ 636536479 638561726 640535176 642526031 644393086 645786703 647020876 648541629 650217831
3612.1F50217831J770675J645148J462817K011180K390146J754404P64846O76692K070844
$$ 650217831 651988506 653633654 655096471 657107651 659497797 661252201 662017047 662693739 664764583
3630.5F64764583K616286K107323J690566J465082J394928J257419P07329L3378N14150
$$ 664764583 667380869 669488192 671178758 672643840 674038768 675296187 676003516 676036894 676551044
3648.8F76551044K238333K639175J860022J777709K118766J728118J138865P72357
$$ 676551044 678789377 681428552 683288574 685066283 687185049 688913167 690052032 690824389
3665.2F90824389K05398j39654M47393M29988Q4400J155376J762271J301885P65204
$$ 690824389 691029787 690890133 691337526 691767514 691851914 693007290 694769561 696071446 696836650
3683.5F96836650J98305l67343l18349N34833R47892N89609L9220m23491m27127R2149
$$ 696836650 697034955 696667612 696349263 696884096 697831988 698421597 698460817 698037326 697610199 697702348
3703.9F97702348O4552p18355j271486o05941N46276N59688j51873o83069o99520l81231
$$ 697702348 697766900 697048545 695777059 695171118 695717394 696277082 696125209 695442140 694742620 694361389
3724.3F94361389k5332O5922m77612j188218j084685q2255O18637J44601j134694j528919
$$ 694361389 694336057 694401979 693924367 692736149 691651464 691569209 692187846 692332447 691197753 689668834
3744.7F89668834l55243k91586n96702M94658R30787J64866k83480R4772K13027k22326
$$ 689668834 689313591 689022005 688425303 688919961 689850748 690015614 689732134 689826906 690039933 689817607
3765.1F89817607n33461m89056k7836K77400j5139m34518n12302k46167j93954k88784
$$ 689817607 689284146 688795090 688767254 689044654 689029515 688594997 688082695 687836528 687642574 687353790
3785.5F87353790j65522o8844j80244n62668r38713q82745r86219q05855J24217J37329
$$ 687353790 687188268 687119424 686939180 686376512 685437799 684555054 683568835 682762980 682887197 683024526
3805.9F83024526K6285L81828K7477q48293j168370p41840p64489k62737N76973K50935
$$ 683024526 683050811 683432639 683460116 682611823 681443453 680701613 679937124 679674387 680251360 680502295
3826.3F80502295k36868m81964o11245o03020r34065r82344j74641L61502M28438K15769
$$ 680502295 680265427 679783463 679172218 678569198 677635133 676652789 676478148 676839650 677268088 677483857
3846.7F77483857l99947j452744k262474n87821J176954O71804l08335p93576n32329
$$ 677483857 677083910 675631166 673368692 672780871 673957825 674629629 674321294 673527718 672995389
3865F72995389l28243p21813m83810K03430L33190j8060o53982n73039j84238k93017
$$ 672995389 672667146 671945333 671461523 671664953 671998143 671980083 671326101 670753062 670568824 670275807
3885.4F70275807j10268j73509m22061L5525J16527o92904j220167r44972l13878M46200
$$ 670275807 670165539 669992030 669569969 669605494 669722021 669029117 667808950 666863978 666550100 666996300
3905.8F66996300P13706L10421j45197m92453p73728o13034j47641o9677k79665k44439
$$ 666996300 667710006 668020427 667875230 667382777 666609049 665996015 665848374 665778697 665499032 665254593
3926.2F65254593k01821l87490l48747l1352O1810j15991l56495m38154k43068j87456
$$ 665254593 665052772 664665282 664316535 664285183 664346993 664231002 663874507 663436353 663193285 663005829
3946.6F63005829k83122j46151J0967m3511j48177k07484k57850k44975j60277j53839
$$ 663005829 662722707 662576556 662587523 662544012 662395835 662188351 661930501 661685526 661525249 661371410
3967F61371410k39074k59281j78456j19150j70588k43008j97113j15752j68085k88069
$$ 661371410 661132336 660873055 660694599 660575449 660404861 660161853 659964740 659848988 659680903 659392834
3987.4F59392834l11375k67744k57373k65539k62260
$$ 659392834 659081459 658813715 658556342 658290803 658028543
3997.6F58028543
$$ 658028543
##END=$$ End of the data block
