##TITLE=FA132 $$ Begin of the data block
##JCAMP-DX=5.00 $$ ACD/SpecManager v 10.08
##SPECTROMETER/DATA SYSTEM=Alpha
##DATE=20 Feb 2015 09:12:38
##DATA TYPE=INFRARED SPECTRUM
##DATA CLASS=XYDATA
##ORIGIN=
##OWNER=
##NPOINTS=1765
##FIRSTX=399.76428223
##LASTX=3997.64306641
##MAXX=3997.64306641
##MINX=399.76428223
##MAXY=0.84696019
##MINY=0.04817547
##XFACTOR=1.0000000000
##YFACTOR=1.000000000000000e-9
##FIRSTY=0.75756031
##DELTAX=2.03961372
##XUNITS=1/CM
##YUNITS=ARBITRARY UNITS
##XYDATA=(X++(Y..Y))
399.8G57560313O781280L338754J820266M096389N090356J799226j459539j330793
416.1G77696252O83546J608431o05344j522482P54237J195789k029777m141927k731502
434.4G70907223r62972k368570n951762p488847o471872p584512j2140215j6344785
450.8G11593688j7435730j5479684j1613846l185153Q591950J7158151J9621909J7182409
467.1G26433694J3352454J1073589R811163O367624J730442n85317n11051j068473
483.4G66604125m018187q070827j0070979o359756K277434P034421L903508j288891
499.7G50010848n377114j0692596j8504322k5543511k3154735p739723J0884345K1959900
516F91843092K4213613J9902944J2325287N308330J451135P74622O82354n78523k264381
$$ plain form
399.8 757560313 764341593 767680347 769500613 773597002 778687358 780486584 779027045 777696252
416.1 777696252 778379798 779988229 779382885 777860403 778614640 779810429 777780652 773638725 770907223
434.4 770907223 769944251 767575681 761623919 754135072 747663200 740078688 727938473 711593688
450.8 711593688 694157958 678678274 667064428 663879275 672471225 689629376 709251285 726433694
467.1 726433694 739786148 750859737 760670900 767038524 768768966 768183649 767672598 766604125
483.4 766604125 762585938 754515111 744444132 738084376 740361810 747396231 751299739 750010848
499.7 750010848 744633734 733941138 715436816 689893305 666738570 658998847 669883192 691843092
516 691843092 716056705 735959649 748284936 753593266 755044401 755819023 756501377 755922854 753658473
534.4G53658473k576708j671136j521945k886712m174650l757775k608955k895117
550.7G31565475m467964n153894m287183l773332n153179p242501q203864q363187
567F84920371r873510j3956606j9409538k5254488l2057046m0554285m8562795m5274556
583.3D49977547j7890543K6431978N6777835N5194259L5692334J9385874J2279391
597.6F37848675J1103571J2670755J2509883P061541j319290p653415r339332p319510
613.9F55562878l410340J189292K531767l038824j4216363k6737869l3882499k8735220
630.2E49262822j2549401L352642R413660O107151j374244j0100186j9341946k7197331
646.6D97573167l0363291k5743962j3366759L926486K1703690L5265834M1294187L8329899
$$ plain form
534.4 753658473 751081765 749410629 747888684 745001972 740827322 737069547 734460592 731565475
550.7 731565475 727097511 721943617 717656434 713883102 708729923 701487422 693283558 684920371
567 684920371 675046861 661090255 641680717 616426229 584369183 543814898 495252103 449977547
583.3 449977547 432087004 458518982 515296817 570491076 606183410 625569284 637848675
597.6 637848675 648952246 661623001 674132884 681194425 679875135 672221720 662882388 655562878
613.9 655562878 652152538 653341830 655873597 652834773 638618410 611880541 577998042 549262822
630.2 549262822 536713421 540066063 549479723 555586874 554212630 544112444 524770498 497573167
646.6 497573167 467209876 441465914 428099155 432025641 453729331 488995165 530289352 568619251
662.9E68619251K8220773K1896541K1617711J5409231R525657M773497k28524k803147
679.2F67030990m170775p055700j1447728j6186356k4318338m1228473o2363565o6654026
695.5D33606029l3798308K2186667O0899884O5896719N3017140L7614465K3520350
709.8F62942946J0999739J412630l741443n603790p518292j1189162j5379608j8349588
726.1F13573432j9682109j9564510j6410827p700861M781246J4798463J8774926J8220246
742.4F06790006J4356494N477250r934962k8278649m0470183m1922509l9771379l6954045
758.7D29292023k2093594L829986K1754324K5407136K1828979J3690293M277855K214700
775.1E00201702J0977864K2644461K8763115K9583573K8714776K7113378K4367869
$$ plain form
662.9 568619251 596840024 618736565 640354276 655763507 665289164 670062661 669834137 667030990
679.2 667030990 662860215 655804515 644356787 628170431 603852093 562623620 500260055 433606029
695.5 433606029 399807721 421994388 482894272 548790991 601808131 639422596 662942946
709.8 662942946 673942685 675355315 671613872 666010082 658491790 647302628 631923020 613573432
726.1 613573432 593891323 574326813 557915986 550215125 554996371 569794834 588569760 606790006
742.4 606790006 621146500 626623750 616688788 588410139 547939956 506017447 466246068 429292023
758.7 429292023 407198429 411028415 432782739 458189875 480018854 493709147 497987002 500201702
775.1 500201702 511179566 533824027 562587142 592170715 620885491 647998869 672366738
789.3F72366738K0947457J6754985R957432N5552q726776j0883510o818473k246142
805.6F91407263j87397J208186L688693O135703O349980L915310M56035l455102r880006
824F99638665j9104243k2567093q587360J5856087K8265118K3776055J6206324J2280583
840.3G45764136R318173N053401j39892m178882n220770l142953N63621L876210N645275
858.7G57538319N723059M133165J524031o18756j507521k095759l638505n777538p239938
877G48040557p762909p802904o362021j453817O126047J1867642J2238026Q417368
893.4G63307989M109800J474857J01983j238227k779424l957927m336774l381372j299798
911.7G52001107j4007n38826j628518k625466m024505n670429o974697q188546j0144531
$$ plain form
789.3 672366738 693314195 710069180 720026612 720082164 711355388 700471878 693653405 691407263
805.6 691407263 691219866 692428052 696116745 702252448 708602428 712517738 712973773 709518671 699638665
824 699638665 680534422 657967329 649379969 665236056 693501174 717277229 733483553 745764136
840.3 745764136 755082309 760135710 759995818 755816936 750596166 747453213 748016834 751893044 757538319
858.7 757538319 763261378 767394543 768918574 768299818 766792297 764696538 761058033 755280495 748040557
877 748040557 740277648 732474744 726112723 724658906 730784953 742652595 754890621 763307989
893.4 763307989 767417789 768892646 768994629 767756402 764976978 761019051 756682277 753300905 752001107
911.7 752001107 751987100 751448274 749819756 747194290 743169785 737499356 730524659 722336113 712191582
930.1G12191582j3025940j6171634j9048333k2026837k5177419k6646853k3018837
944.3E67075729j2111187L739894J8021285K5303305K5269627K0324826J1457801J910091
960.7F60991371q02160K636612O818652J3181984J8330694J5938460R400189M176498
977G30672300Q08179j462161k431870k404213k490222l092706l486932l296971l613949
995.3G09201455n738020q043945p297873m772723m245460n987227q077502r362102
1011.6F55676603r829700j0244548j1210084j2592733j3714552j3367235r816587j825214
1028E73075950J0098219K2343218K7618587K1960259J1117101K912700j059950l105044
1044.3F64961040m899442o355465p011771p398069q409559j0083974j1724591j3033867
$$ plain form
930.1 712191582 699165642 682994008 663945675 641918838 616741419 590094566 567075729
944.3 567075729 554964542 558704436 576725721 602029026 627298653 647623479 659081280 660991371
960.7 660991371 660189211 662825823 669644475 682826459 701157153 717095613 726495802 730672300
977 730672300 731480479 730018318 727586448 725182235 722692013 719599307 716112375 712815404 709201455
995.3 709201455 703463435 695419490 688121617 683348894 679103434 673116207 665038705 655676603
1011.6 655676603 645846903 635602355 624392271 611799538 598084986 584717751 574901164 573075950
1028 573075950 583174169 605517387 633135974 655096233 666213334 669126034 668066084 664961040
1044.3 664961040 660061598 653706133 646694362 639296293 630886734 620802760 609078169 596044302
1060.6E96044302j4580667j6782701j8796444j9242167j8842519k0792782k6518703
1074.9D60488319l3338546l6772102l2903284k3293078j7692209k2697538l2534867
1089.2B61256695l8263053l7219107l0740753j9541129l316030J6455486L4510687
1103.4A83142796M3342069L9854318L1444222L0297964L9145798M8765123N1372915
1117.7D67365205M8668087M4653654L8696885K8845608J5767098R95874j4471769k7202368
1134F03318274k9576719j6163707P120252K4576187K4794519J0379672q595705k4423301
1150.3E91429472l3607781l3449233j8149912J2727082M2426050N1850378M1334212
1164.6F54560268K3745537Q605778o88553l984690k594709O26266K330780J188695
$$ plain form
1060.6 596044302 581463635 564680934 545884490 526642323 507799804 487007022 460488319
1074.9 460488319 427149773 390377671 357474387 334181309 316489100 293791562 261256695
1089.2 261256695 222993642 185774535 155033782 135492653 132176623 148632109 183142796
1103.4 183142796 226484865 266339183 297783405 328081369 367227167 415992290 467365205
1117.7 467365205 516033292 560686946 599383831 628229439 643996537 644992411 630520642 603318274
1134 603318274 573741555 557577848 564698100 589274287 614068806 624448478 615852773 591429472
1150.3 591429472 557821691 524372458 506222546 518949628 561375678 613226056 654560268
1164.6 654560268 678305805 686911583 686223030 682238340 679643631 680269897 682600677 683789372
1180.9F83789372k500057q256733j4618874j9224882k0359516j7854035j1796415j771629
1197.3E87407231Q311570J0763586M405260m707337j2386977j8505574k3884415k9287756
1213.6E22115588l5491317m2533040m9171031n3594112n4273695n0163761m1078150
1227.9A95810482k8024852j2182027O209597K7099177M8532292O5488160P2850048
1242.1C75782877O9910705O0306043M8658728L7785828K8300643J9801081J1754036
1256.4F52299941L169894p041455j7984092k6711821k8386236j5350580J0024548K7351916
1272.7E97372115K4235129J1273026N39065o286681j1348843j6036094k0816505k5840461
1289E53090751l1334817l7266612m2661369m5663655m4240534l7603498k5551438o927759
$$ plain form
1180.9 683789372 681289315 673032582 658413708 639188826 618829310 600975275 589178860 587407231
1197.3 587407231 595718801 606482387 610887647 606180310 593793333 575287759 551403344 522115588
1213.6 522115588 486624271 444091231 394920200 341326088 287052393 236888632 195810482
1227.9 195810482 167785630 155603603 161813200 188912377 237444669 302932829 375782877
1242.1 375782877 445693582 505999625 554658353 592444181 620744824 640545905 652299941
1256.4 652299941 655469835 648428380 630444288 603732467 575346231 559995651 570020199 597372115
1272.7 597372115 621607244 632880270 633419335 627132654 615783811 599747717 578931212 553090751
1289 553090751 521755934 484489322 441827953 396164298 351923764 314320266 288768828 281841069
1305.4B81841069J6602129L7729085N0100922N1644862M1865408K4614633P123351
1319.6E11521459n080700r294778l673643J0538041K6394248L6863268L9493084L5391032
1336F42152011K7382970J7292083N710721o027699j7123818k6248873k8945148k0716309
1352.3E93475938l759980J3383805J8889547M340112k6309133n0001442m2465150n196393
1368.6E02357304L5847664N2404404M3823123K4346530R177625J007498l894449p357001
1384.9F57712698r768486j0079145p969499n250156k407789j510799l856003p058740
1401.2F09812081r966016j2756646j4527440j6744137k0843088k5218487k7030021
1415.5D82726246k1904528m292548J4935941K0846575J7542750J1494040P308782M036486
$$ plain form
1305.4 281841069 298443198 336172283 386273205 437918067 479783475 504398108 511521459
1319.6 511521459 506440759 497145981 493472338 504010379 530404627 567267895 606760979 642152011
1336 642152011 669534981 686827064 692537785 686510086 669386268 643137395 614192247 593475938
1352.3 593475938 589715958 603099763 621989310 626329422 600020289 550018847 507553697 502357304
1368.6 502357304 538204968 590609372 634432495 658779025 667956650 668964148 665069699 657712698
1384.9 657712698 647944212 637865067 629895568 624645412 622237623 620726824 616870821 609812081
1401.2 609812081 599846065 587089419 572561979 555817842 534974754 509756267 482726246
1415.5 482726246 460821718 456529170 471465111 492311686 509854436 521348476 528657258 532693744
1431.8E32693744K5272n427599j0932505j3629437j5720784j7093241j8738330k3020685
1448.1D28156435k6674360k7684092k5491506j7357707J470953J0863394L404796m795164
1464.5C41892749j292497J1022419K4194568L7750930L9265096K9249281K0146072
1478.7E02228618J3793766R178043M016757j046896k109170L351867J0039627J6479195
1495E55931807K5830209L0795634K6372552J8326640J2544214J0664881Q236289N498945
1511.4F94201171L846884K593756K177000K070427K187431K218723J108885k5749q42035
1529.7G09536493k039313k636970j811266k089202k985001j513183l60846p81357j584650
1548.1F93734705k406239k996326l785312m816889o253124m705906k171457l399968
$$ plain form
1431.8 532693744 532719016 527291417 516358912 502729475 487008691 469915450 451177120 428156435
1448.1 428156435 401482075 373797983 348306477 330948770 332419723 343283117 346687913 341892749
1464.5 341892749 340600252 351622671 375817239 413568169 452833265 482082546 502228618
1478.7 502228618 516022384 525200427 529217184 528170288 526061118 529412985 539452612 555931807
1495 555931807 581762016 612557650 638930202 657256842 669801056 680465937 688702226 694201171
1511.4 694201171 698048055 700641811 702818811 704889238 707076669 709295392 710404277 710378528 709536493
1529.7 709536493 707497180 704860210 703048944 700959742 697974741 696461558 696100712 695319355 693734705
1548.1 693734705 691328466 688332140 684546828 679729939 673476815 668770909 666599452 663199484
1564.4F63199484m787027n310596n222022m527509n777300p924020p488430q173942
1580.7F13988638j0439098r287834m931629l397167o974220j1421025j4023721j4973283
1597E38540661j4898359j4461697j4323294j5151888j7096996j9303978k0419329k0810992
1613.4D02074128k4754881l1233043k9908746l0463428l6991298l6388099k9668942
1627.6A82665691k0742953q828476L027856J7885000K8670743L1447202L3658340L3352435
1643.9C01135838L4483999L1547546J9435883J1095107M056602n821108j4041216k1815270
1660.3C60077381k8953522l1036944k9497712l4846247m1919753l7902802l5039305
1674.5A20881096l1587497k0381562j1646875o569609k520080R27746K555016L696945
$$ plain form
1564.4 663199484 658412457 653101861 647879839 643352330 637575030 629651010 622162580 613988638
1580.7 613988638 603549540 594261706 589330077 585932910 578958690 567537665 553513944 538540661
1597 538540661 523642302 509180605 494857311 479705423 462608427 443304449 422885120 402074128
1613.4 402074128 377319247 346086204 316177458 285714030 248722732 212334633 182665691
1627.6 182665691 161922738 153094262 156122118 174007118 202677861 234125063 267783403 301135838
1643.9 301135838 335619837 367167383 386603266 397698373 401754975 395933867 381892651 360077381
1660.3 360077381 331123859 300086915 270589203 235742956 193823203 155920401 120881096
1674.5 120881096 89293599 68912037 57265162 50695553 48175473 49103219 51658235 55355180
1690.9E5355180M473984O355565Q561582J0440454J3929911J2902192J1281886J0443590
1707.2A33744344Q314714Q667588J3683304K3187876L6969811M2013541L6218524L4590155
1723.5C37389857L4452319L2155126K9778570K7267843K9107810K8087854K0479083
1737.8E38718462J8186092J7741800J5385270J3480663J2057006J2304247J2939572
1752F40813112J1505127R967447R066462Q177936Q443594Q525431P613361P238448
1768.4G11350918P235288Q209229Q490562O972671N806684N648852N581081M958033
1784.7G64253318M151821L008545J979232J944899K279520K142430K545595L926873
1801G86232233N083025N061030M439652L888309L411114K742410J944125J767635K157390
$$ plain form
1690.9 55355180 59829164 66184729 74746311 85186765 99116676 112018868 123300754 133744344
1707.2 133744344 142059058 150726646 164409950 187597826 224567637 266581178 302799702 337389857
1723.5 337389857 371842176 403997302 433775872 461043715 490151525 518239379 538718462
1737.8 538718462 556904554 574646354 590031624 603512287 615569293 627873540 640813112
1752 640813112 652318239 662285686 671352148 679530084 687973678 696499109 704112470 711350918
1768.4 711350918 718586206 726795435 735285997 742258668 748065352 753714204 759295285 764253318
1784.7 764253318 768405139 771413684 773392916 775337815 777617335 779759765 782305360 786232233
1801 786232233 791315258 796376288 800815940 804704249 808115363 810857773 812801898 814569533 816726923
1819.4H16726923K139628J609504J560927J884758K271175K908230K803326K317309
1835.7H34221780K342701K201021J142800M27961J267851K004325J661062R40383L95834
1854H46605718K16127J38342k75612j101792k111792l049076l119349j206935J242519
1872.4H37338150K465426K545119J779914O81519j75416m86076n14388m81844o1393
1890.7H43091011M89891P82728R72986P66456K05577j27793j40905k01821l55125k38657
1911.1H45244348L7193K9803k24769l47615n31733o52075n80489j051843j920462k517581
1931.5H37484777k727270k594114j925110o60599R75311K404750K590119J557291M03225
1949.9H37508380r6082n2452R9301K53439O32644J169622J391589J159609Q69214O97553
$$ plain form
1819.4 816726923 818866551 820476055 822036982 823921740 826192915 829101145 831904471 834221780
1835.7 834221780 836564481 838765502 839908302 840336263 841604114 843608439 845269501 846209884 846605718
1854 846605718 846821845 846960187 846684575 845582783 843470991 840421915 837302566 836095631 837338150
1872.4 837338150 839803576 842348695 844128609 844810128 844634712 844148636 843634248 843152404 843091011
1890.7 843091011 843580902 844363630 845336616 846103072 846308649 846180856 846039951 845838130 845483005 845244348
1911.1 845244348 845281541 845311344 845086575 844738960 844207227 843555152 842974663 841922820 840002358 837484777
1931.5 837484777 834757507 832163393 830238283 829577684 830552995 832957745 835547864 837105155 837508380
1949.9 837508380 837412298 837359846 837459147 837712586 838345230 839514852 840906441 842066050 842935264 843632817
1970.3H43632817N68331M22954Q4579k92003l64542j63019p5340k34604l17156m9472
1990.7H43212545M55379O83785M33445K16007K95520L14891N1618l04282l93867k21253
2011.1H44743788k01761n10276p43866o38127n15044p10606r46343o55711k14458k50816
2031.5H39356780o16610q77440p18176k81215p0155l63171q53061r51410n32567k6226
2051.9H34066749K56180M18783O07252O81102M71711J21772l2782N4181O8545j46687
2072.3H36566806m11451m66466l22998k33113l40820m59969l43978j01030k8551j67369
2092.7H33691061k78295k28226j56343k04384k53618q5592K85149N61773N22852L04878
2113.1H34159255J92106K30014K22147Q7976j9491M2141J62124J23919p3910k09093
$$ plain form
1970.3 843632817 844201148 844624102 844708681 844416678 844052136 843889117 843813777 843579173 843262017 843212545
1990.7 843212545 843667924 844351709 844785154 845001161 845296681 845611572 845663190 845358908 844965041 844743788
2011.1 844743788 844542027 844031751 843287885 842649758 842134714 841424108 840477765 839822054 839607596 839356780
2031.5 839356780 838740170 837862730 837144554 836863339 836793184 836430013 835576952 834625542 834092975 834066749
2051.9 834066749 834322929 834741712 835348964 836030066 836501777 836623549 836590767 836644948 836713493 836566806
2072.3 836566806 836155355 835688889 835365891 835132778 834791958 834331989 833988011 833886981 833858430 833691061
2092.7 833691061 833412766 833184540 833028197 832823813 832570195 832484603 832769752 833331525 833854377 834159255
2113.1 834159255 834351361 834581375 834803522 834891498 834872007 834914148 835076272 835200191 835126281 834917188
2133.5H34917188j49608m2617q4281k32756k97726k20656j57475k75136m84943n42402
2153.9H32429588m16756l17573l57211l80695k10941J8657Q2492P689n5611m6849m4346
2176.3H30708444j68025l85404m88639l84688k59042l19064m76837n11765l85285k70724
2196.7H27058971l15666l84152k51413J5617J10745n0425k23279k13325j35303k32041
2217.1H25379729m81248o00040m62353k92897l20852m51803m65095l46899k77758l75449
2237.5H21305335m78328l48985m7803R2983q3327l16203l20971k05695k58327m34100
2257.9H18904579m48168k20179j79o0260k81096l12090j32680p4029k75194m90368
2278.3H16610336m80234l57092m44710p96199r89437p49826m17531l42846m05252l31580
$$ plain form
2133.5 834917188 834767580 834724963 834640682 834407926 834110200 833889544 833732069 833456933 832971990 832429588
2153.9 832429588 832012832 831695259 831338048 830957353 830746412 830765069 830847561 830855250 830799639 830752790 830708444
2176.3 830708444 830540419 830155015 829666376 829281688 829022646 828703582 828226745 827714980 827329695 827058971
2196.7 827058971 826743305 826359153 826107740 826123357 826234102 826183677 825960398 825747073 825611770 825379729
2217.1 825379729 824898481 824298441 823836088 823543191 823222339 822770536 822305441 821958542 821680784 821305335
2237.5 821305335 820827007 820478022 820430219 820523202 820439875 820123672 819802701 819597006 819338679 818904579
2257.9 818904579 818456411 818236232 818236053 818175793 817894697 817582607 817449927 817375898 817100704 816610336
2278.3 816610336 816130102 815773010 815328300 814532101 813542664 812792838 812375307 812032461 811627209 811295629
2298.7H11295629m0591K15888R5188k44855l95418l28958l47912o21676r56297j060903
2319.1H07610095q85547o92248o37293o05881n11110m10855m10497l73661l9876M07159
2339.5H03450286N84305M44352M19200P03513O37651j729q21709j218558r77039o15835
2359.9H02604437o56903q33094p13229m28140l06011m07219m80234k19107K32220L66926
2380.2G99159646R1970j18613J8775K38538K02060k563m2200J22189K17557L0339k66373
2402.7G99651325k34902J05202K69711Q8990j09196j6153J68741M7863l05832m35889
2423.1G99229860j87277O8604K087k21491k23398j2637L8326k12908n05864n15580
2443.5G97459722l07560k63215n14686p18772n56946k96593l30984n09322m33802o1512
$$ plain form
2298.7 811295629 811255038 811470926 811566114 811321259 810925841 810596883 810248971 809627295 808670998 807610095
2319.1 807610095 806724548 806032300 805395007 804789126 804278016 803867161 803456664 803083003 803043127 803450286
2339.5 803450286 804034591 804478943 804898143 805601656 806239307 806237578 805415869 804197311 803220272 802604437
2359.9 802604437 801947534 801114440 800401211 799973071 799667060 799259841 798779607 798560500 798792720 799159646
2380.2 799159646 799251616 799133003 799151778 799390316 799592376 799589813 799547613 799669802 799887359 799917698 799651325
2402.7 799651325 799416423 799521625 799791336 799880326 799771130 799754977 799923718 799971581 799665749 799229860
2423.1 799229860 799042583 799111187 799113274 798891783 798668385 798655748 798694074 798481166 797975302 797459722
2443.5 797459722 797152162 796888947 796374261 795655489 795098543 794801950 794470966 793961644 793527842 793466330
2463.9G93466330K60293K37167K6345N841J86325J93715j18435l92854l09288p6116
2484.3G93479323q6426k86758l52025j93417l7969j68323m80414n79893l78549k47061
2504.7G90668488m13478o24895n59211l06487k53618m76241o16967m63546k84373l91126
2525.1G86278546o54578o95050m21405j58906j90258l45886k92420n7161L3081j51873
2545.5G83344090k96116j39058R5129P9096j67906l32892k48135j33514k53975m99547
2565.8G81447172n44071l60012k66671m18425n85079n49197l89815l51786n02467n94259
2586.2G76885390m99129m22835n88656q83102r21428o25134l84927m84228o97553o97732
2606.6G70680666n60641n84483p77781q54671o68347m14074m20153o73830q28863p45952
$$ plain form
2463.9 793466330 793726623 793963790 793990135 793995976 794182301 794376016 794257581 793864727 793555439 793479323
2484.3 793479323 793392897 793106139 792754114 792560697 792522728 792354405 791873991 791294098 790915549 790668488
2504.7 790668488 790255010 789630115 789070904 788764417 788510799 788034558 787417591 786954045 786669672 786278546
2525.1 786278546 785623968 784928918 784507513 784348607 784158349 783812463 783520043 783462882 783495963 783344090
2545.5 783344090 783047974 782908916 783004045 783083141 782915235 782582343 782334208 782200694 781946719 781447172
2565.8 781447172 780903101 780543089 780276418 779857993 779272914 778723717 778333902 777982116 777479649 776885390
2586.2 776885390 776386261 775963426 775374770 774491668 773570240 772945106 772560179 772075951 771378398 770680666
2606.6 770680666 770120025 769535542 768757761 767903090 767234743 766820669 766400516 765726686 764897823 764151871
2627G64151871o69241q25047j044631j046896r16541r25481j086176j146733r08792
2645.4G55582333m80712j74224o2227J37090N22018P95483P23899M50372K57552J78099
2665.8G57929683N0544j96933m36902m70817l33488k86639m37737o10828n57780l10779
2686.2G54338324k09272l28958m21464l62218k87652l88622n87404o53207n78344n72026
2706.6G49949157p52806r85146j038730r49204r90093j143992j158416j001954q25405
2724.9G41103411p61926p82371p41303o21617n90324p78854j052201j199603j193523
2743.3G33381689j147509j191855j305758j344443j291156j319170j517713j703739
2759.6G22560346j741588j759410j906395k132356k260745k222418k161503k275586
$$ plain form
2627 764151871 763482630 762657583 761612952 760566056 759649515 758724034 757637858 756491125 755582333
2645.4 755582333 755101621 754927397 754865170 755002260 755524278 756319761 757043660 757494032 757751584 757929683
2665.8 757929683 757980227 757783294 757346392 756875575 756542087 756255448 755817711 755206883 754649103 754338324
2686.2 754338324 754129052 753800094 753378630 753016412 752728760 752340138 751752734 751099527 750521183 749949157
2706.6 749949157 749196351 748211205 747172475 746223271 745233178 744089186 742930770 741928816 741103411
2724.9 741103411 740341485 739559114 738817811 738196194 737605870 736827016 735774815 734575212 733381689
2743.3 733381689 732234180 731042325 729736567 728392124 727100968 725781798 724264085 722560346
2759.6 722560346 720818758 719059348 717152953 715020597 712759852 710537434 708375931 706100345
2775.9G06100345k504111k624333k646029k740860k914905l024817l009021k907693
2792.2F83728576k836407k866506k910853k883076k824009k821743k786160k466917
2808.6F61332905j841485j173318o41346j76429L24666P57873R32336P99537M46141
2826.9F60760880j0610n95033j430989k457022l514767m538536n485833o333172p069349
2845.3F29325569p502795p032036n053640j946568Q69155K191364J901329O09338q53955
2863.6F12507761j638771j238823P5162J368165J845658J471162O39975m60804j738906
2882F12830579k932787l921628m855096n875766o899178p635415p897854p843852p722497
2900.3E57246506p512569o915033n856454m957736n047500o188333p669389q885146
$$ plain form
2775.9 706100345 703596234 700971901 698325872 695585012 692670107 689645290 686636269 683728576
2792.2 683728576 680892169 678025663 675114810 672231734 669407725 666585982 663799822 661332905
2808.6 661332905 659491420 658318102 657676756 657500327 657824993 658582866 659515202 660314739 660760880
2826.9 660760880 660750270 660155237 658724248 656267226 652752459 648213923 642728090 636394918 629325569
2845.3 629325569 621822774 614790738 609737098 607790530 608659685 610851049 612752378 613361716 612507761
2863.6 612507761 610868990 609630167 609705329 611073494 612919152 614390314 615030289 614569485 612830579
2882 612830579 609897792 605976164 601121068 595245302 588346124 580710709 572812855 564969003 557246506
2900.3 557246506 549733937 542818904 536962450 532004714 526957214 520768881 513099492 504214346
2916.6E04214346r517937r239257p856101n493253k470613Q75354L891051N564421
2933D79968011N510837M378587K929807J457900K5153j322746k468437l086031k813309
2951.3D84579772j675695o3360J532107K658368L092706K739906J406223q98779l425777
2969.7D89945471m520178k343505L425836J0278047J4393657J4249027J1374294P857383
2986E44660032N015552L691315M032851N174041N868196N393207M013836K482594J304566
3004.4E81636190R43661J566887K312124K061903O66142j313269l442705n537391p544040
3022.7E71349502r074390q129120k622009M918337Q742869P307768M068434J759172
3039E78320563L81470r16183k524615m220426n448460n811513n288243m429877m147172
$$ plain form
2916.6 504214346 494696409 485457152 477601051 472107798 469637185 470512539 474403590 479968011
2933 479968011 485478848 489857435 492787242 494245142 494270295 492947549 490479112 487393081 484579772
2951.3 484579772 482904077 482840717 484372824 487031192 490123898 492863804 494270027 493371248 489945471
2969.7 489945471 485425293 483081788 486507624 496785671 511179328 525428355 536802649 544660032
2986 544660032 549675584 553366899 557399750 562573791 568441987 573835194 577849030 580331624 581636190
3004.4 581636190 582579851 584146738 586458862 588520765 589186907 587873638 584430933 578893542 571349502
3022.7 571349502 562275112 554145992 551523983 556442320 565185189 572492957 576561391 578320563
3039 578320563 578702033 577785850 575261235 571040809 565592349 559780836 554492593 550062716 545915544
3057.4E45915544m615664n071938m802466l792047k894819k964616l734946m424751
3073.7E13614297m700124m836500n233079n566538n077690l468751j325936r1552n50479
3092.1D82763648j736104k487541k701312k691001k410978j601517m33117M84854Q92937
3110.4D70079869J269758J857549K309590K519012K501577K299637K185493K170265
3126.7D87192750K057970J901060J952171K393753L111660L794074M319549M880130
3143E11603117N540073O161511O710470P137596P313132P354677P456720P435501P104397
3161.4E73817194O511390N710900M712760L502727K156972Q15809m81009j727462k851069
3179.8E92168212l829897m649937n197763n437911n482793n351007m983901m457236
$$ plain form
3057.4 545915544 541299880 536227942 531425476 527633429 524738610 521773994 518039048 513614297
3073.7 513614297 508914173 504077673 498844594 493278056 488200366 484731615 483405679 483314127 482763648
3092.1 482763648 481027544 478540003 475838691 473147690 470736712 469135195 468702078 469186932 470079869
3110.4 470079869 471349627 473207176 475516766 478035778 480537355 482836992 485022485 487192750
3126.7 487192750 489250720 491151780 493103951 495497704 498609364 502403438 506722987 511603117
3143 511603117 517143190 523304701 530015171 537152767 544465899 551820576 559277296 566712797 573817194
3161.4 573817194 580328584 586039484 590752244 594254971 596411943 597227752 596746743 595019281 592168212
3179.8 592168212 588338315 583688378 578490615 573052704 567569911 562218904 557235003 552777767
3196.1E52777767l922581l483534l185213l072441l180265l498435l857076l982127
3212.4E24596095l750563l206610k452612j504541m06503O78658J638532K465546L223598
3230.7E21281600L923476M466355M806876M989683N078614N131722N101204M946708
3247.1E59726238M768431M603446M387081M129529L877401L645778L441214L225863
3263.4E91804981K908349K473772K100348J929999J740157J357079R52780O09577K76029
3281.7F06153071j14560n79179r87648j287163j561403j892686k308369k725124l097415
3300.1E91599524l525853m036367m541993n004943n424499n808771o134212o301224
3316.4E50821662o293714o196559o135046o183386o290316o492854o916284p554025
$$ plain form
3196.1 552777767 548855186 545371652 542186439 539113998 535933733 532435298 528578222 524596095
3212.4 524596095 520845532 517638922 515186310 513681769 513275266 513953924 515592456 518058002 521281600
3230.7 521281600 525205076 529671431 534478307 539467990 544546604 549678326 554779530 559726238
3247.1 559726238 564494669 569098115 573485196 577614725 581492126 585137904 588579118 591804981
3263.4 591804981 594713330 597187102 599287450 601217449 602957606 604314685 605267465 605877042 606153071
3281.7 606153071 606038511 605459332 604471684 603184521 601623118 599730432 597422063 594696939 591599524
3300.1 591599524 588073671 584037304 579495311 574490368 569065869 563257098 557122886 550821662
3316.4 550821662 544527948 538331389 532196343 526012957 519722641 513229787 506313503 498759478
3332.7D98759478q264541q965344r709924j0530680j1283756j1804580j2084604j2023866
3349D14092183j1392981j0017007p757366m509240l57330M385054R141326J3212174
3365.4D06796813J5960336J7021626J6549528J5079528J3397246J2128055J1381418
3379.6E08314550J0907710J0502278J0033131R348810Q497894P797300P266760O510854
3395.9E79179287N511880M670322M223227L906489L400922K862095K494514K281070
3412.3F08529806K200484K091825J801908J613796J669586J639247J442671J301229
3428.6F22290552J303374J360476J374126J415610J448751J353442J217068J093685
3444.9F32857084J061380J163364J132309R46820Q75532Q63910P99298P80046Q22425
$$ plain form
3332.7 498759478 490494937 481529593 471819669 461288989 450005233 438200653 426116049 414092183
3349 414092183 402699202 392682195 384924829 380415589 380058259 384443313 393584639 406796813
3365.4 406796813 422757149 439778775 456328303 471407831 484805077 496933132 508314550
3379.6 508314550 519222260 529724538 539757669 549106479 557604373 565401673 572668433 579179287
3395.9 579179287 584691167 589361489 593584716 597491205 600892127 603754222 606248736 608529806
3412.3 608529806 610730290 612822115 614624023 616237819 617907405 619546652 620989323 622290552
3428.6 622290552 623593926 624954402 626328528 627744138 629192889 630546331 631763399 632857084
3444.9 632857084 633918464 635081828 636214137 637160957 638036489 638900399 639699697 640479743 641302168
3463.2F41302168Q51810Q96335R24110Q34704P66516Q17358Q76844Q32558P40528P73489
3483.6F49616420Q63731Q78096R18686R87947R90451R98139R99451R05454Q36313R58263
3504F58952951J075924J026094J060068J236976J272916J124204R93073R61065J018643
3522.4F68721914J058698J023948J099825J300335J359105J287997J213074J146137
3538.7F78211033J164079J160443J040637J041472J222492J290023J321673J394570
3555F87846422J295924J189053J218439J011908N85854J003086K195359K437055J854539
3573.4G00637639J511454J542688J717031J827001J537025R49562J127898K169013
3589.7G13019311K268374J640380J616001J979589K036810J961768J688302J048326
$$ plain form
3463.2 641302168 642153978 643050313 643974423 644809127 645575643 646393001 647269845 648102403 648842931 649616420
3483.6 649616420 650480151 651358247 652276933 653264880 654255331 655253470 656252921 657158375 657994688 658952951
3504 658952951 660028875 661054969 662115037 663352013 664624929 665749133 666742206 667703271 668721914
3522.4 668721914 669780612 670804560 671904385 673204720 674563825 675851822 677064896 678211033
3538.7 678211033 679375112 680535555 681576192 682617664 683840156 685130179 686451852 687846422
3555 687846422 689142346 690331399 691549838 692561746 693147600 694150686 696346045 698783100 700637639
3573.4 700637639 702149093 703691781 705408812 707235813 708772838 709722400 710850298 713019311
3589.7 713019311 715287685 716928065 718544066 720523655 722560465 724522233 726210535 727258861
3606G27258861Q69751J340091J477540J387119J235724J090705J655519K015889J284182
3624.4G39615381J24156q8453J551568K306581J709819J237631Q87096N34832K03908
3642.7G48082519m03405j193583p82787J342356K202391J384318J152635J514077J002014
3661.1G54300535K78651m4763o73175j273334n83946k10822m53114P77185J524210
3679.4G53641427J066982O08385r239q26120p60317N43177J245678Q08358L3438n38528
3699.8G55813241m43578K41995J82092p71999j356423m73320R01281Q44658m8042n57243
3720.2G54332662m22299j46032N4419R9004n17845j382828j246691J12176J072943
3738.6G51955509M07279j233220j644850k46942l15845o74367Q12352J436531N64993
$$ plain form
3606 727258861 728128612 729468703 730946243 732333362 733569086 734659791 736315310 738331199 739615381
3624.4 739615381 739739537 739651084 741202652 743509233 745219052 746456683 747343779 747878611 748082519
3642.7 748082519 747679114 746485531 745702744 747045100 749247491 750631809 751784444 753298521 754300535
3661.1 754300535 754579186 754534423 753861248 752587914 752003968 751793146 751340032 752117217 753641427
3679.4 753641427 754708409 755316794 755307555 754481435 753721118 754264295 755509973 756318331 756351769 755813241
3699.8 755813241 755369663 755611658 755793750 755021751 753665328 753192008 754093289 754937947 754889905 754332662
3720.2 754332662 753910363 753764331 753818750 753917754 753399909 752017081 750770390 750882566 751955509
3738.6 751955509 752362788 751129568 749484718 749237776 748921931 748247564 749059916 750496447 751061440
3756.9G51061440L5226L89993L87609j69098l99053k48731K27094M81665P1109m20452
3777.3G51416802m41968j10447j16766k06113L5107J19925j12414n59569r36270q65101
3797.7G48223186j001180p65204L76880L48449J02877N75662K40445q42511j279176
3816.1G45979428p68780p12216o9738R05812N41687l0756l75867o21974o91951j086473
3836.5G43069172j084268M172P21216P07329L88086l77715j713276k572358l30507
3854.8G38811851J842439J165986j81318q55267m79459j46926m92275j97053M27664
3873.2G39895642N58972K87175n07414n75542j12653j02103J99080M1127l75569J37091
3893.6G39445806K37226p19309j356065r99332j09314Q37862J029551M20809j67847
$$ plain form
3756.9 751061440 751096666 751486659 751874268 751705170 751306117 751057386 751284480 751766145 751837254 751416802
3777.3 751416802 750974834 750864387 750747621 750541508 750576615 750696540 750584126 750024557 749088287 748223186
3797.7 748223186 747222006 746456802 746833682 747182131 747285008 747860670 748101115 747258604 745979428
3816.1 745979428 745210648 744498432 744428694 745334506 745876193 745845437 745469570 744847596 744155645 743069172
3836.5 743069172 741984904 741989076 742710292 743417621 743805707 743427992 741714716 739142358 738811851
3854.8 738811851 740654290 741820276 741638958 740783691 740304232 740157306 739665031 739467978 739895642
3873.2 739895642 740454614 740741789 740234375 739658833 739546180 739444077 739643157 739684284 739308715 739445806
3893.6 739445806 739683032 738963723 737607658 736608326 736499012 737336874 738366425 738787234 738619387
3912G38619387n18560p16388m99726r4592n8234j81615n8294r5963m42386l72350J00076
3934.4G35681355J69754j40548m08113l90470j07109o8128j95325m3988J11878j9074
3954.8G34590232k22981k68280j88708j20819j47164k68578l71814l14594k26914k58148
3975.2G32202232k77698k29001j54257j06692k27511l97921l64065k25604j75297k19226
3995.6G29824960k36153
3997.6G29588807
$$ plain form
3912 738619387 738100827 737384439 736884713 736790121 736731887 736550272 736491978 736396015 735953629 735581279 735681355
3934.4 735681355 735851109 735710561 735302448 734911978 734804869 734736741 734541416 734497428 734609306 734590232
3954.8 734590232 734367251 734098971 733910263 733789444 733642280 733373702 733001888 732687294 732460380 732202232
3975.2 732202232 731924534 731695533 731541276 731434584 731207073 730809152 730445087 730219483 730044186 729824960
3995.6 729824960 729588807
3997.6 729588807
##END=$$ End of the data block
