##TITLE=FA130 $$ Begin of the data block
##JCAMP-DX=5.00 $$ ACD/SpecManager v 10.08
##SPECTROMETER/DATA SYSTEM=Alpha
##DATE=20 Feb 2015 09:12:38
##DATA TYPE=INFRARED SPECTRUM
##DATA CLASS=XYDATA
##ORIGIN=
##OWNER=
##NPOINTS=1765
##FIRSTX=399.76428223
##LASTX=3997.64306641
##MAXX=3997.64306641
##MINX=399.76428223
##MAXY=0.85046238
##MINY=0.04927909
##XFACTOR=1.0000000000
##YFACTOR=1.000000000000000e-9
##FIRSTY=0.73260659
##DELTAX=2.03961372
##XUNITS=1/CM
##YUNITS=ARBITRARY UNITS
##XYDATA=(X++(Y..Y))
399.8G32606590J0050356K623856l064394l364444N14865K208352k031385p797540
416.1G31746256r908557o630122n085588j0784805j7790496j8129587r048760N203783
432.4F59572124J4889002J4885187R787024P002234O201565K487660l423989o257892
448.7G05142915m233539j108587j913726p176876j0987878r420752p201732o908774
465F56191051p722914r559989j1149287q243204l28600R473205J8634855K1120191
481.3F68415308J5599132Q256912M564345L710031K067864p48575m898607j1882603
497.7F85083807j8654109k0747900j9685447k0562649j7860889l03805K3839533L5080374
514F46188915L0282140J9129812Q041501P01070p69555K107679M620433L629089R27031
$$ y = [732606590, 742656946, 745280802, 742216408, 738851964, 739366829, 741575181, 739543796, 731746256, 721837699, 715207577, 710121989, 699337184, 681546688, 663417101, 654368341, 659572124, 674461126, 689346313, 699133337, 706135571, 712337136, 714824796, 711400807, 705142915, 700909376, 699800789, 697887063, 690710187, 679722309, 670301557, 663099825, 656191051, 648468137, 638908148, 627758861, 619515657, 619187057, 628660262, 647295117, 668415308, 684014440, 692271352, 696835697, 700545728, 702613592, 701865017, 696966410, 685083807, 666429698, 645681798, 625996351, 605433702, 587572813, 587269008, 611108541, 646188915, 676471055, 695600867, 703642368, 704343438, 703573883, 705681562, 710301995, 713931084, 714858115]
532.3G14858115j07467J581549L156245J755953j656831l668963k511681k72154m22955
550.7G12711811l517389o412804o538630n277157n982339r908438j5066922j7175376
567F42832756j2907863j337647J3736784K2000313J8292308J0281503N292893J929939
583.3G00120986j810015m517615m740297l913999m517615p430613j1561155j5501559
599.6F46128118k0279288k7919650l2418847k2577584j0025084j8138886l1381666
613.9D83387113j1585147K9180319L4155964M65155r178638L1771183O4660608M2212606
630.2F65069163N84960j1056066N629778J3739169M270375m44353J154661n11944m157007
648.6F74278736p165432q778155q469462q209705j1338532j4674664p659733Q074820
$$ y = [714858115, 714750648, 716332197, 719488442, 721244395, 719587564, 715918601, 713406920, 713134766, 712711811, 709194422, 702781618, 696242988, 690965831, 684983492, 675075054, 660008132, 642832756, 629924893, 628587246, 642324030, 664324343, 682616651, 692898154, 698191047, 700120986, 698310971, 693793356, 689053059, 685139060, 680621445, 673190832, 661629677, 646128118, 625848830, 597929180, 565510333, 542932749, 532907665, 514768779, 483387113, 471801966, 500982285, 535138249, 535603404, 526424766, 558195949, 622856557, 665069163, 665654123, 654598057, 660227835, 673967004, 678237379, 677793026, 678947687, 678435743, 674278736, 667113304, 658335149, 649865687, 641655982, 630317450, 615642786, 607983053, 616057873]
664.9F16057873K2332906K5742353J1954784L021896J192o89209j00076n55515k825201
683.3F74941003n310774o235957n992174o519437q572876r697318o420016n62907J715482
701.6F27345026j549781p539749j3601840j8728613k0582080q538962J7494500L0729592
717.9F05028093K0894468P833242J677156k146840n853355p908941o508887k045452
734.3F10969484J542210J062453j250028k096773k033114l569901p960379j5325368
750.6E81338584k4156808k7825177k0315468q897722m356534n974084r069681j3464123
766.9D67278987j9264072k0990640j5615493j2432009j9360304l1533271m0182829
781.2C07900369l8586229k3065239K132684J4725208J0640532K6530892N5722504N2403540
$$ y = [616057873, 638390779, 664133132, 676087916, 679109812, 679111004, 678421795, 678321719, 677766204, 674941003, 669630229, 663394272, 657402098, 650882661, 642309785, 632612467, 626192451, 625629544, 627345026, 625795245, 618255496, 604653656, 585925043, 565342963, 556804001, 574298501, 605028093, 625922561, 633755803, 635432959, 633286119, 627432764, 619523823, 613014936, 610969484, 612511694, 613574147, 612324119, 610227346, 608194232, 604624331, 596663952, 581338584, 557181776, 529356599, 509041131, 500143409, 495786875, 489812791, 480743110, 467278987, 448014915, 427024275, 411408782, 398976773, 379616469, 348083198, 307900369, 269314140, 246248901, 248381585, 263106793, 273747325, 300278217, 356000721, 408404261]
797.5D08404261K5796026P288933m011602j6355931j9435168N77212K6921838L1122297
813.8D60307866J5668691k388508j8764972k4840206j197934L8918018N2519292L3898353
830.1E54120600J3233245J0144412K0848215K6969135K0240783R289861N90801m778146
846.4F50658906j666308Q666933J3100206Q427561L153264q69453n553364r076119
862.8F66841626j1113405j4868379k2021174l0548632l6251307l2940268k3277819
877D95820642k5159836m6253175p1787357q5358113p5398118l2922104L4638733R7427592
893.4B91008264J26021445J17561668Q9778125N9182763L4153283J8172741J1154651
907.6G47032940R271086P404804L575623J21713m96269O35922K86818k865136o128490
$$ y = [408404261, 434200287, 441489220, 437477618, 421121687, 401686519, 402263731, 429185569, 460307866, 475976557, 473588049, 454823077, 429982871, 428784937, 467702955, 520222247, 554120600, 567353845, 577498257, 598346472, 625315607, 645556390, 654846251, 655437052, 650658906, 648992598, 657659531, 670759737, 679187298, 682340562, 681471109, 675917745, 666841626, 655728221, 640859842, 618838668, 588290036, 552038729, 519098461, 495820642, 470660806, 424407631, 352620274, 267262161, 191864043, 158941939, 193580672, 291008264, 417029709, 534591377, 624369502, 683552265, 717705548, 735878289, 747032940, 756304026, 763708830, 767284453, 767406166, 766909897, 767545819, 767832637, 764967501, 758839011]
926G58839011o040335l368318j969337l770113p353425r963691j1076689j2835682
942.3G02461421j5742480j8408537j7965794p413447J1710525K1217346J1781991m464806
958.6F83176219j3765990j0440588L504574J6041040J6725004R667218L757775R4890
974.9G08760142l086924l256262k73704Q92103o66321k907335n801082q384586q850812
993.3F76425219p834495p970333j1122584j5881419j7252982j2472808l994405M282712
1009.6F04178905P188738N582511P530332J0743737Q087933K363265j840353l549099
1025.9F40285969l679157m568457p406831j0354698j0066926n601049m53174Q90196
1042.2E99045873j898945n547940p716299r061098j1430978j5244365j9171655k2034824
$$ y = [758839011, 752798676, 749430358, 747461021, 743690908, 736337483, 726373792, 715297103, 702461421, 686718941, 668310404, 650344610, 642931163, 654641688, 675859034, 687641025, 683176219, 669410229, 658969641, 662474215, 678515255, 695240259, 704907477, 708665252, 708760142, 705673218, 702416956, 702143252, 703035355, 702369034, 699461699, 693660617, 685276031, 676425219, 668590724, 660620391, 649497807, 633616388, 616363406, 603890598, 599896193, 604178905, 611367643, 616950154, 624480486, 635224223, 643312156, 645675421, 643835068, 640285969, 636606812, 632038355, 624631524, 614276826, 604209900, 598608851, 598155677, 599045873, 597146928, 591598988, 583882689, 574821591, 563390613, 548146248, 528974593, 506939769]
1058.6E06939769k4280489k6929795k8775156k6371002k0819396k0002156k6230664
1072.8C33531111k9366999j9639939k624482M880130n120069k4187922l8682491l8956985
1089.2A79832354k1616801R681150M3982193O7846507P5364947P0142120N7789356
1103.4D83021826M1119366K1154345K109944n937338p55071K697468o563187k0808697
1119.8E16038656k3183882q023649N262553R79305r680063j3353437j1439741r552449
1136.1D47047293n320012M606425J2748152J1090368K718151m550546o530434n238235
1152.4D56571162p458806j6460359k8480769l9540380m8561841n4263622n5820003
1166.7B05985382m9970925k2453874L2166734Q4759206R9105954P1515322K5647670
$$ y = [506939769, 482659280, 455729485, 426954329, 400583327, 379763931, 359761775, 333531111, 304164112, 284524173, 281899691, 286779821, 281659752, 257471830, 218789339, 179832354, 158215553, 167896703, 211878896, 279725403, 355090350, 425232470, 483021826, 524141192, 545295537, 547405481, 541468143, 540713072, 543410540, 536847353, 516038656, 492854774, 484831125, 490093678, 491072983, 481392920, 468039483, 456599742, 447047293, 441727281, 446333706, 459081858, 470172226, 472890377, 468339831, 461809397, 456571162, 449112356, 432651997, 404171228, 364630848, 316069007, 261805385, 205985382, 156014457, 133560583, 165727317, 250486523, 349592477, 421107799, 446755469]
1180.9D46755469j1186272k0368546l263682J4330864J2806773Q49157j3609558l5260320
1197.3C91053885n9012264o7552417m5240388J285285L5621479L2459438O366044j8256604
1213.6B76724458k8953880k6790440k6445792l2687634l3419966k3820915j0355823
1227.9I4250008K508089J5616335K9644438M2062476N0338715N3950161N3621352N1361709
1244.2C93353283M8749805M5624107M1200370L4900009K6461780J6485393O419599
1258.4F13194346l272593j3319611k3521483l2587588m0549338m8807859n2588314
1272.7C98547560l5967082O919891M8207849N5888832L5027921R348571j0380983k4226099
1289D83366460l3707649l9557069m2187244m2466730l9173275k7379006m279882K5160253
$$ y = [446755469, 435569197, 415200651, 411936969, 426267833, 439074606, 439923763, 426314205, 391053885, 332041621, 264489204, 219248816, 220534101, 256155580, 288615018, 294981062, 276724458, 247770578, 220980138, 194534346, 161846712, 128426746, 104605831, 94250008, 96758097, 112374432, 142018870, 184081346, 234420061, 288370222, 341991574, 393353283, 442103088, 487727195, 528927565, 563827574, 590289354, 606774747, 613194346, 609921753, 596602142, 573080659, 540493071, 499943733, 451135874, 398547560, 362580478, 369500369, 417708218, 473597050, 508624971, 517973542, 507592559, 483366460, 449658811, 410101742, 367914498, 325447768, 286274493, 258895487, 254615605, 279775858]
1305.4B79775858M9874127N8160424M9261332L3619284J8603385O840497K051860O267071
1321.7E04453838J1708677N659401j3050854k8869599k0912737J1415392L7626297
1336E08030415L5473048J7434001L666044k315820n262375p981836j1671663j6573369
1352.3E20798445k2196114k8008908l5258443m7052264n3469836k6722342K4349600
1366.6C32440138O0952186O8479538N7422817L9064527J8081367R1970j3708353j8393994
1382.9E44430196q980274N598307J0269403L776312n757213j5454649k3605407l1728804
1399.2D78547871l5691351k8038203j0616750P888109J5202582O341666r840101j5462488
1415.5D08331335p341206K723693Q91030m298448K923637J5737832J7283171O460130
$$ y = [279775858, 329649985, 387810409, 437071741, 470691025, 489294410, 496134907, 498186767, 504453838, 516162515, 521821916, 508771062, 479901463, 458988726, 470404118, 508030415, 543503463, 560937464, 564603508, 562287688, 557025313, 549043477, 537371814, 520798445, 498602331, 470593423, 435334980, 388282716, 334812880, 308090538, 332440138, 393392324, 461871862, 519294679, 558359206, 576440573, 576532543, 562824190, 544430196, 535449922, 541048229, 551317632, 555093944, 549336731, 533882082, 510276675, 478547871, 442856520, 414818317, 404201567, 412089676, 427292258, 433633924, 423793823, 408331335, 400990129, 403713822, 404604852, 400306404, 403230041, 418967873, 436251044, 442711174]
1431.8D42711174n238503j5358686k3321629k4538368k1828115j1255413M285038J1474311
1448.1C56929809O285220j671016p623643j5677213j5077681L349811J5627921J5540719
1464.5C57683927R874135P937789J0288537J3448089J2833565J0033906J0041267J3505786
1480.8D45647001J9013912K3648321K6843757K8638601K6135147J8083513R909391
1495E97919643L314555l298879q565545j0772407j1477411j3844728j6939402k3764372
1511.4E12571454l3983618m5469701n4217726n2663118m5579106k4504423N213082
1525.6B61366844L2996625N3082079O6077649P3345423N6913316L5534561K7540624
1539.9F06857121J8342555P957637K268672k251387p418632j3537824k1047354k8353214
$$ y = [442711174, 437472671, 422113985, 398792356, 374253988, 352425873, 341170460, 345455498, 356929809, 363215029, 361544013, 353920370, 338243157, 323165476, 326515287, 342143208, 357683927, 367558062, 375495851, 385784388, 399232477, 412066042, 422099948, 432141215, 445647001, 464660913, 488309234, 515152991, 543791592, 569926739, 588010252, 597919643, 601234198, 597935319, 589369774, 578597367, 567119956, 553275228, 536335826, 512571454, 478587836, 433118135, 378900409, 326237291, 280658185, 256153762, 261366844, 294363469, 347445548, 413523197, 486868620, 543781936, 579316497, 606857121, 625199676, 633157313, 635425985, 633174598, 625755966, 612218142, 591170788, 562817574]
1556.2E62817574l2597661j1120141J6104162J8480956J0109663j498997r554565p351935
1572.6E45389056L117740J5060783J4230251M658103k917468p941902j1412680j4550567
1588.9E45633316j8396556k2834778k8137326l5353095m5231610n1016391m0125489
1603.2C04538071j7938107q433402j7214924k5877580k0540327j242175K1436810K0989001
1619.5B55717367J112372k2249490l5264567l2236665j7405287L899098K5319472M7831997
1635.8B26724297N0126105L6424071K7192056J8705726J0907441L851742j921118j0392576
1652.1C61617744k0527512j8110841j7435909k2155225k8424352l0171901k3270056
1666.4B01521948j1711761K566814O624296n049020k1378949k9921532l2023631l0644178
$$ y = [562817574, 530219913, 519099772, 535203934, 553684890, 563794553, 562295556, 552740991, 545389056, 548506796, 563567579, 577797830, 582455933, 579538465, 571596563, 560183883, 545633316, 527236760, 504401982, 476264656, 440911561, 395679951, 344663560, 304538071, 286599964, 278166562, 260951638, 235074058, 214533731, 213291556, 234728366, 255717367, 256829739, 234580249, 199315682, 167079017, 149673730, 153572828, 178892300, 226724297, 276850402, 313274473, 340466529, 359172255, 370079696, 373931438, 372010320, 361617744, 341090232, 322979391, 305543482, 283388257, 254963905, 224792004, 201521948, 189810187, 192377001, 199001297, 193952277, 172573328, 142651796, 110628165, 79983987]
1682.7G9983987k3713335o991562P696167J8485162K4356410K7868345K6013688J6326338
1699A70025200P235527l462360j6574591k8237090k9542744k1885328r277142N724281
1715.3G4005753K5923438M3012060N0149233N9198454O5273344O2592298N6149393
1729.6D36303973M7815442M5682073M0785015K9009282K5188506K3388386J9611775
1743.9F67784452J7483592J6087652J5396893J4022708J0911166Q769811P832169O456912
1760.2G64745355N374908M754424L990948L442645K103568k5809j426041j534701J23740
1778.6G81549037M106998Q157253R827793R182870P074833N418837M866421L792644
1794.9H33976686K006769J195669J917541K677024J961946N01156j35422M53592J068055
$$ y = [79983987, 56270652, 49279090, 56975257, 75460419, 99816829, 127685174, 153698862, 170025200, 177260727, 173798367, 157223776, 128986686, 99443942, 77558614, 68281472, 74005753, 99929191, 142941251, 193090484, 252288938, 317562282, 380154580, 436303973, 484119415, 529801488, 570586503, 599595785, 624784291, 648172677, 667784452, 685268044, 701355696, 716752589, 730775297, 741686463, 750456274, 758288443, 764745355, 770120263, 774874687, 778865635, 782308280, 784411848, 784386039, 782959998, 781425297, 781549037, 785656035, 793813288, 803641081, 812823951, 819898784, 825317621, 830184042, 833976686, 835983455, 837179124, 839096665, 841773689, 843735635, 844236791, 844101369, 844554961, 845623016]
1813.2H45623016K64168j346052k117276j295089O30676K357304K033711O71387Q89003
1831.6H47710848J595557J155972l3677j231133j974285j629889k84732k92778j714289
1850H43301594k247452j004518L55125j30951k244890m425645n867303o207525l498614
1868.3H18029821K342284N448103M355847K687753J659691M18901j148343j889765
1884.6H31904292r34720Q84831J663029M42744j167059j319170n38111l43740j105189
1903H29486907k128542k421498j502753O5327P78675p9810j336039j488566j259684
1921.3H20114017j867354l039062m179538m312813k785563q6070K546311L680646L110588
1939.7H13181162K222955J868367J250923O4552q02994p64549K384R90868J485825
$$ y = [845623016, 845887184, 844541132, 842423856, 841128767, 841759443, 844116747, 846150458, 846821845, 847710848, 849306405, 850462377, 850428700, 849197567, 847223282, 845593393, 845308661, 845015883, 843301594, 841054142, 840049624, 840404749, 840273798, 838028908, 833603263, 827735960, 821528435, 818029821, 820372105, 825820208, 830176055, 832863808, 834523499, 834942400, 833794057, 831904292, 830969572, 831854403, 833517432, 833960176, 832793117, 831473947, 830935836, 830592096, 829486907, 827358365, 824936867, 823434114, 823499441, 824278116, 824198306, 822862267, 821373701, 820114017, 818246663, 815207601, 811028063, 806715250, 803929687, 803843617, 806389928, 810070574, 813181162, 815404117, 817272484, 818523407, 818587959, 817784965, 817020416, 817022800, 818013668, 819499493]
1958.1H19499493J229345Q36730P82013P86603M28080k68340n90086n5015O27101M95553
1978.5H23771477m12584j199901j191735o28769m08352r80854j619458j499176q06451
1996.8H15024197j60158j22308o99699j133085q46743n9724L44455k05219j083672
2015.2H11058044j172185l84211K08378j53184r91643j170396m15862M40478M57168
2033.5H07876587m18425j238465j179814m31002L8624l86953j196265j486123j094460
2051.9H00483704o95467r25720j484275j410604l65376P92801J013995J91867q05318
2070.2G96795607j023770m58419o914l38137j112044j461804j015961l81351m10139
2088.6G90587068j034737j279950m53770R05633J591920J175106L78966J38641O40869
$$ y = [819499493, 820728838, 821565568, 822347581, 823134184, 823562264, 823293924, 822703838, 822648823, 823275924, 823771477, 823358893, 822158992, 820967257, 820338488, 819930136, 818949282, 817329824, 815830648, 815024197, 814864039, 814741731, 814042032, 812908947, 812062204, 812002480, 812346935, 812141716, 811058044, 809885859, 809501648, 809710026, 809556842, 808565199, 807394803, 806978941, 807419419, 807876587, 807458162, 806219697, 805039883, 804608881, 804647505, 804260552, 803064287, 801578164, 800483704, 799788237, 798862517, 797378242, 795967638, 795602262, 796395063, 797409058, 797600925, 796795607, 795771837, 795313418, 795306504, 794968367, 793856323, 792394519, 791378558, 790997207, 790587068, 789552331, 788272381, 787818611, 788724244, 790316164, 791491270, 791870236, 792008877, 792649746]
2106.9G92649746J106620P53045j55568o51181k36273N25356O56723o9797q56936q84711
2127.3G92837024k78116J01448k52665q62836q81255j91033M09186J71483p19667j324832
2147.7G89008737j056433l48806j07706o05822j146137r28939l3498O37114L95656
2166.1G85814166l91841p15494k28226L80635L57986k77281p92206n45442J93835N14924
2186.5G84311056J2756p22826q44955k49207L12805J50561n41151r49800o41047j05858
2206.9G80732334j02878p24196j329720j258910n90325n5789j71781o63579q47518
2225.2G74987638n03957r4354j95444q13365j283884j029253k75850J52766j34229
2243.6G70810068o36220p00534k93374L0637j84298o68168p23898j62005M67181N04791
$$ y = [792649746, 793756366, 794509411, 794353843, 793702662, 793466389, 793991745, 794648468, 794578671, 793721735, 792837024, 792558908, 792660356, 792407691, 791544855, 790663600, 790472567, 790881753, 791053236, 790333569, 789008737, 787952304, 787603498, 787495792, 786889970, 785743833, 784814894, 784781396, 785418510, 785814166, 785422325, 784706831, 784478605, 784859240, 785217226, 784939945, 784147739, 783602297, 783796132, 784311056, 784323812, 783600986, 782756031, 782506824, 782819629, 782970190, 782429039, 781479239, 780838192, 780732334, 780629456, 779905260, 778575540, 777316630, 776726305, 776670516, 776498735, 775835156, 774987638, 774483681, 774389327, 774193883, 773380518, 772096634, 771067381, 770791531, 770944297, 770810068, 770173848, 769473314, 769179940, 769210577, 769026279, 768358111, 767634213, 767472208, 767939389, 768444180]
2264G68444180p9095o38127o32167k35379o1214m41491j031757j179635p40946k96533
2284.4G63107836m57704j074254j448691j144409l48807K98500L22938j8120m6610
2302.7G59190679L31461N08249Q8155n79655q62539o05643l09288m07517n65112l51250
2323.1G56437540R2149M50730M22836j29939p48396q03768l23236L2127j51992o46174
2343.5G54631877p78675o9738N50211K52724p62523j614689j764596j453042j168907
2361.9G47822642j318156j830042k160132j878321j192570n71310q8334L75569P70628
2380.2G39929974R39846P68304L69906J11163K50042O04808P24435M06742j23322m58479
2400.6G43523419l86715j20699J072q5234j97828j63794k7120m3153l26992o34431
$$ y = [768444180, 768365085, 767726958, 767094791, 766859412, 766798198, 766356707, 765324950, 764145315, 763404369, 763107836, 762650132, 761575878, 760127187, 758982778, 758633971, 758932471, 759255409, 759237289, 759190679, 759522140, 760030389, 760118544, 759538889, 758676350, 758070707, 757761419, 757353902, 756788790, 756437540, 756529689, 756980419, 757403255, 757273316, 756524920, 755721152, 755397916, 755430043, 755278051, 754631877, 753853202, 753783464, 754333675, 754586399, 753823876, 752209187, 750444591, 748991549, 747822642, 746504486, 744674444, 742514312, 740635991, 739443421, 738872111, 738783777, 739159346, 739929974, 740869820, 741638124, 742008030, 742119193, 742369235, 742974043, 743698478, 744105220, 743981898, 743523419, 743136704, 743016005, 743017077, 742931843, 742734015, 742570221, 742543101, 742499948, 742172956, 741538525]
2421G41538525o38247l25203l9220p6413l59475n71192n33759m01736m15742o14584
2441.4G37562954q02695p61867n39303l69847m05490n99086p01487n23687k34782j64092
2461.8G32460618l58343n11229l65436l2783K05398K14696P8737p987N7340J08957
2482.2G31849968r7513m81844o95228n63145k87950j83344l31163n48005o40393n84364
2502.6G27437019n13553o36697r28700j118004j125753j109481j201451j377404j350343
2521G18075633q49426j19388L21806L23772J23143m0173j02163j77502l88384o45518
2541.4G16521800p64668o92010n32091m85718o39975q53420r61899q87990o43671l83496
2561.8G09676862k75910l10362l67403m11808m67658n48124o10233n53787l98457l33607
$$ y = [741538525, 740900278, 740575075, 740535855, 740459442, 740099967, 739528775, 738995016, 738593280, 738177538, 737562954, 736760259, 735998392, 735459089, 735089242, 734683752, 734084666, 733383179, 732859492, 732624710, 732460618, 732102275, 731591046, 731225610, 731192827, 731398225, 731612921, 731691658, 731683671, 731741011, 731849968, 731752455, 731270611, 730575383, 730012238, 729724288, 729540944, 729209781, 728661776, 728021383, 727437019, 726923466, 726286769, 725358069, 724240065, 723114312, 722004831, 720803380, 719425976, 718075633, 717226207, 717106819, 717428625, 717752397, 717875540, 717835367, 717733204, 717555702, 717167318, 716521800, 715757132, 715065122, 714533031, 714047313, 713407338, 712553918, 711592019, 710704029, 710060358, 709676862, 709400952, 709090590, 708723187, 708311379, 707843721, 707295597, 706685364, 706131577, 705733120, 705399513]
2582.2G05399513m83334p28786q46267p51555n71906m91619n42641o27518o46233n82636
2602.6F99127018n44726o35028p76589q05795o68824m59433k71618j61231j65105k18510
2623F94420159k74360l75569n44131o84261o83844n78881m88460m90784n15283m22120
2643.4F89362466k20000o4195m8935j05679j35541j14143q1420j19686k80738n13494
2663.7F87678635o77585o75738n71668m83513m60923m60386l87311k91646l38673m96686
2684.1F82834506o29783p08997p26163p20799q25882j074791j293302j355886j377762
2702.5F74121141j426160j379609j225412j128077j135528j170278j187384j116514
2718.8F64352179r64523q93175j003564j208067j338064j318098j226186j166463j135588
$$ y = [705399513, 704916179, 704187393, 703341126, 702589571, 702017665, 701526046, 700983405, 700355887, 699709654, 699127018, 698582292, 697947264, 697170675, 696364880, 695696056, 695236623, 694965005, 694803774, 694638669, 694420159, 694145799, 693770230, 693226099, 692541838, 691857994, 691279113, 690790653, 690299869, 689784586, 689362466, 689142466, 689078271, 689029336, 688923657, 688788116, 688673973, 688592553, 688472867, 688192129, 687678635, 687001050, 686325312, 685753644, 685270131, 684809208, 684348822, 683961511, 683669865, 683331192, 682834506, 682204723, 681495726, 680769563, 680048764, 679222882, 678148091, 676854789, 675498903, 674121141, 672694981, 671315372, 670089960, 668961883, 667826355, 666656077, 665468693, 664352179, 663387656, 662494481, 661490917, 660282850, 658944786, 657626688, 656400502, 655234039, 654098451]
2737.2F54098451j172006j333058j526236j700044j936436k295732k730191l075779
2753.5F38328969l224909l289282l372610l439426l457844l413916l247798k917051
2769.8F11966133k564371k458751k757191l343285l980517m554450n093754n635738
2786.1E81578076o080270o317794o301701n965710n337715m696429m308939m032135
2802.4E38537383l450692k283215o34670J168906K850831M092216M659772M581809
2818.8E49522340L999234L183007K362609J509189N99087k71023j048982j802385k590298
2837.1E55462778l371299m078090m632532m998625n234957n343318n165457m495204
2853.4E18143296l359198k261341j820981k219618l103852l801823l823846l463865
$$ y = [654098451, 652926445, 651593387, 650067151, 648367107, 646430671, 644134939, 641404748, 638328969, 635104060, 631814778, 628442168, 625002742, 621544898, 618130982, 614883184, 611966133, 609401762, 606943011, 604185820, 600842535, 596862018, 592307568, 587213814, 581578076, 575497806, 569180012, 562878311, 556912601, 551574886, 546878457, 542569518, 538537383, 535086691, 532803476, 532168806, 533337712, 536188543, 540280759, 544940531, 549522340, 553521574, 556704581, 559067190, 560576379, 561175466, 560904443, 559855461, 558053076, 555462778, 552091479, 548013389, 543380857, 538382232, 533147275, 527803957, 522638500, 518143296, 514784098, 512522757, 510701776, 508482158, 505378306, 501576483, 497752637, 494288772]
2869.7D94288772l536701m260570n104810n614519n775064n749047n518019n000561
2886.1D53729481m303307l611743l041685k683401k570272k716779l077239l406674
2902.4D28318381l517210l450871l319114l194302l077150k886057k501189j881958
2918.7D04490530j054555j52021M40955M26382o1065n77540m14311R68784K903104
2937D06970263L682374K482236K10255j373619o50256K090990M101485L338337Q60810
2955.4D21712875m93466J415133N341560P105320M791051N22167l281444n693585o493837
2973.8D24925774o307870n513429j955837N725383J3043613J4449775J0425120M781664
2990.1D59574193k45095k710551K00659P571489J3483495J3997495J0785669P134080
$$ y = [494288772, 490752071, 486491501, 481386691, 475772172, 469997108, 464248061, 458730042, 453729481, 449426174, 445814431, 442772746, 440089345, 437519073, 434802294, 431725055, 428318381, 424801171, 421350300, 418031186, 414836884, 411759734, 408873677, 406372488, 404490530, 403435975, 403283954, 403724909, 404151291, 404090226, 403512686, 403098375, 404067159, 406970263, 410652637, 413134873, 413345128, 411971509, 411321253, 413412243, 417513728, 420852065, 421712875, 421219409, 422634542, 427976102, 435081422, 439872473, 440394640, 437113196, 431419611, 424925774, 418617904, 413104475, 411148638, 416874021, 429917634, 444367409, 454792529, 459574193, 459329098, 456618547, 456819206, 464390695, 477874190, 491871685, 502657354, 509791434]
3006.4E09791434M461527K620876J167833j46091j413405k622187l696084m603624
3022.7E05560279n324423n724758n541027m551411l074944k208620k826542m335820
3039D71972734m756004k507448J209468L222554K323747J8895k161503l646791m267633
3057.4D61408019m319876m474342m987955n553991n940825o168991o237715o079704
3073.7D17644620n697310n210191m701138m122287l607273l333568l116459k881437
3090C84974957k730012k448976j867354j157105o35773m84228n49555n85586m89444
3108.4C74026924j72048N90622J726717K812206L676266M347026M898817N427956N909980
3126.7D03244466O293356O554961O728202O832451O760359O429195N901039N288273
$$ y = [509791434, 514252961, 516873837, 518041670, 517895579, 516482174, 513859987, 510163903, 505560279, 500235856, 494511098, 488970071, 484418660, 481343716, 479135096, 476308554, 471972734, 467216730, 464709282, 465918750, 469141304, 471465051, 471483946, 469322443, 465675652, 461408019, 457088143, 452613801, 447625846, 442071855, 436131030, 429962039, 423724324, 417644620, 411947310, 406737119, 402035981, 397913694, 394306421, 390972853, 387856394, 384974957, 382244945, 379795969, 377928615, 376771510, 376135737, 375651509, 375101954, 374516368, 374026924, 373854876, 374445498, 376172215, 378984421, 382660687, 387007713, 391906530, 397334486, 403244466, 409537822, 416092783, 422820985, 429653436, 436413795, 442842990, 448744029, 454032302]
3143D54032302M544079L545821K423584J348913K45214r04203j969546k919704l701806
3161.4D56644654m219353m472226m487157m304141l988087l588169l172428k892643
3177.7D25520450k795249k768070k716303k593219k424300k304524k289534k334535
3194D05294716k384036k415389k437324k440810k385914k320111k325058k360642k347559
3212.4C83877873k230852j952589j533002j069218o77019l83586j38849N3138J61916
3230.7C76107812K35856K94029L04938L36319M47124O29097Q64387J202911J712561
3249.1C82135034K323031K966017L702163M511535N254955N954831O689608P339448
3265.4D20876622P789940Q092731Q368671Q607119Q698732Q615017Q355170P990361
$$ y = [454032302, 458576381, 462122202, 464545786, 465894699, 466139913, 465235710, 463266164, 460346460, 456644654, 452425301, 447953075, 443465918, 439161777, 435173690, 431585521, 428413093, 425520450, 422725201, 419957131, 417240828, 414647609, 412223309, 409918785, 407629251, 405294716, 402910680, 400495291, 398057967, 395617157, 393231243, 390911132, 388586074, 386225432, 383877873, 381647021, 379694432, 378161430, 377092212, 376415193, 376031607, 375892758, 375945896, 376107812, 376343668, 376637697, 376942635, 377278954, 377726078, 378355175, 379219562, 380422473, 382135034, 384458065, 387424082, 391126245, 395637780, 400892735, 406847566, 413537174, 420876622, 428666562, 436759293, 445127964, 453735083, 462433815, 471048832, 479404002, 487394363]
3281.7D87394363P633567P294207O923557O485700N928457N279720M684508M194915
3298E35818994L731847L342151L145576L079772L044069K991497K886355K734781K539157
3316.4E63314199K302945K058983J736581J343429R99511O22570J76668k69711o44743
3334.8E71640432p74205n72860j97351J33216L01838K50340J9669k58207n54383r29713
3355.2E69058776j358867j711070j851380j851082j779258j462937p95841Q7738R06170
3373.5E59242249J475513J834273K097607K306997K423823K440453K357125K157271
3389.8E76335311K059460K161800K115787J817166J535118J432717J383781J232922
3406.1E90074062J042605Q90970P91609P55668P20382O16848N48363N74291N50449
$$ y = [487394363, 495027930, 502322137, 509245694, 515731394, 521659851, 526939571, 531624079, 535818994, 539550841, 542892992, 546038568, 549118340, 552162409, 555153906, 558040261, 560775042, 563314199, 565617144, 567676127, 569412708, 570756137, 571755648, 572378218, 572554886, 572285175, 571640432, 570866227, 570293367, 570096016, 570229232, 570531070, 570781410, 570801079, 570542872, 569988489, 569058776, 567699909, 565988839, 564137459, 562286377, 560507119, 559044182, 558248341, 558336079, 559242249, 560717762, 562552035, 564649642, 566956639, 569380462, 571820915, 574178040, 576335311, 578394771, 580556571, 582672358, 584489524, 586024642, 587457359, 588841140, 590074062, 591116667, 592007637, 592799246, 593554914, 594275296, 594892144, 595440507, 596014798, 596565247]
3424.5E96565247M35650L79085M50910N33580N49138O19471P56383P90536P08163N83768
3444.9F02371931N68509P41542Q26120O95705N69463N26548M92572M95494N83410O21498
3465.3F08492792N52117M77672M14074M23789N17308N99027N20468L54886M34935O02662
3485.7F13389730N57125N11646N80371N98728N94497N91278N07653L90589M06862N49137
3506.1F18677616N82993O26028Q44896Q59320O08027N34594O50286O63162N45323M91500
3526.5F25083745O45995Q95500R74893R06945Q54611Q47280Q71718P81298N45561M97282
3546.9F32904828P52508Q53420Q18014R53197J015484R38893Q75234N77450K146K19584
3567.3F39910758J427412J791656J254975R78768J083374J243651J312912J069843
$$ y = [596565247, 597000897, 597379982, 597830892, 598364472, 598913610, 599533081, 600289464, 601080000, 601788163, 602371931, 602940440, 603681982, 604508102, 605203807, 605773270, 606299818, 606792390, 607287884, 607871294, 608492792, 609044909, 609522581, 609936655, 610360444, 610877752, 611476779, 611997247, 612352133, 612787068, 613389730, 613946855, 614458501, 615038872, 615637600, 616232097, 616823375, 617331028, 617721617, 618128479, 618677616, 619260609, 619886637, 620731533, 621590853, 622198880, 622733474, 623383760, 624046922, 624592245, 625083745, 625729740, 626625240, 627600133, 628507078, 629361689, 630208969, 631080687, 631861985, 632407546, 632904828, 633657336, 634510756, 635328770, 636281967, 637297451, 638236344, 639111578, 639689028, 639691174, 639910758, 641338170, 643129826, 644384801, 645363569, 646446943, 647690594, 649003506, 650073349]
3583.6F50073349M04478K84850J334012J712978J129746J029193J376510J410425J380801
3601.9F60136342J312852P57456L31580O49393R89020J161933J099109P23422J175523
3620.3F68336630J884401J399040l517r19103N51819J870692J403034Q02875M97579
3638.7F75823450L18766K08616k63512j188755j170516Q52465K024055J104474M68552
3657F78177595Q76367O15478K6524j47462p44045j506269p06076j08958o17504O40989
3677.4F76506639J794099J321674P21633J07229p48575q37505M05908J188695Q47996
3695.8F81307793J64091m60088o56545o3241J75238n45323j288772p62105O78182R15110
3716.2F79464340J14024n80549p51257n65768k09391J38283k74956j233101j338780
$$ y = [650073349, 650477827, 650762677, 652096689, 653809667, 654939413, 655968606, 657345116, 658755541, 660136342, 661449194, 662206650, 662538230, 663187623, 664176643, 665338576, 666437685, 667161107, 668336630, 670221031, 671620071, 671616554, 670697451, 671249270, 673119962, 674522996, 675325871, 675823450, 676142216, 676350832, 676087320, 674898565, 673728049, 674580514, 676604569, 677709043, 678177595, 679053962, 679669440, 679695964, 679548502, 678804457, 677298188, 676592112, 676483154, 675865650, 676506639, 678300738, 679622412, 680344045, 680451274, 679702699, 678865194, 679271102, 680459797, 681307793, 681471884, 681011796, 680355251, 680292010, 680467248, 679921925, 678633153, 677871048, 678549230, 679464340, 679578364, 678997815, 678246558, 677680790, 677471399, 677609682, 677334726, 676101625, 674762845]
3734.5F74762845r4712J066268O48200j226246k074540l46184j12056q14319N79119
3752.9F72388375J459002N08547l00765J33634M26411j25408n28633n52297k6286N58138
3773.3F73940718K87354l75509o22153k43485m6313p7903J03831L5822k73883n81741
3793.7F72146738p87199n89907q53419j048506O3539K36809J4663N73516L00646q94785
3814.1F69162095j469136p63774p57634m22299P63893N84066k2173l94881o39319o18816
3834.4F65422022r66906r76384Q2433O99163P12931N84781m8578j459121k929449j192570
3854.8F59928322J536846J294851k3603q02577n32865k27094p58171n33402L39985
3873.2F60222292N05567K00867n55157n32091P808k02358J9074M5299l54528J68085
$$ y = [674762845, 674668133, 675734401, 676382601, 675156355, 673081815, 672735631, 672623575, 671809256, 672388375, 673847377, 674355924, 674055159, 674188793, 674615204, 674489796, 673961163, 673408866, 673382580, 673940718, 674228072, 673852563, 673230410, 672986925, 672940612, 672862709, 672966540, 673002362, 672728479, 672146738, 671359539, 670769632, 669916213, 668867707, 668931246, 669168055, 669182718, 669756234, 670056880, 669162095, 667692959, 666929185, 666171551, 665749252, 666513145, 667097211, 667075038, 666680157, 666040838, 665422022, 664455116, 663478732, 663561165, 664260328, 664973259, 665558040, 665509462, 664050341, 661120892, 659928322, 661465168, 662760019, 662736416, 661933839, 661400974, 661173880, 660415709, 659882307, 660222292, 660727859, 660928726, 660373569, 659841478, 659849286, 659646928, 659666002, 659711301, 659356773, 659524858]
3893.6F59524858L57032o67811j500725j225531l12031O66023R69171M81904j908k95579
3914F57995403n96404n27025j48534j14560k85864j11759l0637l94285m30285N9187
3934.4F55415237K33054p3850m85838o84738m27663j76072j20580P2777J74165K2232
3954.8F53948724j19865j38461j47701j62899j71244k28107k33472j52707j33514j53542
3975.2F52307212j43766j36852r7812p4088j93000l67820l58582j76728q8453j24097
3995.6F50546014j27375
3997.6F50418639
$$ y = [659524858, 659881890, 659214079, 657713354, 656487823, 656175792, 656841815, 657810986, 658292890, 658290982, 657995403, 657398999, 656871974, 656723440, 656608880, 656323016, 656211257, 656180620, 655786335, 655356050, 655415237, 655648291, 655574441, 655088603, 654403865, 653976202, 653800130, 653679550, 653752327, 653926492, 653948724, 653828859, 653690398, 653542697, 653379798, 653208554, 652980447, 652746975, 652594268, 652460754, 652307212, 652163446, 652026594, 651928782, 651854694, 651661694, 651293874, 650935292, 650758564, 650670111, 650546014, 650418639]
##END=$$ End of the data block
