##TITLE=FA129 $$ Begin of the data block
##JCAMP-DX=5.00 $$ ACD/SpecManager v 10.08
##SPECTROMETER/DATA SYSTEM=Alpha
##DATE=20 Feb 2015 09:12:38
##DATA TYPE=INFRARED SPECTRUM
##DATA CLASS=XYDATA
##ORIGIN=
##OWNER=
##NPOINTS=1765
##FIRSTX=399.76428223
##LASTX=3997.64306641
##MAXX=3997.64306641
##MINX=399.76428223
##MAXY=0.85087627
##MINY=0.09666195
##XFACTOR=1.0000000000
##YFACTOR=1.000000000000000e-9
##FIRSTY=0.74029124
##DELTAX=2.03961372
##XUNITS=1/CM
##YUNITS=ARBITRARY UNITS
##XYDATA=(X++(Y..Y))
399.8G40291238L832817L722846Q37088k686322j598656L794134O395817L350794j487374
$$ 740291238 744124055 747846901 748683989 745997667 744399011 748193145 754588962 757939756 756452382
418.1G56452382l678382l021896m081487p936061j1265516q798063K27869Q036256
$$ 756452382 752774000 749752104 745670617 737734556 726469040 717670977 717898846 725935102
434.4G25935102Q177816L599406M72724m72128j821637m505098o714821o770194n847275
$$ 725935102 734112918 737712324 738185048 737712920 735891283 731386185 724671364 717901170 712053895
452.8G12053895o888151j1532188j5477955j1475623Q6368J2563824J8314302J6678333
$$ 712053895 705165744 693633556 678155601 666679978 666766346 679330170 697644472 714322805
469.1G14322805J3033629R769440N380928J434147J076699L822982N562723L800928
$$ 714322805 727356434 737125874 742506802 743940949 745017648 748840630 754403353 758204281
485.4G58204281O41466o71983m5777J27137j439214l271460l597498k921820l111064
$$ 758204281 758845747 758173764 758127987 758255124 756815910 753544450 749946952 747025132 743914068
503.8G43914068n150020p484854p449209n472422m833400p473171j1720538j4540434
$$ 743914068 738764048 731279194 723829985 718357563 713524163 706050992 694330454 679790020
520.1F79790020j4226675r314239K95997R736478J4244854J4263094J1145592O659746
$$ 679790020 665563345 656249106 656545103 666281581 680526435 694789529 705935121 712594867
536.4G12594867L228664K017796J627267K04026j801490k477706j411736l84390q55029
$$ 712594867 715823531 717841327 719468594 719672620 717871130 715393424 713981688 713597298 712742269
554.8G12742269k095461k598762k366424k733707m844010p551670p541120l346563
$$ 712742269 710646808 708048046 705681622 702947915 698103905 690552235 683011115 679664552
571.1F79664552J114428R08911l252804p343113j0057509j2069225j2531698r199202
$$ 679664552 680778980 681687891 678435087 671091974 661034465 648965240 636433542 627234340
587.4F27234340j240194Q075416J3308227J2739658R316147O146252L885388J505137
$$ 627234340 625994146 634069562 647377789 660117447 669433594 675579846 679465234 680970371
603.7F80970371j314104l536880m302800m140019m474044n683422o601274o213248
$$ 680970371 679656267 676119387 671816587 667676568 663202524 657519102 650917828 644704580
620F44704580n150139m498124m155457l256262j549005j87695R39488L921390O803811
$$ 644704580 639554441 635056317 630900860 627644598 626095593 625907898 626847386 630768776 637572587
638.4F37572587N641281J718998k522647o990731j1346579j5110910j8140256j9411564
$$ 637572587 643213868 644932866 642410219 635419488 624072909 608961999 590821743 571410179
654.7E71410179j6596079q618712K312958J1627257J5553713J9968152K6311040K0968199
$$ 571410179 554814100 546195388 548508346 560135603 575689316 595657468 621968508 642936707
671F42936707J6100108J4440715J1231125Q273363O691277N603254L920197J869321
$$ 642936707 659036815 673477530 684708655 692982018 699673295 705276549 709196746 711066067
687.3G11066067M79400K16246J04725p67231k059638k619147k346158k255023l201127
$$ 711066067 711545467 711761713 711866438 711099207 709039569 706420422 704074264 701819241 698618114
705.7F98618114m734635n792618o402493p706225j0515868j4612377j9361734k1709264
$$ 698618114 693883479 688090861 681688368 673982143 663466275 648853898 629492164 607782900
722F07782900j5626967j433909Q600712P322312L151893K621651L007591J547098j385927
$$ 607782900 592155933 590722024 599322736 606645048 609796941 612418592 615426183 616973281 615587354
740.4F15587354m880727r068966j4540255k1337092k8394699l2203734k6763051j0998875
$$ 615587354 610706627 601637661 587097406 565760314 537365615 505161881 478398830 467399955
756.7D67399955N808115J4768809J6782611J6042114J2951135O095112j793444j691342
$$ 467399955 473208070 487976879 504759490 520801604 533752739 539847851 538054407 536363065
773E36363065Q606315J7204285J7096579J4125943J2316704J0082602O654859L033101
$$ 536363065 544969380 562173665 579270244 593396187 605712891 615795493 622450352 625483453
789.3F25483453J11878k421379n745172j0851622j7367244k0086646j6093910j6276717
$$ 625483453 625595331 623173952 617428780 606577158 589209914 569123268 553029358 536752641
805.6E36752641k0320296l018975L2794058M9945772L9981007K4419904J5162826J1265337
$$ 536752641 516432345 513413370 546207428 596153200 636134207 660554111 675716937 686982274
822F86982274R316742O826044L286182K70665M17233M525602R173691J0304689Q101523
$$ 686982274 696299016 703125060 706411242 706681907 707099140 711624742 720798433 731103122 739204645
840.3G39204645N109787K211809n61952j549542O92665M436255O537556N824686L288805
$$ 739204645 744314432 746526241 745964289 744414747 745107412 749543667 756081223 761905909 765194714
858.7G65194714N18441j783013l990293n562603l582776K477706P544160Q237242O567836
$$ 765194714 765713155 763930142 759939849 754377246 750794470 753272176 760816336 769053578 775621414
877G75621414M793406L310382K198577J342773K58208j151145k297461k903580l751934
$$ 775621414 780414820 783725202 785923779 787266552 787524760 786373615 784076154 781172574 777420640
895.4G77420640n876184r319782j2361824j1652708m578114O183386J3257205J3027490
$$ 777420640 771544456 762224674 749862850 738210142 733632028 739815414 753072619 766100109
911.7G66100109Q906483M839838J295090k057970l590405j906157L92259o795k209425
$$ 766100109 775006592 779846430 781141520 779083550 775493145 773586988 773979247 773972452 771763027
930.1G71763027l799737m478931n603731p841885r809554j0925471j2685538j4784872
$$ 771763027 767963290 763484359 757880628 750038743 740229189 729303718 716618180 701833308
946.4G01833308j3916135o623328N589903J4593124J4286160O826759k181709q203566
$$ 701833308 687917173 681293845 686883748 701476872 715763032 722589791 720408082 712204516
962.7G12204516q234263k816677L628552P531226Q648753P866383N721569K838135
$$ 712204516 703970253 701153576 704782128 712313354 720962107 728828490 734550059 737388194
979G37388194J70707j520514k372921l226518m543007n874693o547868o678224p099211
$$ 737388194 737558901 736038387 733665466 730438948 725895941 720021248 713473380 706795156 699695945
997.4F99695945q465231j0753154j3214171j3702691j1044383p366240l309429J997829
$$ 699695945 691230714 680477560 667263389 653560698 642516315 635150075 631840646 633838475
1013.7F33838475O236553P260859O197572N147457N378127O609261P255971O137371
$$ 633838475 640075028 647335887 653533459 658680916 664059043 670668304 677924275 684061646
1030F84061646L807068J633942Q6070j357437k982139m387677n199075n604267o125211
$$ 684061646 687868714 689502656 689588726 688231289 685249150 680861473 675662398 670058131 663932920
1048.4F63932920o952525p818639q688211r989083j2067199j4793634j7471314j8670380
$$ 663932920 656980395 649161756 640473545 630484462 618417263 603623629 586152315 567481935
1064.7E67481935j6193151r861827m753471n804777j0367215j2480497j1453301j1621564
$$ 567481935 551288784 541426957 536673486 530868709 520501494 508020997 496567696 484946132
1081D84946132j5638203k1715700k6609749k8712004k9296607k9684872k7828067k0590872
$$ 484946132 469307929 447592229 420982480 392270476 362973869 333288997 305460930 284870058
1097.3B84870058o808638J2619793L4896404N4293513O2858105N6328565L9201945
$$ 284870058 278061420 290681213 325577617 379871130 442729235 499057800 538259745
1111.6E38259745K0758807P537842K54989m291296q577228j1442303j1274457r329737
$$ 538259745 559018552 566556394 566811383 562520087 553942859 542500556 531226099 521896362
1127.9E21896362n016923M563034J6124189K2434831K1791517J7244756J1646331O462157
$$ 521896362 516879439 521442473 537566662 560001493 581793010 599037766 610684097 617146254
1144.2F17146254J965224k329588o882548j1728108j6635895k1312177k5234282k8193533
$$ 617146254 619111478 616781890 609899342 598171234 581535339 560223162 534988880 506795347
1160.5E06795347l1260669l4684778l3545911j8881947R449393L5108238M1418821
$$ 506795347 475534678 440849900 407303989 388422042 397871435 432979673 474398494
1174.8D74398494K8420090Q339107p277905j2267232m578591J1552960K3862988K2774815
$$ 474398494 502818584 511157691 503879786 491612554 487033963 498586923 522449911 545224726
1191.1E45224726J1946559M84467p720590j3236463j7225742k0406336k3161560k5653452
$$ 545224726 557171285 557655752 549935162 536698699 519472957 499066621 475905061 450251609
1207.5D50251609k8065711l0350715l1300008k9644102k7761221k9166132l1388134
$$ 450251609 422185898 391835183 360535175 330891073 303129852 273963720 242575586
1221.7B42575586k8918222k0162657p830605K739966P489384Q969321J4004738K5239676
$$ 242575586 213657364 193494707 185664102 188404068 195893452 204862773 218867511 244107187
1238.1B44107187L8390696M7362387M9621522M6638489M1217268L4963846K8088689
$$ 244107187 282497883 329860270 379481792 426120281 467337549 502301395 530390084
1252.3E30390084K0586550J2695134M616260l779948j2601852k1281183k7486980k7209401
$$ 530390084 550976634 563671768 568288028 564508080 551906228 530625045 503138065 475928664
1268.6D75928664j8530428m264951J1050403K3319751K7238041K0355165P581234m592180
$$ 475928664 457398236 453133285 464183688 487503439 514741480 535096645 542677879 538085699
1285E38085699j3834000j9800484k1844476k0549953j8745333j9221515k1539181k2022635
$$ 538085699 524251699 504451215 482606739 462056786 443311453 424089938 402550757 380528122
1301.3C80528122j7461419r570897l895223l188967m090995p44641R538174K3529887
$$ 380528122 363066703 353495806 349600583 346411616 342320621 341575980 351114154 374644041
1317.6C74644041L4572780L8040161L5400749L0286908K4543285J9058466J3973355
$$ 374644041 409216821 447256982 482657731 512944639 537487924 556546390 570519745
1331.9E70519745Q800328L188074k914131r307384j5318990k0913124k5661052k5622338
$$ 570519745 579320073 582508147 579594016 570286632 554967642 534054518 508393466 482771128
1348.2D82771128j5008598M345268J7576367J3063788l197640k0359010l4898996l8391560
$$ 482771128 467762530 472107798 489684165 502747953 499550313 479191303 444292307 405900747
1364.5D05900747k1285505J0757506L9119631M9974949M5946002L2452464J7879069
$$ 405900747 384615242 395372748 434492379 484467328 530413330 562865794 580744863
1378.8E80744863N820691m606008j2951970j6824425j0563195J546681P885337O300092
$$ 580744863 586565554 581959546 569007576 552183151 541619956 543166637 551051974 557352066
1395.1E57352066N63502n176484r282530j2443125j5362859j5516042j3012022j0145962
$$ 557352066 557915568 552739084 543456554 531013429 515650570 500134528 487122506 476976544
1411.4D76976544o918818k553254J676470L603696K469182O85096j25617q18520l095448
$$ 476976544 470057726 467504472 469180942 472784638 475253820 475938916 475813299 474994779 471899331
1429.8D71899331o523937j0226936j7843902k7430921l0996055l0772507k3480892
$$ 471899331 465375394 455148458 437304556 409873635 378877580 348105073 324624181
1444.1C24624181q984387M749745J3310909J6551733J6947568J9060403K0898461J6238064
$$ 324624181 315639794 320389539 333700448 350252181 367199749 386260152 407158613 423396677
1460.4D23396677J3070166J4994204J8367857J7833978J4652639J0382176N393326
$$ 423396677 436466843 451461047 469828904 487662882 502315521 512697697 518091023
1474.7E18091023K535641K047062K800703N565643J0655284J6400874K0152152J8873930
$$ 518091023 520626664 522673726 525474429 531040072 541695356 558096230 578248382 597122312
1491E97122312J3360440Q679867N614340K023757j234889m083812r559274j8620074
$$ 597122312 610482752 619162619 624776959 626800716 625565827 621482015 611922741 593302667
1507.3E93302667k0780384k1120668k4627924k9014140l2998175l3590465l4195722
$$ 593302667 572522283 551401615 526773691 497759551 464761376 431170911 396975189
1521.6C96975189k7509778j4442534J131297J9853562L8179815N2649766M7628790
$$ 396975189 369465411 355022877 356154174 376007736 414187551 466837317 514466107
1535.8E14466107L7099540L8498104L3932984K2265136J5352726R872615N451560K121270
$$ 514466107 551565647 590063751 623996735 646261871 661614597 671487212 676938772 679060042
1552.2F79060042o91116l907084j1527777j9668818j3929486l185928Q707881J4232755
$$ 679060042 678368926 674461842 662934065 643265247 629335761 626149833 634857714 649090469
1568.5F49090469R872794J995683l787935q404493r513915r541154j1114895j2348592
$$ 649090469 658963263 660958946 657171011 648766518 639252603 629711449 618596554 606247962
1584.8F06247962j3293386j4254212j5517533j7093122j9443453k2106826k4879873
$$ 606247962 592954576 578700364 563182831 546089709 526646256 504539430 479659557
1599.1D79659557k7549743k9331118l0043751l1212688l3071220l2019913k4619132
$$ 479659557 452109814 422778696 392734945 361522257 328451037 296431124 271811992
1613.4B71811992r910554J0587275K1320045J9052804J3857513P473350O13034p465244
$$ 271811992 261901438 272488713 293808758 312861562 326719075 334192425 334805459 327340215
1629.7C27340215j3518571j6190410j5713960p461548J431108O223499Q682937J0946631
$$ 327340215 313821644 297631234 281917274 274455726 275886834 282110333 290793270 301739901
1646C01739901J1539549Q857220Q740992J0572016O284475J140029l711105j0608375
$$ 301739901 313279450 322136670 330877662 341449678 347734153 348874182 345163077 334554702
1662.3C34554702j7481446k2737205l2034874m1070149l7027955k9811069k1323323
$$ 334554702 317073256 294336051 262301177 221231028 184203073 154392004 133068681
1676.6A33068681j0760844o038867o309897p874146m947945m75034L247782O434225
$$ 133068681 122307837 116268970 109959073 102084927 97136982 96661948 99909730 106343955
1692.9A06343955J0336466J3456978J4603004J7474100J6567126J6843721J9802496
$$ 106343955 116680421 130137399 144740403 162214503 178781629 195625350 215427846
1707.2B15427846K0713284K1389529K2916884K5914490L1378746L1907320K7077436
$$ 215427846 236141130 257530659 280447543 306362033 337740779 369648099 396725535
1721.5C96725535K5676310K4972797K2613048K0460576J8664927J9806027J9348979
$$ 396725535 422401845 447374642 469987690 490448266 509113193 528919220 548268199
1735.7E48268199J5292346J4810801J5103877J3604343J2425303J1659086J1915028
$$ 548268199 563560545 578371346 593475223 607079566 619504869 631163955 643078983
1750F43078983J1991441J0481417R407580R072662Q575260Q392930P442415N880237
$$ 643078983 655070424 665551841 674959421 684032083 692607343 701000273 708442688 714322925
1766.3G14322925N152762N067408N719125O011307N397558N147398N439103N486726
$$ 714322925 719475687 724543095 730262220 736273527 741671085 746818483 752257586 757744312
1782.6G57744312N030215M544199M061102L947735M297674M116833L395736L102959
$$ 757744312 762774527 767318726 771379828 775327563 779625237 783742070 787137806 790240765
1799G90240765L430605L702342L375650K878248K826512L162682L275037K834201K364278
$$ 790240765 793671370 797373712 800749362 803627610 806454122 809616804 812891841 815726042 818090320
1817.3H18090320K287447K328396K092183J713693J330554J295090J821637J903057
$$ 818090320 820377767 822706163 824798346 826512039 827842593 829137683 830959320 832862377
1833.6H32862377J283348P16567N49733L74794J18733K64704M96745M04120n6327j217067
$$ 832862377 834145725 834862292 835412025 835786819 835905552 836170256 836667001 837071121 837014794 835797727
1854H35797727l004432m175901l009498K34604K809822K979338J820386J043618Q03530
$$ 835797727 832793295 828617394 825607896 825842500 828652322 831631660 833452046 834495664 835299194
1872.4H35299194N02705K04444K97070Q81612J477599J521349J016140N30660N59211
$$ 835299194 835801899 836006343 836303413 837185025 838662624 840183973 841200113 841730773 842289984
1890.7H42289984Q28862Q42989O89745O00517P05301R31085R59098O49035L12686K96056
$$ 842289984 843118846 843961835 844651580 845252097 845957398 846888483 847847581 848496616 848809302 849105358
1911.1H49105358M11391K49744k05100m70757m82917m57048m46439o72519q94011p07864
$$ 849105358 849516749 849766493 849561393 849090636 848607719 848150671 847704232 847031713 846137702 845429838
1931.5H45429838k34962R8586R0778o9737J549M22359P14362N47349K11656Q0288J94728
$$ 845429838 845194876 845293462 845384240 845314503 845316052 845738411 846452773 847000122 847211778 847292066 847486794
1954H47486794L05653J84059K2590J10149L77178N40495M73381K55286J40786K99454
$$ 847486794 847792447 847976506 847999096 848109245 848486423 849026918 849500299 849755585 849896371 850195825
1974.4H50195825M41313K39134j23501k04444Q821J49787m7982m17292m97818k48253
$$ 850195825 850637138 850876272 850752771 850548327 850557148 850706935 850658953 850241661 849743843 849495590
1994.8H49495590j12593k67327m80056m49777j48535K3067k03311n38289m99666j08183
$$ 849495590 849382997 849115670 848635614 848185837 848037302 848060369 847857058 847318769 846819103 846710920
2015.2H46710920J97053J07110k47359m99547l57926Q9049R6322m58539p82192o57737
$$ 846710920 846907973 847015083 846767724 846268177 845910251 845999300 846095622 845637083 844854891 844197154
2035.6H44197154n85616q28206j024366p56800j38163L46183L80755J43528R2566K77162
$$ 844197154 843611538 842783332 841758966 841002166 840864003 841210186 841590941 841734469 841827035 842104197
2056H42104197K91466l5345m14849n02944k91347j69575m21048p70509q08000n46813
$$ 842104197 842395663 842360318 841945469 841442525 841151178 840981603 840560555 839790046 838982046 838435233
2076.4H38435233l84927n30481p42376o68168k95759k0146p1168j69218K4200M11332
$$ 838435233 838050306 837519825 836777449 836109281 835813522 835793376 835722208 835552990 835577190 835988522
2096.8H35988522O12139M55261K18808K31564M25756M75347K61009K4319J6868J95920
$$ 835988522 836600661 837055922 837274730 837506294 837932050 838407397 838668406 838692725 838709593 838905513
2117.1H38905513K75553J00493j51217j94311k0027N1856j57953m04775l78072j20044
$$ 838905513 839181066 839281559 839130342 838936031 838916004 838967860 838809907 838405132 838027060 837907016
2137.5H37907016Q2791L2842j69635k25603p1883J9848j26660l47733l77477k07722
$$ 837907016 837989807 838022649 837853014 837627411 837555528 837575376 837448716 837100983 836723506 836515784
2157.9H36515784j04844k60949n22912o20425n00262l40521l64780n30362n45562l26991
$$ 836515784 836410940 836149991 835627079 835006654 834506392 834165871 833801091 833270729 832725167 832398176
2178.3H32398176j36435j57595k68399k52426p2181M4465r9182l35753l42667j05083
$$ 832398176 832261741 832104146 831835747 831583321 831511140 831555605 831456423 831120670 830778003 830672920
2198.7H30672920N1796n7399k61307l32832k21014j45257l10898n69820o36518m65155
$$ 830672920 830724716 830667317 830406010 830073178 829852164 829706907 829396009 828826189 828189671 827724516
2219.1H27724516l26693m11808n46694m99368k97665j95444l45766n32032m80055k82288
$$ 827724516 827397823 826986015 826439321 825939953 825642288 825446844 825101078 824569046 824088991 823806703
2239.5H23806703k50816m64261o72817o13988l46541j88231k70486l81768k97666r3162
$$ 823806703 823555887 823091626 822418809 821804821 821458280 821270049 820999563 820617795 820320129 820226967
2259.9H20226967k3305j81198l51846l21389j75953j51217l17394m59492l91663k02536
$$ 820226967 820203662 820022464 819670618 819349229 819173276 819022059 818704665 818245173 817853510 817650974
2280.3H17650974j24574k65777m83871n39004m33207m01258n43654p17044p64311o96241
$$ 817650974 817526400 817260623 816776752 816237748 815804541 815403283 814859629 814142585 813378274 812682033
2300.7H12682033o45459p69615r69768r80794q21233o79135o35267o52969o17504m83691
$$ 812682033 812036574 811266959 810297191 809316397 808495164 807816029 807180762 806527793 805910289 805426598
2321.1H05426598l62933l23832l92079n09084m88519m02272n03779o78122o87420n62072
$$ 805426598 805063665 804739833 804347754 803838670 803350151 802947879 802444100 801765978 801078558 800516486
2341.5H00516486m20332j75535P1406j76251q47161j357853j382590j173794p99894
$$ 800516486 800096154 799920619 799992025 799815774 798968613 797610760 796228170 795054376 794254482
2359.9G94254482k97606L0696R7394Q8573J90079L98993N00679L73304J69754O1870
$$ 794254482 793956876 793987572 794084966 794173539 794363618 794762611 795263290 795636594 795806348 795868218
2380.2G95868218J1563j17361l50774n29885n07712l32475j76549j62721k45154k44438
$$ 795868218 795879781 795762420 795411646 794881761 794374049 794041574 793865025 793702304 793457150 793212712
2400.6G93212712r7335K4021j0848j12951j15216j5199j0669k33948n26190o24359
$$ 793212712 793115377 793139398 793128550 793015599 792900383 792885184 792874515 792640567 792114377 791490018
2421G91490018n63621n70536o78301p52031p02858n88060n50866o13689o46711n50747
$$ 791490018 790926397 790355861 789677560 788925529 788222671 787634611 787083745 786470056 785823345 785272598
2441.4G85272598l73840k36690j91867j67966l0816J99318L33548L20375K98976L83378
$$ 785272598 784898758 784662068 784470201 784302235 784271419 784470737 784804285 785124660 785423636 785807014
2461.8G85807014N40018O11007N05864L07262J47105Q1241J3888j65761l75688m80890
$$ 785807014 786347032 786958039 787463903 787771165 787918270 787999511 788013399 787847638 787471950 786991060
2482.2G86991060n26428o30141p62820q42571q41141p56562o63936o33418o08325n01752
$$ 786991060 786464632 785834491 785071671 784229100 783387959 782631397 781967461 781334043 780725718 780223966
2502.6G80223966l50654k78950l35217m50611n41627n92828o80685q61228j039624
$$ 780223966 779873312 779594362 779259145 778808534 778266907 777674079 776993394 776132166 775092542
2521G75092542j090050r91642q15392o68525n75960m05133j11103J12891J43350O2584
$$ 775092542 774002492 773010850 772195458 771526933 770950973 770545840 770434737 770547628 770690978 770753562
2541.4G70753562j2755q941K1458m7028j70708k28107k07841j87636k78651m53532
$$ 770753562 770740807 770731866 770753324 770706296 770535588 770307481 770099640 769912004 769633353 769179821
2561.8G69179821n05984l57389j93894k04861l44277m08113l18408k24471k43008k69890
$$ 769179821 768673837 768316448 768122554 767917693 767573416 767165303 766846895 766622424 766379416 766109526
2582.2G66109526j87814l2246O6995L5704n2393p8618k9028o0439k31862l56793l45886
$$ 766109526 765921712 765889466 765956461 765992165 765939772 765861154 765832126 765771687 765539825 765183032 764837146
2604.6G64837146k96653l10778l98874m64619m00126k12967p1645j15156k41518k89917
$$ 764837146 764540493 764229715 763830841 763366222 762966096 762753129 762681484 762566328 762324810 762034893
2625G62034893k61664k72096l70621m47691m17173l40163l39926m48644n28812m66109
$$ 762034893 761773229 761501133 761130512 760682821 760265648 759925485 759585559 759136915 758608103 758141994
2645.4G58141994l23891k27809k28703k55883k30253k40266l57091m61638n04673n41627
$$ 758141994 757818103 757590294 757361591 757105708 756875455 756635189 756278098 755816460 755311787 754770160
2665.8G54770160n65172n67615n80370n76973m92632l99769m05490m92454n58614n41509
$$ 754770160 754204988 753637373 753057003 752480030 751987398 751587629 751182139 750689685 750131071 749589562
2686.2G49589562m85420m64916n22435n92112o06954n88954n56409n83112p03812p90119
$$ 749589562 749104142 748639226 748116791 747524679 746917725 746328771 745772362 745189250 744485438 743695319
2706.6G43695319p94471q40187r45270j003980r61125q33750p16269o62625o31869
$$ 743695319 742900848 742060661 741115391 740111411 739150286 738316536 737600267 736937642 736305773
2724.9G36305773o13630o49750p51674q72970r98258j124263j223266j329780j468062
$$ 736305773 735692143 735042393 734290719 733417749 732419491 731295228 730071962 728742182 727274120
2743.3G27274120j627386j783669j887262k002596k223433k477765k695381k864778
$$ 727274120 725646734 723863065 721975803 719973207 717749774 715272009 712576628 709711850
2759.6G09711850k948940k978385k942919k726674k353192k058923k054095k351106
$$ 709711850 706762910 703784525 700841606 698114932 695761740 693702817 691648722 689297616
2775.9F89297616k794563l262580l772139m345119m938662n464316n829453n945087
$$ 689297616 686503053 683240473 679468334 675123215 670184553 664720237 658890784 652945697
2792.2F52945697n713403n110800m282177l533721l137469l024399k764642j980246
$$ 652945697 647232294 642121494 637839317 634305596 631168127 628143728 625379086 623398840
2808.6F23398840o22570J084030K820611M231453M943609M841923M104376K962649
$$ 623398840 622776270 623860300 626680911 630912364 635855973 640697896 644802272 647764921
2824.9F47764921J675964M83453n24938j337469j933098k330661k641201l026664l582716
$$ 647764921 649440885 649924338 649399400 648061931 646128833 643798172 641156971 638130307 634547591
2843.2F34547591m246235m806518m981637m536808l559351k509832j833916j696110
$$ 634547591 630301356 625494838 620513201 615976393 612417042 609907210 608073294 606377184
2859.5F06377184j976788k316594k357602k084970j780868j761436k178371k896548
$$ 606377184 604400396 602083802 599726200 597641230 595860362 594098926 591920555 589024007
2875.9E89024007l578543l963471m000962l795981l492951l058613k421617j699209
$$ 589024007 585445464 581481993 577481031 573685050 570192099 567133486 564711869 563012660
2892.2E63012660j046062n27859k23398k71439o11008q94844q55983n57303l02613
$$ 563012660 561966598 561438739 561215341 560943902 560332894 559438050 558582067 558024764 557722151
2910.5E57722151l54051o95587j116096j427591j663089k004922k369701k282858j255274
$$ 557722151 557368100 556672513 555556417 554128826 552465737 550460815 548091114 545808256 544552982
2928.9E44552982N49137K108098K507030J935423J232266P81060L70025j86085q56579
$$ 544552982 545102119 547210217 549717247 551652670 552884936 553665996 554036021 553849936 552993357
2947.2E52993357j608550k404869l262758m329682n792439p613718q877933p886171
$$ 552993357 551384807 548979938 545717180 541387498 535595059 527981341 519103408 511217237
2963.6E11217237m307569q18729m34756k760887m705936l908932n72712L568203P616907
$$ 511217237 506909668 506090939 505656183 502895296 498189360 494280428 493707716 497275919 504892826
2981.9E04892826J1485458J4033377J4056623J2236774J0134637Q597851P620752O747365
$$ 504892826 516378284 530411661 544468284 556705058 566839695 575437546 583058298 589805663
2998.2E89805663N694806M552782L405571K260029J190782L59416l3319J63853Q18968
$$ 589805663 595500469 600053251 603458822 605718851 606909633 607269049 607235730 607399583 608218551
3016.6F08218551J517474J988650K203643K076745J479745N18501n55158j611590k548814
$$ 608218551 609736025 611724675 613928318 616005063 617484808 618003309 617448151 615836561 613287747
3034.9F13287747l236830l538430l296852k537072j554608q15630o28174q48829j254440
$$ 613287747 610050917 606512487 603215635 600678563 599123955 598308325 597680151 596831322 595576882
3053.3E95576882j800716k391219k922654l436923l949702m304349m300118l923237
$$ 595576882 593776166 591384947 588462293 585025370 581075668 576771319 572471201 568547964
3069.6E68547964l425002l041327k767205k610684k674460k952635l415823l963054
$$ 568547964 565122962 562081635 559314430 556703746 554029286 551076651 547660828 543697774
3085.9E43697774m375457m624308m755616m606723m038692l241777k586425k207875
$$ 543697774 539322317 534698009 529942393 525335670 521296978 518055201 515468776 513260901
3102.2E13260901j960397j746833j690149j834691j851380j588821j373768j306832
$$ 513260901 511300504 509553671 507863522 506028831 504177451 502588630 501214862 499908030
3118.6D99908030j198441r75132n87463j04457K49922M14938N68002Q78722J345247
$$ 499908030 498709589 497734457 497146994 497042537 497292459 497707397 498275399 499154121 500499368
3136.9E00499368J859605K383471L025293L743231M357338M787982M947185M811704
$$ 500499368 502358973 504742444 507767737 511510968 515868306 520656288 525603473 530415177
3153.2E30415177M594446M505872M459918M353285M215240M022539L715455L304243
$$ 530415177 535009623 539515495 543975413 548328698 552543938 556566477 560281932 563586175
3169.6E63586175K827049K216935J498520P81298L5703p77483j656055k541125l336132
$$ 563586175 566413224 568630159 570128679 570909977 570945680 570168197 568512142 565971017 562634885
3187.9E62634885m077077m833459n550504o097019o382406o474018o440460o295205
$$ 562634885 558557808 553724349 548173845 542076826 535694420 529220402 522779942 516484737
3204.2E16484737o042420n677104n278409m887849m474640m057497l651350l212691
$$ 516484737 510442317 504765213 499486804 494598955 490124315 486066818 482415468 479202777
3220.5D79202777k761572k364248j927823j352340p59960j79737N55575J422792K245337
$$ 479202777 476441205 474076957 472149134 470796794 470036834 469857097 470412672 471835464 474080801
3238.9D74080801K994984L744722M471600N100578N588084N918295O139099O296635
$$ 474080801 477075785 480820507 485292107 490392685 495980769 501899064 508038163 514334798
3255.2E14334798O367445O311059O122351N879461N622328N293429M949152M678547
$$ 514334798 520702243 527013302 533135653 539015114 544637442 549930871 554880023 559558570
3271.5E59558570M362882L983140L677845L379523K963662K527416K218783J966298
$$ 559558570 563921452 567904592 571582437 574961960 577925622 580453038 582671821 584638119
3287.8E84638119J665771J343667J069308Q49664O51777M42862J48773j53482l53396
$$ 584638119 586303890 587647557 588716865 589566529 590218306 590661168 590809941 590656459 590303063
3306.2E90303063n61297q38518j109063j412750j817047k244234k666831l160537l718197
$$ 590303063 589741766 588903248 587794185 586381435 584564388 582320154 579653323 576492786 572774589
3324.6E72774589m290521m882991n547941o310344p142603q016110q858621r710789
$$ 572774589 568484068 563601077 558053136 551742792 544600189 536584079 527725458 518014669
3340.9E18014669j0688901j1814445j3117820j4551073j5866965j6756684j7021417
$$ 518014669 507325768 495511323 482393503 467842430 451975465 435218781 418197364
3355.2D18197364j6360104j4214695r856284k895474N792946J3951629J9266158K0890802
$$ 418197364 401837260 387622565 377766281 374870807 380663753 394615382 413881540 434772342
3371.5D34772342J9508750J6580701J3536781J1113017R324193P905364O658376N656242
$$ 434772342 454281092 470861793 484398574 495511591 504835784 512741148 519399524 525055766
3387.8E25055766M971266M676044M793167M915118M764676M547298M461348M322231
$$ 525055766 530027032 534703076 539496243 544411361 549176037 553723335 558184683 562506914
3404.1E62506914L968001L551542L204882K967000K818048K563596K167106J895189
$$ 562506914 566474915 570026457 573231339 576198339 579016387 581579983 583747089 585642278
3420.4E85642278J793742J706064J584232J468241J403690J424729J464188J467050
$$ 585642278 587436020 589142084 590726316 592194557 593598247 595022976 596487164 597954214
3436.7E97954214J480281J521468J563966J581908J616835J644075J608074J529336
$$ 597954214 599434495 600955963 602519929 604101837 605718672 607362747 608970821 610500157
3453.1F10500157J452803J413107J379133J321435J309454J339376J336098J286149
$$ 610500157 611952960 613366067 614745200 616066635 617376089 618715465 620051563 621337712
3469.4F21337712J221657J247763J322747J346528J273453J166523J220524J364708
$$ 621337712 622559369 623807132 625129879 626476407 627749860 628916383 630136907 631501615
3485.7F31501615J397491J359224J366079J413524J475692J475274J410663J397670
$$ 631501615 632899106 634258330 635624409 637037933 638513625 639988899 641399562 642797232
3502F42797232J432478J441002J437664J489222J602292J599193J457631J416028J479447
$$ 642797232 644229710 645670712 647108376 648597598 650199890 651799083 653256714 654672742 656152189
3520.4F56152189J542568J558840J527965J559079J654327J719594J766741J755178
$$ 656152189 657694757 659253597 660781562 662340641 663994968 665714562 667481303 669236481
3536.7F69236481J698911J755596J807034J711785J624406J676440J721978J727343
$$ 669236481 670935392 672690988 674498022 676209807 677834213 679510653 681232631 682959974
3553F82959974J784026J849831J919746J965761J817823J585900J842082K404630K438784
$$ 682959974 684744000 686593831 688513577 690479338 692297161 693883061 695725143 698129773 700568557
3571.3G00568557K189576K152026K248287K364397K437115K324462K054691K037108
$$ 700568557 702758133 704910159 707158446 709522843 711959958 714284420 716339111 718376219
3587.7G18376219K426207K503693K280415K314448K483368K461672K417862K324164
$$ 718376219 720802426 723306119 725586534 727900982 730384350 732846022 735263884 737588048
3604G37588048K022207J946568K168596K211869K125978J941204J815439K097010K235055
$$ 737588048 739610255 741556823 743725419 745937288 748063266 750004470 751819909 753916919 756151974
3622.3G56151974J881778J263798J021266J767218K138316J840234J608134J477837
$$ 756151974 758033752 759297550 760318816 762086034 764224350 766064584 767672718 769150555
3638.7G69150555J385033J299441R90033M50254M71890J339435J594603J116515J067280
$$ 769150555 770535588 771835029 772825062 773275316 773747206 775086641 776681244 777797759 778865039
3657G78865039J330436J111090P92920O39558K41637j20937K75313L48390p4983N00679
$$ 778865039 780195475 781306565 782099485 782739043 782980680 782859743 783135056 783483446 783408463 783909142
3677.4G83909142J068354Q91804O73533M25041j79j83523K68757O21617M58241J72317
$$ 783909142 784977496 785869300 786542833 786967874 786967695 786784172 787052929 787674546 788132787 788305104
3697.8G88305104n6982j28866J54198K44975j71066o12556l82722L52562M81486N3823
$$ 788305104 788248122 788119256 788273454 788518429 788347363 787734807 787352085 787704647 788186133 788239956
3718.2G88239956l04401l57389k76745j24991P6890q9586n48899o64532j18434M38690
$$ 788239956 787935555 787578166 787301421 787176430 787253320 787163734 786614835 785950303 785831869 786270559
3738.6G86270559K10404o55591r11474l8147k6703m77076R3579N23627J20580k28464
$$ 786270559 786480963 785825372 784913898 784875751 784849048 784371972 784465551 784989178 785109758 784881294
3759G84881294o676J24037j16706l06546l32415r6500J26958K1159j95682k90513j53899
$$ 784881294 784874618 784998655 784881949 784575403 784242988 784146488 784273446 784294605 784098923 783808410 783654511
3781.4G83654511p6175j38342p9453J2874n1260l30567n52118m89771o56188n93423
$$ 783654511 783578336 783439994 783360541 783373415 783322155 782991588 782439470 781949699 781293511 780700088
3801.8G80700088J37329J71542N305K87771J50680m48703p09176m34638n53846l84867
$$ 780700088 780837417 781008959 781014264 781302035 781452715 781004012 780294836 779860198 779306352 778921485
3822.2G78921485K39551K05517m4167k26975k76744j77026m82380p30396k16305K25187
$$ 778921485 779161036 779366553 779322386 779095411 778818667 778641641 778159261 777428865 777212560 777437747
3842.6G77437747L13639K88248P868p92026j726032p77423O99282M64201k66791o25253
$$ 777437747 777751386 778039634 778047502 777255476 775529444 774752021 775451303 775915504 775648713 775023460
3863G75023460m44710l14295o36399n06222p272J62125P8082k44737j27196J88172
$$ 775023460 774578750 774264455 773628056 773121834 773114562 773276687 773354769 773110032 772982836 773171008
3883.4G73171008O4790R3579K146j81377J66774L00765k37465p05898o51896l00169
$$ 773171008 773235798 773329377 773331523 773150146 773316920 773617685 773380220 772674322 772022426 771722257
3903.8G71722257J92702M09603J84536o2287k50280m84466m73261k17378j71781k81036
$$ 771722257 771914959 772324562 772509098 772446811 772196531 771712065 771238804 771021426 770849645 770568609
3924.2G70568609k33710k22742l65257l43621j65641j67847l25799m77910n06699l30568
$$ 770568609 770334899 770112157 769746900 769403279 769237638 769069791 768743992 768266082 767759383 767428815
3944.6G67428815k13503k25902j52350m9531l576K7895K3186m8339r7812r3460j02699
$$ 767428815 767215312 766989410 766837060 766787529 766783953 766811848 766835034 766786695 766688883 766595423 766492724
3967G66492724j08838j17421j28746q0824q3625k15709k88368k50279k58863l44098
$$ 766492724 766383886 766266465 766137719 766056895 765973270 765757561 765469193 765218914 764960051 764615953
3987.4G64615953l84927l10778k17915j54436p5161
$$ 764615953 764231026 763920248 763702333 763547897 763472736
3997.6G63472736
$$ 763472736
##END=$$ End of the data block
