##TITLE=Equacia $$ Begin of the data block
##JCAMP-DX=5.00 $$ ACD/SpecManager v 10.08
##SPECTROMETER/DATA SYSTEM=Alpha
##DATE=19 Feb 2015 09:45:16
##DATA TYPE=INFRARED SPECTRUM
##DATA CLASS=XYDATA
##ORIGIN=
##OWNER=
##NPOINTS=1765
##FIRSTX=399.76428223
##LASTX=3997.64306641
##MAXX=3997.64306641
##MINX=399.76428223
##MAXY=0.76780200
##MINY=0.44001555
##XFACTOR=1.0000000000
##YFACTOR=1.000000000000000e-9
##FIRSTY=0.50860119
##DELTAX=2.03961372
##XUNITS=1/CM
##YUNITS=ARBITRARY UNITS
##XYDATA=(X++(Y..Y))
399.8E08601189k77996M92513O85215K10404k6107J40846J42038l33428n90742n9426
420.2E08984506J69695j54019j56343L6657r9957k70009j431M92394P05779N51939
440.6E10259211M47929N52654M58598K95401L89099M68969L36886K67982M39823N32568
461E14449120M36246L43204K93433J35184j0789J86145M26114K82824L4392O8068K16365
483.4E16860306P7606j49966n1498O3479j64092l59177k55824k43306l72588k65062
503.8E15139878r8288j60277l69191m40061l04699l59059n02705k80142M17n3704k33471
526.2E12338698j36316J06633M4703j25467L6299K73287J07288k07007j12056K08020
546.6E12534082J94848n305J29699M77493M58539K56538N61834R72688Q06272M22120
$$ plain form
399.8 508601189 508323193 508815706 509500921 509711325 509685218 509826064 509968102 509634674 509043932 508984506
420.2 508984506 509154201 509000182 508843839 508880496 508780539 508510530 508509099 509001493 509707272 510259211
440.6 510259211 510707140 511259794 511718392 512013793 512402892 512871861 513208747 513476729 513916552 514449120
461 514449120 514885366 515228570 515522003 515657187 515646398 515832543 516258657 516541481 516575873 516643941 516860306
483.4 516860306 516937912 516787946 516736448 516799927 516635835 516276658 516020834 515777528 515404940 515139878
503.8 515139878 515041590 514881313 514512122 514072061 513767362 513408303 512905598 512625456 512625873 512572169 512338698
526.2 512338698 512202382 512309015 512353718 512228251 512264550 512537837 512645125 512438118 512326062 512534082
546.6 512534082 512728930 512723625 512853324 513330817 513789356 514045894 514607728 515580416 516386688 516808808
567E16808808L92616N49793L91900P0394J52468M88699M69625K75194L23534M10259
587.4E20333290K48671N36O4612K93433J51336j01924J09613M22776L16501P7486J78993
609.8E22095323M63783M90725L59416O54638J328409J668215J592874J560033J674711
628.2E31888127J608312J350403J324892J481414J354993J073718R92357J045168R21428
646.6E43040812O26802N56529O56724N92232M55022M96029P09057Q51631O19233L94404
667E48998475J137316J762092J552046J421511J527429J652479J519263J144945Q30472
685.3E61546028P12156N18143J93238M5598N5909p2658k80023k33471Q6486K02716
705.7E62774122N7280K02834P09057J012087J036227J355290K062142K593696K631486
$$ plain form
567 516808808 517201424 517751217 518143117 518213511 518365979 518854678 519324303 519599497 519923031 520333290
587.4 520333290 520581961 520582497 520647109 520940542 521091878 520989954 521099567 521522343 521838844 521916330 522095323
609.8 522095323 522559106 523049831 523409247 524063885 525392294 527060509 528653383 530213416 531888127
628.2 531888127 533496439 534846842 536171734 537653148 539008141 540081859 541074216 542119384 543040812
646.6 543040812 543667614 544224143 544880867 545473099 545928121 546424150 547133207 547984838 548604071 548998475
667 548998475 550135791 551897883 553449929 554871440 556398869 558051348 559570611 560715556 561546028
685.3 561546028 562258184 562776327 562969565 563015163 563071072 562998414 562718391 562484920 562571406 562774122
705.7 562774122 562831402 563034236 563743293 564755380 565791607 567146897 569209039 571802735 574434221
724.1E74434221K600193K784490K773106K289236J782000J613498J425385R80139O26981
742.4E91309249O75202P29501L66330q642n126o6340n51820r78291r53615r38356j260400
764.9E88317692j434684j042068l80694L9517M42148J227379J992583K203345K106249
783.2E93471467K235413K385020K110660J724482J726568J765251J240671M47273P0631
801.6F07177436L8624o5982j3471N99742J480281K027572K355456K861500L128171
819.9F19589329K528846J377821K76804q47042k150356l140927l206610k486289j497507
838.3F10444069l16262J092970K165973K297223J686036R63808L14235n05745j358211
856.6F16784096j801014j923859k180040k573729k748608k701521k781153k926469
$$ plain form
724.1 574434221 577034414 579818904 582592010 584881246 586663246 588276744 589702129 590682268 591309249
742.4 591309249 591984451 592713952 593080282 593071640 593066514 593000174 592448354 591470063 590516448 589578092 588317692
764.9 588317692 586883008 585840940 585460246 585499763 585941911 587169290 589161873 591365218 593471467
783.2 593471467 595706880 598091900 600202560 601927042 603653610 605418861 606659532 607106805 607177436
801.6 607177436 607216060 607150078 607136607 607736349 609216630 611244202 613599658 616461158 619589329
819.9 619589329 622118175 623495996 623772800 622925758 620775402 617634475 614427865 611941576 610444069
838.3 610444069 610127807 611220777 613386750 615683973 617370009 618333817 618648052 618142307 616784096
856.6 616784096 614983082 613059223 610879183 608305454 605556846 602855325 600074172 597147703
873E97147703k743661k355099k183258k106250j752496j316964j222134j334190j264811
891.3E80868840j097262j081288j032650o87540l08752k90870m31180l21448j33276
909.7E75484574k44975n29766p68781j177073j914024k604842k903998l050923l317654
928E58972538l478110l348053l242433l399014l564000l437877l190160l115594l042877
946.4E29154420k762973k550245k653420k775669k642393k481818k451062k312541
962.7E08524299j946032j616598j520276j476705j329720j259356j387507j484782
979D96503323j346886j140803j113117j132756r89884q53598r19134j021683r60052
997.4D87025410q44419q69453r34094q79526q41558r05902q85814p09295n42313m78536
$$ plain form
873 597147703 594404042 592048943 589865685 587759435 586006939 584689975 583467841 582133651 580868840
891.3 580868840 579771578 578690290 577657640 576970100 576661348 576370478 575939298 575617850 575484574
909.7 575484574 575239599 574709833 573941052 572763979 570849955 568245113 565341115 562290192 558972538
928 558972538 555494428 552146375 548903942 545504928 541940928 538503051 535312891 532197297 529154420
946.4 529154420 526391447 523841202 521187782 518412113 515769720 513287902 510836840 508524299
962.7 508524299 506578267 504961669 503441393 501964688 500634968 499375612 497988105 496503323
979 496503323 495156437 494015634 492902517 491769761 490779877 489926279 489007145 487985462 487025410
997.4 487025410 486180991 485311538 484377444 483497918 482656360 481750458 480864644 480155349 479613036 479134500
1017.8D79134500m36813l33637k77966l44306l53962k22117o6370K6942J05738J98811
1038.2D77430820J85729O169j93149k72513k76208l13401l34471k45631j14858k2233
1058.6D75850254P8529K56807M18872M46796M06355M22388M90487N36322O27250Q19623
1079D80353683J000166J089484J160472J253605J303435J299291J324922J417488J497984
1097.3D91700530J493663J397252J243025J063615Q87692P38561O10888N42969N71489
1115.7E00249684O43730O99878P16984P37011Q06809Q69036Q68737P74324N98312M00245
1136.1E07364750J93715L6538Q464M7802R2149K24769M58539O42896P10785P92742
1156.5E10573149R28163R80199R52422J054645J356363J638830J781404J928508K199233
$$ plain form
1017.8 479134500 478697687 478364050 478086084 477741778 477387816 477165699 477099329 477126271 477232009 477430820
1038.2 477430820 477616549 477622718 477429569 477157056 476880848 476567447 476232976 475987345 475872487 475850254
1058.6 475850254 475928783 476185590 476604462 477051258 477457613 477880001 478370488 478906810 479534060 480353683
1079 480353683 481353849 482443333 483603805 484857410 486160845 487460136 488785058 490202546 491700530
1097.3 491700530 493194193 494591445 495834470 496898085 497785777 498524338 499135226 499678195 500249684
1115.7 500249684 500893414 501593292 502310276 503047287 503854096 504723132 505591869 506366193 506964505 507364750
1136.1 507364750 507558465 507595003 507603467 507651269 507743418 507968187 508426726 509069622 509780407 510573149
1156.5 510573149 511501312 512481511 513433933 514488578 515844941 517483771 519265175 521193683 523392916
1174.8E23392916K462029K570093K699196L001154L259897L289699L232360L225386
1191.1E47132730L092707K694666K246499J946688J699507J360655J063645J026690
1207.5E62263787J090050R88185Q17716P86066TO18696M23670M16219M48704K85864
1227.9E68925023O7294O3240J53244N4359j15692o5744R7096O0260o8188L1710K20537
1250.3E69423139J52528o2346o7234J36852K86937L93033O99282J072943J109779Q94189
1270.7E74039102Q42273R17733P53879L83318K21669L17753K70545K6286n7698K7478
1291.1E77742338o7234l12328l33846j35064j17719l41833m39465l55840m08470o29306
1311.5E74601233o52015l91364k21074k00152k8611K54333K83540q822k52247k78771
$$ plain form
1174.8 523392916 525854945 528425038 531124234 534125388 537385285 540674984 543907344 547132730
1191.1 547132730 550225437 552920103 555166602 557113290 558812797 560173452 561237097 562263787
1207.5 562263787 563353837 564342022 565159738 565945804 566731870 567350566 567774236 568190455 568639159 568925023
1227.9 568925023 568992317 569055557 569208801 569263160 569147468 569081724 569178820 569239080 569170892 569202602 569423139
1250.3 569423139 569575667 569513321 569446087 569582939 569869876 570262909 570962191 572035134 573144913 574039102
1270.7 574039102 574881375 575799108 576552987 576936305 577157974 577475727 577746272 577772558 577714860 577742338
1291.1 577742338 577675104 577362776 577028930 576893866 576776147 576434314 575994849 575639009 575230539 574601233
1311.5 574601233 573949218 573557854 573336780 573136628 573108017 573362350 573645890 573637068 573384821 573106050
1331.9E73106050l82661o75857p43151l15428Q5175L5226m6014J11818J70410p5698
1352.3E71269870k88367k39134k97606o73771q86083o44207n71728q58366r82463p98822
1372.7E65029323m61280k24889k11119k25723r0122L43084R74178J252950Q55446J64389
1393.1E67406237k93374k59578j42038k84255n89191o72997n39958o41644q46446q18014
1413.5E62318742p51495q70109p97748l97384j73927j40786j99437j10388K41459L56793
1433.9E59475720L75748Q36670J135170R70781O42062M26113M95494N38468K50876
1452.2E65147102o1274P4745R04142J288832J130342J357615J817942J780748J684189
1470.6E75124383K346992L092945L131092L009855L089250L234386L031552K824366
$$ plain form
1331.9 573106050 572723389 572047532 571304381 570988953 571074128 571109354 571063340 571175158 571345568 571269870
1352.3 571269870 570981503 570742369 570444763 569770992 568884909 568240702 567668974 566810608 565828145 565029323
1372.7 565029323 564568043 564343154 564132035 563906312 563816190 564159274 565133452 566386402 567241848 567406237
1393.1 567406237 567112863 566853285 566711247 566426992 565837801 565164804 564624846 563983202 563136756 562318742
1413.5 562318742 561567247 560697138 559899390 559502006 559328079 559187293 558987856 558877468 559118927 559475720
1433.9 559475720 559851468 560688138 561823308 562794089 563436151 563862264 564357758 564896226 565147102
1452.2 565147102 565085828 565160573 566064715 567353547 568483889 569841504 571659446 573440194 575124383
1470.6 575124383 577471375 580564320 583695412 586705267 589794517 593028903 596060455 598884821
1486.9E98884821L170013L655315L177166K577960K794683L053904K605855J822889
1503.2F21742606J433909K177537K665162K252042J926661J717865J642168J505851
1519.5F37063801J687765J912952J656294J508713J353740J069844J014888R13918
1535.8F48181915M41075L02016P46489R28819Q11517M51565M0472k18690m68373q43942
1556.2F50372863j317740r31143m49539j066029j834213k571524l061354k981007l697395
1574.6F32462919n077422m872322m553974n152464n528152n548834n449951n353928
1590.9E90925872n164623m809678m339098l965021l676831l238500k746760k441407
1607.2E60543954k188503j814425j561642j563549j250565m79460k41041k26319k4676
$$ plain form
1486.9 598884821 602054834 605710149 608887315 611465275 614259958 617313862 619919717 621742606
1503.2 621742606 623176515 625354052 628019214 630271256 632197917 633915782 635557950 637063801
1519.5 637063801 638751566 640664518 642320812 643829525 645183265 646253109 647267997 648181915
1535.8 648181915 648622990 648925006 649671495 650600314 651411831 651863396 651903868 651685178 651216805 650372863
1556.2 650372863 649055123 648123980 647674441 646608412 644774199 642202675 639141321 636160314 632462919
1574.6 632462919 627385497 622513175 617959201 612806737 607278585 601729751 596279800 590925872
1590.9 590925872 585761249 580951571 576612473 572647452 568970621 565732121 562985361 560543954
1607.2 560543954 558355451 556541026 554979384 553415835 552165270 551685810 551444769 551218450 551193774
1625.6E51193774J63257L41952M06801M57645J070261J787126J750290J597286J503646
1643.9E60272038J805842K371311K041578K097309L460467L240764K493501K439677
1660.3E80222487K723694K849758K432346K424300K951324K853811K843916L219009
1676.6F02520645K943575K393425K415716L564954L763437L005445K831459K470672
1692.9F25909328K207160K180875K149105K626777K326667J645684J564980J414895
1709.2F42025471R49561M22895J47939M93050J028418R76801Q20816R18448R03129
1727.6F48686528P83026P99478J369535K090276J889288J892507K275288K336562K239943
1745.9F64362431K346038K889514L354669L003716K701998K761603K530872K400220
$$ plain form
1625.6 551193774 551357031 551698983 552105784 552563429 553633690 555420816 557171106 558768392 560272038
1643.9 560272038 562077880 564449191 566490769 568588078 572048545 575289309 577782810 580222487
1660.3 580222487 582946181 585795939 588228285 590652585 593603909 596457720 599301636 602520645
1676.6 602520645 605464220 607857645 610273361 613838315 617601752 620607197 623438656 625909328
1692.9 625909328 628116488 630297363 632446468 635073245 637399912 639045596 640610576 642025471
1709.2 642025471 642975032 643397927 643545866 644038916 645067334 646044135 646864951 647783399 648686528
1727.6 648686528 649469554 650269032 651638567 653728843 655618131 657510638 659785926 662122488 664362431
1745.9 664362431 666708469 669597983 672952652 675956368 678658366 681419969 683950841 686351061
1762.2F86351061K376735K077818J714468J472414J707375K097010J864970J441121
1778.6G01102972J383781J528323J470328J289188J108885J021087J227141J347482
1794.9G11479187J216114J123190J093149J109659J149416J119256R22621P92563R36687
1813.2G20941842J042068Q95083P32898O97315O69420O27160N40495N93841R28581
1831.6G27668703R40322O14107N78761O80983M22836J89662N73873R41456Q09311N54443
1852G33974457N18739O28471N79417M40419M56214N08189L05891J77622N76317Q91626
1872.4G39057362O80208L70682L60846M85480M40001L15845K90752L25262L73781L50118
1892.8G43050337L39866M46498M14431K71857K77936L56019K75910J68383K78175L76761
$$ plain form
1762.2 686351061 688727796 690805614 692520082 693992496 695699871 697796881 699661851 701102972
1778.6 701102972 702486753 704015076 705485404 706774592 707883477 708904564 710131705 711479187
1794.9 711479187 712695301 713818491 714911640 716021299 717170715 718289971 719212592 720005155 720941842
1813.2 720941842 721983910 722878993 723611891 724309206 724978626 725605786 726146281 726740122 727668703
1831.6 727668703 728609025 729223132 729801893 730482876 730905712 731095374 731669247 732610703 733420014 733974457
1852 733974457 734493196 735121667 735701084 736141503 736597717 737105906 737411797 737589419 738165736 739057362
1872.4 739057362 739737570 740108252 740469098 740954578 741394579 741710424 742001176 742326438 742700219 743050337
1892.8 743050337 743390203 743836701 744251132 744522989 744800925 745156944 745432854 745601237 745879412 746256173
1913.2G46256173J91629J4603J89364L24726K36690K25067K83420K63751J35183N2690
1933.6G48173296J20879J71244K4319r9719J07944L07977J71244K8074R2924J45375
1954G49243557M5300j0192R8466J43171k861r6858O9201J96696N2392n9426N2333J34468
1978.5G49866247J5855o4194L1292O9440r4533j82569L3021K03013L4869j16050Q94
2000.9G49797285P0452q4817j94192p8380J5080j25647k83062k35975k28167m73141
2021.3G48179436p28011n30243J28448L80456O9380l8564K5630j25587k79308j46925
2041.7G46934712K7776o2883k02060j07467L6359k7299j26720j9908J13190J7345j14918
2064.1G46468127p212J43051O5207m6074L5584J57833J10388J0848O7591J57297O6757
$$ plain form
1913.2 746256173 746447802 746462405 746651769 746976495 747213185 747438252 747721672 747985423 748120606 748173296
1933.6 748173296 748294175 748465419 748489738 748390019 748497963 748805940 748977184 749005258 749098182 749243557
1954 749243557 749288857 749278665 749377131 749520302 749517441 749420583 749489784 749686480 749738872 749679446 749731779 749866247
1978.5 749866247 749882102 749817908 749849200 749918640 749824107 749641538 749674559 749877572 749912441 749796391 749797285
2000.9 749797285 749867737 749782920 749588728 749510348 749525428 749399781 749116719 748880744 748652577 748179436
2021.3 748179436 747451425 746921182 747049630 747430086 747499466 747460902 747486532 747360945 747081637 746934712
2041.7 746934712 746962488 746899605 746697545 746590078 746626437 746599138 746472418 746452510 746565700 746583045 746468127
2064.1 746468127 746460915 746603966 746669173 746623099 746658683 746816516 746926904 746937752 747005343 747162640 747229397
2086.6G47229397o3300J2994J44362O8188q7201m2081R1552L6300p8738k3723P6831
2109G47364581K3186q1539m6313M9353J8775n0426O0O5148K1458l0101K5988R9420
2133.5G47459590O6221J9133R3699J89841J60813R8944J50919K37763K15113J53541
2153.9G48845577J78516K50757K66373K31862K53916L25978L17692K91110L76820M55022
2174.3G51793623L92258K95401L13937L88742L86000L31640L30448L71516L62873L04937
2194.6G55271375K94864L50297L52084K86580K82466L44396L42548K71260K69473L34322
2215G58399665L33369K59876K33651K88188L34680L23475L07619L26812L19720K57075
2235.4G61384130K40683L11911L41475K79308K54929L03864L12984K41220J92583K40922
$$ plain form
2086.6 747229397 747166097 747179091 747323453 747391641 747304440 747262359 747353911 747390211 747311473 747287750 747364581
2109 747364581 747387767 747306228 747259915 747309268 747328043 747277617 747277677 747342825 747364283 747334182 747360170 747459590
2133.5 747459590 747525811 747544944 747638643 747828484 747989297 748088241 748239160 748476923 748692036 748845577
2153.9 748845577 749024093 749274850 749541223 749773085 750027001 750352979 750670671 750961781 751338601 751793623
2174.3 751793623 752185881 752481282 752795219 753183961 753569961 753901601 754232049 754603565 754966438 755271375
2194.6 755271375 755566239 755916536 756268620 756555200 756837666 757182062 757524610 757795870 758065343 758399665
2215 758399665 758733034 758992910 759226561 759514749 759849429 760172904 760480523 760807335 761127055 761384130
2235.4 761384130 761624813 761936724 762278199 762557507 762812436 763116300 763429284 763670504 763863087 764104009
2255.8G64104009K79069K31146K00868K36869K57850K13980J90795K54810K85208K14577
2276.2G66469181J59919J93655K20895J47343P5817J05202J20878P8559O9082Q0705
2296.6G67721236O6280J4484m6849n9784o0081j11520j62960j35839q9705j54554k75791
2319.1G66704917k82407j68562j03533j53601j86026j19329o2704j40846k40802j72973
2339.5G65074134l3140N4180K46048L19362j6749m68194o80745n70536l66687k61784
2359.9G63295889j63615Q0466L21508L48985L23594L87788M08053L66807L51369L43800
2380.2G66064644K90990J80602K2232j07526j34469j36733j93119k42054k41637k26617
2400.6G65276313k43366k79546k85208k83241l03745l13163l05891l11315l37363l66330
$$ plain form
2255.8 764104009 764383078 764614224 764815092 765051961 765309811 765523791 765714586 765969396 766254604 766469181
2276.2 766469181 766629100 766822755 767043650 767190993 767266810 767372012 767492890 767571449 767640531 767721236
2296.6 767721236 767787516 767802000 767755151 767695367 767635286 767523766 767360806 767224967 767135262 766980708 766704917
2319.1 766704917 766422510 766253948 766150415 765996814 765810788 765691459 765628755 765487909 765247107 765074134
2339.5 765074134 765040994 765095174 765341222 765660584 765643835 765175641 764494896 763924360 763557673 763295889
2359.9 763295889 763132274 763212740 763534248 763883233 764206827 764594615 765002668 765369475 765720844 766064644
2380.2 766064644 766355634 766536236 766558468 766450942 766316473 766179740 765986621 765744567 765502930 765276313
2400.6 765276313 765032947 764753401 764468193 764184952 763881207 763568044 763262153 762950838 762613475 762247145
2421G62247145l75509l62158l71218m06146m05490l85225m07517m40061m33087m03583
2441.4G58257151m04716m45545m58777m26948m28676m83275m95374m42922m15087m57763
2461.8G53798068m93408m53293m30167m73261m85599m50313m59909n15402n16772m56691
2482.2G49063253m26292m44233m73142m88937m85420m81487m75466m59492m42386m44948
2502.6G44441450m69387m74453m35650m09007m25876m23073l94941l84152l83555l67523
2523G40273833l55899l83437m05967l71993l41057l58701l63231l50296l53813l49582
2543.4G36639857l18110k89440l04043l30448l25740l20434l54946l79741l36111k84254
2563.8G33396590k95758l34621l44396l50594l86417m10438l89039l78370m39883n08368
$$ plain form
2421 762247145 761871636 761509478 761138260 760732114 760326624 759941399 759533882 759093821 758660734 758257151
2441.4 758257151 757852435 757406890 756948113 756521165 756092489 755609214 755113840 754670918 754255831 753798068
2461.8 753798068 753304660 752851367 752421200 751947939 751462340 751012027 750552118 750036716 749519944 749063253
2482.2 749063253 748636961 748192728 747719586 747230649 746745229 746263742 745788276 745328784 744886398 744441450
2502.6 744441450 743972063 743497610 743061960 742652953 742227077 741804004 741409063 741024911 740641356 740273833
2523 740273833 739917934 739534497 739128530 738756537 738415480 738056779 737693548 737343252 736989439 736639857
2543.4 736639857 736321747 736032307 735728264 735397816 735072076 734751642 734396696 734016955 733680844 733396590
2563.8 733396590 733100832 732766211 732421815 732071221 731684804 731274366 730885327 730506957 730067074 729558706
2584.2G29558706n01215m72009m81964n13434n37395n54860n75841n79833n66721n73814
2604.6G24201620o15597o54042o61492o66142p01904p30574p15912p22646p69496q06749
2625G17157066q17418q01027q00848q21948q07405p99298q69572r33468q96633q54611
2645.4G08754838q91567r21130q60333p96855q54134r26614q52227p44939p56860q10266
2665.8G00339913q04603p54475p33555p67827p54177o87480o95706p37190o99997o48975
2686.2F93055928o56247o72758o60598o27101o17385o36220o16490n81742n99801o32704
2706.6F86754882o38961o26922o00457n76020n67138n67972n67019n61476n47052n21421
2727F80980444n04851n13077n23329m86553m55141m96387n17369m71711m31776m24683
$$ plain form
2584.2 729558706 729057491 728585482 728103518 727590084 727052689 726497829 725921988 725342155 724775434 724201620
2604.6 724201620 723586023 722931981 722270489 721604347 720902443 720171869 719455957 718733311 717963815 717157066
2625 717157066 716339648 715538621 714737773 713915825 713108420 712309122 711439550 710506082 709609449 708754838
2645.4 708754838 707863271 706942141 706081808 705284953 704430819 703504205 702651978 701907039 701150179 700339913
2665.8 700339913 699535310 698780835 698047280 697279453 696525276 695837796 695142090 694404900 693704903 693055928
2686.2 693055928 692399681 691726923 691066325 690439224 689821839 689185619 688569129 687987387 687387586 686754882
2706.6 686754882 686115921 685488999 684888542 684312522 683745384 683177412 682610393 682048917 681501865 680980444
2727 680980444 680475593 679962516 679439187 678952634 678497493 678001106 677483737 677012026 676580250 676155567
2747.4F76155567m48763n09501n70953n79297n73576n95212n89788n75065o24240o82413
2767.8F70406759o66857o30856o59704p29203p77900p86782p79986p95603q07762q13305
2788.2F62958801q69096r21607r09507r01341r54569j030147j067102j090765j138508
2806.5F54076159j169920j179278j221537j303137j346171j344800j377284j445115
2822.8F43688917j502573j543105j579583j607895j615226j593530j585603j669049
2839.1F30992353j758039j720607j675010j749158j819134j755416j650453j614868
2855.5F17249668j590252j557589j587629j651287j664818j606404j506389j403689
2871.8F04681611j336038j262426j119793r93729r34958q70228q10027p82013p39992
$$ plain form
2747.4 676155567 675706804 675197303 674626350 674047053 673473477 672878265 672288477 671713412 671089172 670406759
2767.8 670406759 669739902 669109046 668449342 667720139 666942239 666155457 665375471 664579868 663772106 662958801
2788.2 662958801 662089705 661168098 660258591 659357250 658402681 657372534 656305432 655214667 654076159
2806.5 654076159 652906239 651726961 650505424 649202287 647856116 646511316 645134032 643688917
2822.8 643688917 642186344 640643239 639063656 637455761 635840535 634247005 632661402 630992353
2839.1 630992353 629234314 627513707 625838697 624089539 622270405 620514989 618864536 617249668
2855.5 617249668 615659416 614101827 612514198 610862911 609198093 607591689 606085300 604681611
2871.8 604681611 603345573 602083147 600963354 599969625 599034667 598164439 597354412 596572399 595832407
2890.1E95832407o35504n39661n68807o10053n14269m14491m62592n37455m79996l79383
2910.5E90690196m14134n36918n68152n12898m62830l50475j23382J13547K22981K29061
2930.9E88286996L37422N79119P41958Q49366J121879J428366J552760J583755J682520
2949.3E98164141J894355J999915J914858J924754K051711K036273J890123J845956
2965.6F13722086J896203J878857J841903J862109J808106J600683J392484J291990
2981.9F27294421J216293J116931J057327J095891J062691P89464N41091M54843L48925
3000.3F34977877J74582N007n7399m1962p6950k52664m85122n97596o89447q42392
3020.7F32113934q67784q13127q81612r29416q20756p37547q76606j066625r91583
$$ plain form
2890.1 595832407 595196903 594657242 594088435 593478382 592964113 592549622 592087030 591549575 591069579 590690196
2910.5 590690196 590276062 589739144 589170992 588658094 588195264 587844789 587721407 587834954 588057935 588286996
2930.9 588286996 588624418 589203537 589945495 590794861 591916740 593345106 594897866 596481621 598164141
2949.3 598164141 600058496 602058411 603973269 605898023 607949734 609986007 611876130 613722086
2965.6 613722086 615618289 617497146 619339049 621201158 623009264 624609947 626002431 627294421
2981.9 627294421 628510714 629627645 630684972 631780863 632843554 633633018 634174109 634628952 634977877
3000.3 634977877 635152459 635157466 635100067 635058105 634981155 634728491 634243369 633645773 632956326 632113934
3020.7 632113934 631246150 630433023 629551411 628621995 627801239 627063692 626187086 625120461 624128878
3039F24128878q31902r27031j151860j215994j082063j016974j156926j207054j108885
3057.4F14430189j123607j199782j138985r98378j027644j209914j226306j055122
3073.7F05450451r43541r69947j061081j118780j158833j223147j154900j017391j102388
3092.1E95700443j250029j148403r73641j001954j128018j109004r72748r48906j060248
3110.4E86107492j041114q53896q22067r88603j155376j250863j214445j079321r79841
3128.8E76721966r92059j067281j044870q83937q28206j019180j177311j095354r38416
3147.1E67675352q63254q44538r04024j031816j085043j050472r68039q94249r37342
3165.5E59096575j014292r91405r32097r24945r46402r39608r04500r37045j011849
$$ plain form
3039 624128878 623296976 622369945 621218085 620002091 618920028 617903054 616746128 615539074 614430189
3057.4 614430189 613306582 612106800 610967815 609969437 608941793 607731879 606505573 605450451
3073.7 605450451 604506910 603536963 602475882 601357102 600198269 598975122 597820222 596802831 595700443
3092.1 595700443 594450414 593302011 592328370 591326416 590198398 589089394 588116646 587167740 586107492
3110.4 586107492 585066378 584212482 583390415 582401812 581246436 579995573 578781128 577701807 576721966
3128.8 576721966 575729907 574662626 573617756 572733819 571905613 570886433 569709122 568613768 567675352
3147.1 567675352 566812098 565967560 565063536 564031720 562946677 561896205 560928166 560033917 559096575
3165.5 559096575 558082283 557090878 556158781 555233836 554287434 553347826 552443326 551506281 550494432
3183.8E50494432r70363q80182r10044r85264r74417r33290r41515r69588r63033r24408
3204.2E41042328r02176r05752q91924q67665q70526q91566q84593q48174q46028q88526
3224.6E32245398r01819q50498p70450p31528q28564r37700r02355q37445p84934o99639
3245E24000466o91533q09968q44180p26521o54579o87599p09593o72698o37651n99443
3265.4E16966701n11945m39703n19216o94931p53820o83546o30319o48677o54221n97238
3285.8E10833085n45741n31673n57303o31512p27534q13782q26776p14243n80668o36935
3306.2E04266918q89600j111507j164794j079381j000165j012207j017242r72331j011759
3324.6D95007932j177996j278252j239001j195431j165509j122952j175850j315177
$$ plain form
3183.8 550494432 549524069 548643887 547733843 546748579 545774162 544840872 543899357 542929769 541966736 541042328
3204.2 541042328 540140152 539234400 538342476 537474811 536604285 535712719 534828126 533979952 533133924 532245398
3224.6 532245398 531343579 530493081 529722631 528991103 528162539 527224839 526322484 525485039 524700105 524000466
3245 524000466 523308933 522498965 521654785 520928264 520273685 519586086 518876493 518203795 517566144 516966701
3265.4 516966701 516454756 516015053 515495837 514800906 514047086 513363540 512733221 512084544 511430323 510833085
3285.8 510833085 510287344 509755671 509198368 508566856 507839322 507025540 506198764 505484521 504903853 504266918
3306.2 504266918 503377318 502265811 501101017 500021636 499021471 498009264 496992022 496019691 495007932
3324.6 495007932 493829936 492551684 491312683 490117252 488951743 487828791 486652941 485337764
3340.9D85337764j402408j422822j349867j223802j306147j564949j658827j553387
3357.2D73855555j440167j426131j439899j345277j275390j427383j678347j701832
3373.5D62121129j467109j278370j251132j298755j277149j115173q75711o71417p47531
3391.9D52138782j041890j046925p15852n63592q29875j108677r76264p02232o17445
3410.2D44536030o46501p01041p07745o14286n04702m23521l18259j90347p6562n3913
3430.6D40299153m4763N0366J6809j60307j45704O2257K23935L03894L57241M21524
3451D41384405M71830M96447N44638O28769O34551O30200Q24452R91046P91878M60535
3471.4D47858751M40180O45280Q45551Q69573O79671O43939Q16047Q36492P55668Q19176
$$ plain form
3340.9 485337764 483935356 482512534 481162667 479938865 478632718 477067769 475408942 473855555
3357.2 473855555 472415388 470989257 469549358 468204081 466928691 465501308 463822961 462121129
3373.5 462121129 460654020 459375650 458124518 456825763 455548614 454433441 453557730 452886313 452138782
3391.9 452138782 451096892 450049967 449334115 448770523 447940648 446831971 445855707 445153475 444536030
3410.2 444536030 443889529 443188488 442480743 441866457 441361755 440938234 440619975 440429628 440353066 440299153
3430.6 440299153 440254390 440304756 440321565 440161258 440015554 440077811 440301746 440605640 440962881 441384405
3451 441384405 441856235 442352682 442897320 443526089 444160640 444790840 445615292 446606338 447398216 447858751
3471.4 447858751 448298931 448944211 449789762 450659335 451339006 451982945 452798992 453635484 454391152 455210328
3491.8D55210328R22740R38207Q74429Q53092R00447Q28445P31677Q48562J052707
3510.2D63160634J145363J065254R27806R36896J060843J179010J140892J004964J031518
3528.5D72653180J178563J274079J337499J307547J197993J285851J458913J418084
3544.8D83111709J247555J234085J339346J412928J469463J516283J552552J499533
3561.1D94383454J322151J283228J731038K211869K107024J871943J903058K007961
3577.5E08821726K109825K198697K125620J981080K074897K397359K452433K349377
3593.8E26511014K410113K566159K670527K682924K527237K321064K441824K699673
3610.1E46830535K747357K767622K703429K740621L092110L070474K601087K239227
$$ plain form
3491.8 455210328 456133068 457071275 457945704 458798796 459699243 460527688 461259365 462107927 463160634
3510.2 463160634 464305997 465371251 466299057 467235953 468296796 469475806 470616698 471621662 472653180
3528.5 472653180 473831743 475105822 476443321 477750868 478948861 480234712 481693625 483111709
3544.8 483111709 484359264 485593349 486932695 488345623 489815086 491331369 492883921 494383454
3561.1 494383454 495705605 496988833 498719871 500931740 503038764 504910707 506813765 508821726
3577.5 508821726 510931551 513130248 515255868 517236948 519311845 521709204 524161637 526511014
3593.8 526511014 528921127 531487286 534157813 536840737 539367974 541689038 544130862 546830535
3610.1 546830535 549577892 552345514 555048943 557789564 560881674 563952148 566553235 568792462
3626.4E68792462K577246L349125L311098L026783K949357K919436K861738K692520
3642.7E92479765K397538K264738K853036L566146L251671K844572L116727L255725
3659F16029918K868533K529443K344966K111911K067268K311409K136111K010465K483785
3677.4F36893809K622425K377093K065659J760721J623094J635790J752078J814127
3693.7F52544796J688064J451194J196921J149297J335918J259268Q78155O61135R96649
3712.1F63161397J504660J387298R61423P07328O34313O72280Q25048R60827P56383
3730.4F71570957L60310L24368Q81315J266658Q77619J33395O3240P67410O31690L18825
3750.8F77195787Q75235J143813P88152N50747P11620P44939N06639L72708L76046
$$ plain form
3626.4 568792462 571369708 574718833 578029931 581056714 584006071 586925507 589787245 592479765
3642.7 592479765 594877303 597142041 599995077 603561223 606812894 609657466 612774193 616029918
3659 616029918 618898451 621427894 623772860 625884771 627952039 630263448 632399559 634410024 636893809
3677.4 636893809 639516234 641893327 643958986 645719707 647342801 648978591 650730669 652544796
3693.7 652544796 654232860 655684054 656880975 658030272 659366190 660625458 661503613 662164748 663161397
3712.1 663161397 664666057 666053355 667014778 667722106 668356419 669028699 669853747 670814574 671570957
3730.4 671570957 671931267 672255635 673136950 674403608 675281227 675414622 675477862 676245272 676876962 677195787
3750.8 677195787 678071022 679214835 680002987 680553734 681265354 682010293 682516932 682889640 683265686
3769.2F83265686N85198P69377N99146L76761L72887M85420M46498L98159N10097N37276
3789.6F88346505M10974K59340J65820J60694K4557J09554O00218N31435M05193O46651
3810F91660941N45442P0989j73986Q8215J30772L29912P10726N66959L56555K16782
3830.4F94503307J20581J41263j6869o7889L44813O54041O87004N08546J30236m33444
3850.8F96571589q71063N6207J096011Q18133K21193o8665N7459J49608n7101Q3804
3871.2F98057175M21345N10514L97980l7730r2268K02477J55151K05576J53602j9312
3891.6F99954510K28405L32057p5936m11213l11791M6789N24879O82413L90768J21236
3912G01482117k5332j79171j44184P0095J17719J9372N3286O4314o8605l4750J33455
$$ plain form
3769.2 683265686 683850884 684620261 685219407 685596168 685969055 686454475 686900973 687299132 687809229 688346505
3789.6 688346505 688757479 689016819 689182639 689343333 689367890 689477444 690077662 690609097 691014290 691660941
3810 691660941 692206383 692277372 692103386 692191601 692322373 692652285 693363011 693929970 694286525 694503307
3830.4 694503307 694623888 694765151 694748282 694680393 695025206 695679247 696366251 696874797 697005033 696571589
3850.8 696571589 695700526 695756733 696852744 697670877 697892070 697823405 697880864 698030472 697973371 698057175
3871.2 698057175 698478520 698989034 699387014 699349284 699257016 699459493 699614644 699820220 699973822 699954510
3891.6 699954510 700182915 700514972 700439036 700027823 699716032 699762821 700287700 700970113 701360881 701482117
3912 701482117 701456785 701277614 701133430 701203525 701321244 701340616 701393902 701458216 701389611 701354861 701488316
3934.4G01488316J34111J7404p5757n9426P2241O9737k7239M4942J32441P7307J0133
3956.8G01884210O616j132R298O1929O2347K0623j6868k5034L6776P5817K3961J0669
3981.3G02149212M7386J9848m4345m2260K6107L5584k0862Q941
3997.6G02179611
$$ plain form
3934.4 701488316 701622427 701639831 701564074 701504648 701576889 701646626 701619387 701664329 701796770 701874077 701884210
3956.8 701884210 701890826 701889694 701898992 701960921 702023268 702043891 702027023 702001989 702038765 702114582 702138543 702149212
3981.3 702149212 702196598 702216446 702172101 702129841 702155948 702191532 702170670 702179611
3997.6 702179611
##END=$$ End of the data block
