##TITLE=Ekopro d menor que 1,0 $$ Begin of the data block
##JCAMP-DX=5.00 $$ ACD/SpecManager v 10.08
##SPECTROMETER/DATA SYSTEM=Alpha
##DATE=05 Nov 2014 10:34:16
##DATA TYPE=INFRARED SPECTRUM
##DATA CLASS=XYDATA
##ORIGIN=
##OWNER=
##NPOINTS=1765
##FIRSTX=399.76428223
##LASTX=3997.64306641
##MAXX=3997.64306641
##MINX=399.76428223
##MAXY=0.83252835
##MINY=0.05816353
##XFACTOR=1.0000000000
##YFACTOR=1.000000000000000e-9
##FIRSTY=0.75077707
##DELTAX=2.03961372
##XUNITS=1/CM
##YUNITS=ARBITRARY UNITS
##XYDATA=(X++(Y..Y))
399.8G50777066k726615m908323n433083m922151n032897n807161o273270n786240
$$ 750777066 748050451 743142128 737709045 732786894 727753997 721946836 715673566 709887326
416.1G09887326n763948n842328l867328j816333l66449R51648K556145L832161M331649
$$ 709887326 704123378 698281050 694413722 692597389 692230940 693182588 695738733 699570894 703902543
434.4G03902543M465520M180372M000008M099548L903627L812313L569961L217339
$$ 703902543 708368063 712548435 716548443 720647991 724551618 728363931 731933892 735151231
450.8G35151231L145218K410472J283407J8060j154125j829624k540707l431619m314959
$$ 735151231 738296449 740706921 741990328 742008388 740854263 739024639 736483932 733052313 728737354
469.1G28737354n090475n537391n432903n166769m985094m810572m820824n195498
$$ 728737354 723646879 718109488 712676585 707509816 702524722 697714150 692893326 687697828
485.4F87697828n564034o236851q021057j0403752j2029350j0787189n206347L029526
$$ 687697828 682133794 675896943 667875886 657472134 645442784 634655595 629449248 632478774
501.7F32478774R952545J3111591J3385236J0979832P194936M176497K589584K353728
$$ 632478774 642431319 655542910 668928146 679907978 687102914 691279411 693868995 696222723
518.1F96222723K831101L012121L186524L971576M727423N185009N677461O114066
$$ 696222723 699053824 702065945 705252469 709224045 713951468 719136477 724813938 730928004
534.4G30928004O398797O393611O329060O258786N917608N581379N451203N490124
$$ 730928004 737326801 743720412 750049472 756308258 762225866 767807245 773258448 778748572
550.7G78748572N443811N180002M939019M677952M107832L223241K459109K091705
$$ 778748572 784192383 789372385 794311404 798989356 803097188 806320429 808779538 810871243
567H10871243J920522J659274J520991J534760J161575P08342O50168N72502L41356
$$ 810871243 812791765 814451039 815972030 817506790 818668365 819376707 820026875 820599377 820940733
585.4H20940733J58668P867r3221j87219k58028l28183n03659o76871o47723n72682
$$ 820940733 821099401 821107268 821014047 820826828 820568800 820240617 819736958 819060087 818412364 817839682
605.8H17839682p28190r79245j115918r33230p30931p91014q04722j040935k035737
$$ 817839682 817111492 816132247 815016329 814083099 813352168 812561154 811756432 810715497 808679760
624.1H08679760m240513j0954023j8177509q823454J1771202J7164051Q285582J819551
$$ 808679760 804439247 793485224 775307715 766484261 778255463 795419514 803705096 805524647
640.4H05524647J6332m00424n56886r38416j821756k849460k478421l40819J039624
$$ 805524647 805540979 805140555 804583669 803645253 801823497 798974037 796495616 796154797 797194421
658.8G97194421M79818r05037k123714l712296n257368m608810n494535q445025j0394454
$$ 797194421 797674239 796769202 794645488 790933192 785675824 781067014 775572479 767127454 756733000
677.2G56733000q182049j823484M065871N720734L786385P47264k092600n216598j0038972
$$ 756733000 748550951 746727467 750793338 756514072 760300457 761047721 758955121 753738523 743699551
695.5G43699551j7256141k4410844k6547849k3099959j8754780j6002417j3293564
$$ 743699551 726443410 702032566 675484717 652384758 633629978 617627561 604333997
709.8F04333997j1648536j7916679l8047970p0382774j04361414j17462367r2145875
$$ 604333997 592685461 574768782 536720812 466338038 361976624 244514257 152368382
724.1A52368382m5642935r958327P135354J7551720L2701761N9615761R5492020J20904535
$$ 152368382 106725447 96767120 103902474 121454194 154155955 213771716 309263736 430168271
740.4D30168271J17245853Q9110136N7074428L3878922J9949556J1959135P364333
$$ 430168271 547414124 636524260 693598688 727477610 747427166 759386301 766750634
754.7G66750634M650354K810359J452744J94669j291871k642989l540635m077793m364252
$$ 766750634 771400988 774211347 775664091 775858760 774566889 771923900 768383265 764305472 759941220
773G59941220m761994n693256p332266j0059178j4337778k0564854k8268933l4741879
$$ 759941220 755179226 749485970 742153704 732094526 717756748 697191894 668922961 634181082
789.3F34181082l3218920j5811682J2723387L0173540K3417174P175804j394332k377569
$$ 634181082 600962162 585150480 597873867 628047407 651464581 658640385 657246053 654868484
805.6F54868484j281083k02417N90026J212537J660943J601994Q02934n89191k293170
$$ 654868484 653587401 653384984 653975010 655187547 656848490 658450484 659253418 658664227 656371057
824F56371057l950357n532444p369578r306669j0622919j0564148q730292n628288
$$ 656371057 652420700 646888256 639518678 630212009 619589090 609024942 600294650 594666362
840.3E94666362k556503n54383L24190P36296J182377J796604K372503K047419m88281
$$ 594666362 592109859 591555476 591879666 592615962 593798339 595594943 597967446 600014865 599526584
858.7E99526584o500304j6713559l0580521m5080066n4140359n0651431l2544941p047832
$$ 599526584 593026280 576312721 545732200 500652134 446511775 395860344 363315403 356267571
875C56267571J5197129K8290390L1960786K8939545K2880852J6446084J0493279N163252
$$ 356267571 371464700 399755090 431715876 460655421 483536273 499982357 510475636 515638888
891.3E15638888J282692L1292K004385P155478J4664710K2752404K9165328L2087385
$$ 515638888 516921580 516952872 518957257 526112735 540777445 563529849 592695177 624782562
907.6F24782562L0765355K6070177J9990802J4128506R243429N513847K774000R16779
$$ 624782562 655547917 681618094 701608896 715737402 724980831 730494678 733268678 734185457
923.9G34185457j07765m65453l30448N6327N28156J040280J467288J560509J168191
$$ 734185457 734077692 733612239 733281791 733338118 733866274 734906554 736373842 737934351 739102542
942.3G39102542M85897k57372r75073j650452k482295l684462n188763o949842r042680
$$ 739102542 739588439 739331067 738355994 736705542 734223247 730538785 725350022 718400180 709357500
960.7G09357500j1374473j3461352j4404356j3349891j0070622n252063k29895L661513
$$ 709357500 697983027 684521675 670117319 656767428 646696806 641444743 641214848 644876361
977F44876361N900025O854236P008791O505669N409896M003107K415836M53890j817406
$$ 644876361 650776386 657630622 664639413 671145082 676554978 680558085 682973921 683427811 681610405
995.3F81610405m222333p031560j0046065j3981342k2509754l7957370o0091138q8813245
$$ 681610405 677388072 670356512 660310447 646329105 623819351 585861981 525770843 436957598
1011.6D36957598j09903664r4479188m0179685K0138741N6743592N9653759L9923936
$$ 436957598 327053934 232574746 192395061 212533802 269277394 328931153 368855089
1025.9C68855089J7627776L449440l431648p166893r909659j1340469j0066748n273968
$$ 368855089 386482865 389932305 386500657 379333764 369424105 358083636 348016888 342742920
1042.2C42742920K520114J1823058K1040708K8876484L4172087L5741151L2630235
$$ 342742920 345263034 357086092 378126800 407003284 441175371 476916522 509546757
1056.5E09546757K5038719J4747918M193425n220711j3607741k2010743l1167508m0426671
$$ 509546757 534585476 549333394 553526819 548306108 534698367 512687624 481520116 441093445
1072.8D41093445m8055083n2379995n2412778m8115612m0882185l3063173k6440412
$$ 441093445 393038362 340658367 288245589 240129977 199247792 166184619 139744207
1087.1A39744207k1076560j6112573j1250891p025309l861487j519531L41393K038904
$$ 139744207 118667647 102555074 91304183 84278874 80417387 78897856 79239249 81278153
1103.4H1278153L792643N296044N340115L023132m89957k786361k720766r53518J524881
$$ 81278153 85070796 90366840 95706955 98730087 98240130 95453769 92733003 91779485 93304366
1121.8I3304366M091039O342627P841163Q418694Q515373Q968353J0427147J3246074
$$ 93304366 97395405 103738032 111579195 119997889 128513262 137481615 147908762 161154836
1138.1A61154836J7813892K4260521L1898692L9238944M4744552M7431409M6815604
$$ 161154836 178968728 203229249 235127941 274366885 319111437 366542846 413358450
1152.4D13358450M2677581L5569668K7017117J8471539J0067641N32627j0883033k1203935
$$ 413358450 456036031 491605699 518622816 537094355 547161996 547694623 536811590 515607655
1168.7E15607655k4310708j7167956l137946J1987955K4261236L1389892L1859815
$$ 515607655 491296947 474128991 470991045 482979000 507240236 538630128 570489943
1183E70489943K6329160J7735719R114743K114474k992510o471098q519888r452164
$$ 570489943 596819103 614554822 623669565 625784039 622791529 616320431 607800543 598348379
1199.3E98348379r873986j0352671j1050284j2038946j3558805j5917778j9324780
$$ 598348379 588474393 578121722 567071438 555032492 541473687 525555909 506231129
1213.6E06231129k3798734k9166430l4830689l9692969m2756319m3557822m2463705
$$ 506231129 482432395 453265965 418435276 378742307 335985988 292428166 249964461
1227.9B49964461m0534884l8084269l3929780k7025819j8500499j0865681n655534
$$ 249964461 209429577 171345308 137415528 110389709 91889210 81023529 75367995
1242.1G5367995k695129j240544n82047k58579j66245k78026m44345m66518l40775
$$ 75367995 72672866 71432322 70850275 70591696 70425451 70147425 69703080 69236562 68895787
1260.5F8895787j78650n4158J31957M09752P68021R70781Q42817N93178M02905L33965
$$ 68895787 68717137 68662979 68794936 69204688 69972709 70943490 71786307 72379485 72782390 73116355
1280.9G3116355L54722N24349R11944J552693K414391L796220O088972R423308J3235964
$$ 73116355 73471077 73995426 74907370 76460063 78874454 82670674 88759646 98182954 111418918
1299.2A11418918J6087070J7109036J7563239J9522473K2677079K5608122K7434752
$$ 111418918 127505988 144615024 162178263 181700736 204377815 229985937 257420689
1313.5B57420689K8082847K9305250L1838715L4059316L4835189L2574654K5231898
$$ 257420689 285503536 314808786 346647501 380706817 415542006 448116660 473348558
1327.8D73348558J2166887n902498k4470270l5362870l2047003j3992191J0342718
$$ 473348558 485515445 479612947 455142677 419779807 387732804 373740613 384083331
1342.1C84083331L0509382M2129159M3340951L6384285K5894403J5140355M518986
$$ 384083331 414592713 456721872 500062823 536447108 562341511 577481866 582000852
1356.4E82000852o988347k1700501m1169048n4241538n0812691l6924333j7053842
$$ 582000852 575012505 553312004 512142956 457901418 407088727 370164394 353110552
1370.6C53110552L101766J9355535K7511180K9298574K7490913K1068037J2140662
$$ 353110552 356212318 375567853 403079033 432377607 459868520 480936557 493077219
1384.9D93077219K671122o755084j3532102j8481165k3773462k7559578l2835424l9231211
$$ 493077219 495748341 488993257 475461155 456979990 433206528 405646950 372811526 333580315
1401.2C33580315m6367198n3685352m5112282j5727967K7008980O8873808R0107024
$$ 333580315 287213117 233527765 188415483 172687516 199696496 268570304 358677328
1415.5C58677328R3677461Q3237409M9839855K2503972O654620p873655k2292912l2454371
$$ 358677328 452354789 535592198 585432053 607936025 614590645 606716990 584424078 551969707
1431.8E51969707l4338951l4881562l0382335j7729074r088934n398362m325718n585313
$$ 551969707 517630756 482749194 452366859 434637785 425548851 420150489 415824771 410239458
1448.1D10239458o950319o014913j029491J2678265K9765248L0413390L1551390M0339470
$$ 410239458 403289139 397274226 396244735 408923000 438688248 469101638 500653028 540992498
1464.5E40992498M0060282K7674139K0173192J9095063J6412437J3450503J3220966
$$ 540992498 581052780 608726919 628900111 647995174 664407611 677858114 691079080
1478.7F91079080J3936102J3952971J2338281J0582924Q028626K757192l984571j3494551
$$ 691079080 705015182 718968153 731306434 741889358 749917984 752675176 748690605 735196054
1495G35196054l1726897n4892957o8928719o1235010k1693230N4404438P4171006M5592487
$$ 735196054 703469157 648576200 579647481 518412471 496719241 551123679 625294685 670887172
1511.4F70887172K8003752J5639902P487237K424300k90334j023710m888J704335L503204
$$ 670887172 698890924 714530826 722018063 724442363 724152029 723128319 723123431 724827766 728330970
1529.7G28330970N512833P508040O201982M137874L484547J739860k7120r68755j694739
$$ 728330970 733843803 741351843 747553825 751691699 755176246 756916106 756888986 755920231 754225492
1548.1G54225492k514243k819180k855182k796590m090667o447971n988180p232488
$$ 754225492 751711249 748892069 746036887 743240297 739149630 732701659 726713479 719480991
1564.4G19480991j0302007j6082764k5750160l0507803l6220371m0082872j2964189
$$ 719480991 709178984 693096220 667346060 636838257 600617886 560535014 547570825
1578.7E47570825K3394227M5468092M6232223L2174528J8206894J0108531N943417
$$ 547570825 570965052 616433144 662665367 694839895 713046789 723155320 729098737
1593G29098737K603770j261712n297899q932233j1942565j4178395j6000510j6783476
$$ 729098737 731702507 730440795 725142896 716210663 704268098 690089703 674089193 657305717
1609.3F57305717j4395415p423103M867852J7982065J6595483R194374M529953J110673
$$ 657305717 642910302 635487199 640355051 658337116 674932599 684126973 688656926 689767599
1625.6F89767599l29733q05497q82387o34313m84168o13392n67794p16626j035035
$$ 689767599 689437866 688632369 687749982 687115669 686631501 686018109 685450315 684733689 683698654
1643.9F83698654j597166k383053k041042k490342n385637o186366o749690r230435
$$ 683698654 682101488 679718435 677677393 675187051 669801414 663615048 656865358 647634923
1660.3F47634923j2948632j5142321j4055491j4915883j7273426j5771628j6467690
$$ 647634923 634686291 619543970 605488479 590572596 573299170 557527542 541059852
1674.5E41059852j9035578j7768324j5867859j4879554j5028984j2652099j1137217
$$ 541059852 522024274 504255950 488388091 473508537 458479553 445827454 434690237
1688.8D34690237j3719320j6719163k3443818l1774252l7520558m8407734m5868828
$$ 434690237 420970917 404251754 380807936 349033684 311513126 263105392 217236564
1703.1B17236564m2399958m2018980l2165572k1479897j2932256n426239J195416J303162
$$ 217236564 174836606 132817626 100652054 79172157 66239901 60813662 62009078 63312240
1719.4F3312240j897007j344368m95535n92775q19020J53623N008739N923010M684896
$$ 63312240 61415233 60070865 59575330 58982555 58163535 58317158 63325897 69248907 73933803
1737.8G3933803J3716213K7603790M0560663N3485930O3669681P1038723O5491736
$$ 73933803 87650016 115253806 155814469 209300399 272970080 344008803 409500539
1752D09500539M8710406M0149659L5824627K8975248K5395155K0171762J5359103J3723493
$$ 409500539 458210945 498360604 534185231 563160479 588555634 608727396 624086499 637809992
1768.4F37809992J2298405J1797905R905755P508755O871462O884873O316841N771219
$$ 637809992 650108397 661906302 671812057 679320812 686192274 693077147 699393988 705165207
1784.7G05165207N137682M397691M263639M328787L608048K952576K857924K696633
$$ 705165207 710302889 714700580 718964219 723293006 726901054 729853630 732711554 735408187
1801G35408187K304733J751363J388252J036644O47723K82467J17600J57177L55959
$$ 735408187 737712920 739464283 740852535 741889179 742536902 742819369 742936969 743094146 743450105
1819.4G43450105P91133J434385K218485K806783L598630M173935M237711M375279
$$ 743450105 744241238 745675623 747894108 750700891 754299521 758473456 762711167 767086446
1835.7G67086446M490912M364610M306972M762292M790783M284382M032194L797412
$$ 767086446 771577358 775941968 780248940 785011232 789802015 794086397 798118591 801916003
1852H01916003L375113K946556K581119K246261J857102J471817J206279R59277Q28565
$$ 801916003 805291116 808237672 810818791 813065052 814922154 816393971 817600250 818559527 819388092
1870.3H19388092P02679N40733L27170J11520j18136l01898m52995o78956r65179j175463
$$ 819388092 820090771 820631504 820958674 821070194 820952058 820650160 820197165 819518209 818553030 817377567
1890.7H17377567j171112j285255j372277j334787j351058j411558j425385j464665
$$ 817377567 816206455 814921200 813548923 812214136 810863078 809451520 808026135 806561470
1907.1H06561470j593173j652121j644790j684308j918853k077460k077520k214610
$$ 806561470 804968297 803316176 801671386 799987078 798068225 795990765 793913245 791698635
1923.4G91698635k364934k524078k812326l111362l457487l840387m137218m377484
$$ 791698635 789333701 786809623 783997297 780885935 777428448 773588061 769450843 765073359
1939.7G65073359m584730m324495l319562k138793r42111L14831J456261K399981L095150
$$ 765073359 760488629 756164134 752844572 750705779 749763668 750078499 751534760 753934741 757029891
1958.1G57029891L493428L630579L620147L503144L279746K953648K573669K194405
$$ 757029891 760523319 764153898 767774045 771277189 774556935 777510583 780084252 782278657
1974.4G82278657J908243J709163J513243J351177J272738J383662J651645J943946
$$ 782278657 784186900 785896063 787409306 788760483 790033221 791416883 793068528 795012474
1990.7G95012474K179980K312959K312958K222121K104640J956462J794517J647234
$$ 795012474 797192454 799505413 801818371 804040492 806145132 808101594 809896111 811543345
2007H11543345J552701J489640J394391J272321J185476J119256J039327R63389Q78811
$$ 811543345 813096046 814585686 815980077 817252398 818437874 819557130 820596457 821559846 822438657
2025.4H22438657P82013O94931O12139M89414L40641K19702J62840Q0943n6803j62422
$$ 822438657 823220670 823915601 824527740 825017154 825357795 825577497 825740337 825821280 825764477 825602055
2045.8H25602055k75851m36604n76734o67334p58350q43942r08494r90391j097977
$$ 825602055 825326204 824889600 824312866 823645532 822887182 822043240 821134746 820144355 819046378
2064.1H19046378j152933j143753j151502j188994j191079j094938r52601q46565p90179
$$ 819046378 817893445 816749692 815598190 814409196 813218117 812123179 811170578 810324013 809533834
2082.5H09533834p81416p59900o78182o16848o02186n56767m88818m59134m31299l44456
$$ 809533834 808752418 807992518 807314336 806697488 806095302 805538535 805049717 804590583 804159284 803814828
2102.9H03814828k33054j60753j19508n1141L0637O4016J17063K39492L40581L59416
$$ 803814828 803581774 803421021 803301513 803250372 803281009 803345025 803462088 803701580 804042161 804401577
2123.3H04401577L34858L46005L39091K56896K02060K47538L24667L58998L96312M67062
$$ 804401577 804736435 805082440 805421531 805678427 805880487 806128025 806452692 806811690 807208002 807675064
2143.7H07675064N25653O03437P49410Q74340R36389R94623J059234J110733J159191
$$ 807675064 808200717 808804154 809553564 810427904 811364293 812358916 813418150 814528883 815688074
2162H15688074J175880J112223J023292R39250Q50797P81298P23421O47009N62787
$$ 815688074 816863954 817976177 818999469 819938719 820789516 821570814 822294235 822941244 823504031
2180.4H23504031M53829L57748L57270L43382K50399J64867J13785J7524j63138l93927
$$ 823504031 823957860 824315608 824672878 825016260 825266659 825431526 825545311 825562835 825399697 825005770
2200.8H25005770o27399p41601o78062n11944k87474q0824n96Q166J8597l7253j61231
$$ 825005770 824378371 823636770 822958708 822446764 822159290 822078466 822077870 822086036 822104633 822067380 821906149
2223.2H21906149k66969l18110k89142k63870k98977k80201k23994k11358k37644k95639
$$ 821906149 821639180 821321070 821031928 820768058 820469081 820188880 819964886 819753528 819515884 819220245
2243.6H19220245l56555l63112l31163l20256l11553k07424j7345J48773K40922K04444
$$ 819220245 818863690 818500578 818169415 817849159 817537606 817330182 817312837 817461610 817702532 817906976
2264H17906976N2690j17361l39926o81877j030266j299560j460910j402557j065075
$$ 817906976 817959666 817842305 817502379 816820502 815790236 814490676 813029766 811627209 810562134
2282.3H10562134m66764K16543P60794J162946J500726J687050J645207J463771J232624
$$ 810562134 810095370 810311913 811072707 812235653 813736379 815423429 817068636 818532407 819765031
2300.7H19765031R85802P45594M87387J96696m0114j59979l04938o39855r75371j024365
$$ 819765031 820750833 821496427 821983814 822180510 822140396 821980417 821675479 821035624 820060253 819035888
2321.1H19035888p24435j83880K33233L06487K18570P7545j76310l71575m35234n41925
$$ 819035888 818311453 818127573 818360806 818667293 818885863 818963408 818787098 818415523 817980289 817438364
2341.5H17438364o43730n14567k22147l22103r87470j651943j760125j634836j532555
$$ 817438364 816794634 816280067 816057920 815735817 814748347 813096404 811336279 809701443 808168888
2359.9H08168888j424074j283050j038193p80046n65529m76837n08368m35591k66075
$$ 808168888 806744814 805461764 804423571 803643525 803077996 802601159 802092791 801657200 801391125
2378.2H01391125j56284r8407l6418M1067J43409K64704M02928N47766O63042P49410
$$ 801391125 801234841 801136434 801100016 801141083 801284492 801549196 801952124 802499890 803162932 803912342
2398.6H03912342Q37981R17495R42230R79721J028955R83775R28104R78231J065255
$$ 803912342 804750323 805667818 806610048 807589769 808618724 809602499 810530603 811508834 812574089
2417H12574089J124441J154959J120508J070082J085401J117587J078546R88781Q89421
$$ 812574089 813698530 814853489 815973997 817044079 818129480 819247067 820325613 821314394 822203815
2435.3H22203815P85768P09176O37710N62847M70280L60132K93731K32161J37031P7664
$$ 822203815 822989583 823698759 824336469 824899316 825369596 825729728 826023459 826255620 826392651 826470315
2455.7H26470315M7327k0087r1374j38819k13683l37005m42087m70639m96983n82338
$$ 826470315 826517642 826497555 826406181 826267362 826053679 825716674 825274587 824803948 824306965 823724627
2476.1H23724627o18815n81324n68330n99504o97315q36670r15766r14097q90076q53717
$$ 823724627 823105812 822524488 821956158 821356654 820659339 819822669 818906903 817992806 817102730 816249013
2496.5H16249013p86722p22706o57499n49257m86850n07653m58479l70920l72827l97682
$$ 816249013 815462291 814739585 814082086 813532829 813045979 812538326 812079847 811708927 811336100 810938418
2516.9H10938418l80755l51786l15964k74659k40445j62899k3425N5611N782m6134
$$ 810938418 810557663 810205877 809889913 809615254 809374809 809211910 809188485 809244096 809249878 809203744
2537.3H09203744m5776o0797r4652q0765l5166j0729K7656Q5473J29104J49608J45077
$$ 809203744 809157968 809097171 809002519 808921754 808886588 808875859 808903515 808988988 809118092 809267700 809412777
2559.7H09412777J13666J30892K10524K51412K20478J39713O7413M8697R3162K40207
$$ 809412777 809526443 809657335 809867859 810119271 810339749 810479462 810546875 810595572 810688734 810928941
2580.1H10928941M92215P09832Q17775Q97289R54449R31144Q47935P14898N22733L77894
$$ 810928941 811421156 812130988 812948763 813846052 814800501 815731645 816579580 817294478 817817211 818195105
2600.5H18195105L00586J83225R2744P3791L2425K2888M3869k8729j59145l10063m78506
$$ 818195105 818495691 818678916 818771660 818845451 818877876 818900764 818944633 818915904 818756759 818446696 817968190
2623H17968190n58734m04358L5584O14941J112103J401484J443565J260698R48370
$$ 817968190 817409456 817005098 817040682 817655623 818767726 820169210 821612775 822873473 823821843
2641.3H23821843O63161N14865M05311K82288K49505K83957K61545J82152J34408J06454
$$ 823821843 824485004 824999869 825405180 825687468 825936973 826220930 826482475 826664627 826799035 826905489
2661.7H26905489R1910P5877J0490o0379r2268p6056l4987j0491K5094R0837R1553
$$ 826905489 826997399 827073276 827083766 827023387 826931119 826855063 826820076 826809585 826834679 826925516 827017069
2684.1H27017069L4153J0670K3841M5777O079q6844j59621k12729k97248l79801l96848
$$ 827017069 827051222 827061892 827085733 827131510 827137589 827050745 826891124 826678395 826381147 826001346 825604498
2706.6H25604498l80575l39747k83479k52605k66552l24905m47690o39141p55072p16090
$$ 825604498 825223923 824884176 824600697 824348092 824081540 823756635 823308945 822669804 821914732 821198642
2727H21198642o95288p54774p15911n76854m85122m88996n34833n94079p11322p99537
$$ 821198642 820503354 819748580 819032669 818455815 817970693 817481697 816946864 816352785 815641463 814841926
2747.4H14841926p69138p14720o66677n05209k34127l4333J2577K1219Q8632J42694
$$ 814841926 814072788 813358068 812691391 812186182 811952055 811917722 811930299 811951518 812040150 812182844
2767.8H12182844Q2433p6413k09511k48432k80380l58224m68790o13630p46906p81477
$$ 812182844 812265277 812188864 811979353 811730921 811450541 811092317 810623527 810009897 809262991 808481514
2788.2H08481514o93380o11902o85274q34823q96811r19402r24826p41183l54767P6472
$$ 808481514 807788134 807176232 806490958 805656135 804759324 803839922 802915096 802173913 801819146 801895618
2808.6H01895618L94047M56154K87056K742l73840p45476r59873j032710j078606j197874
$$ 801895618 802289665 802745819 803032875 803035617 802661777 801916301 800956428 799923718 798845112 797647238
2828.9G97647238j363814j485884j665354j970947k270937k633929l236115l909469
$$ 797647238 796283424 794797540 793132186 791161239 788890302 786256373 783020258 779110789
2845.3G79110789m395663m603804m465639l997684l281295k481878j881063j602232
$$ 779110789 774715126 770111322 765645683 761647999 758366704 755884826 754003763 752401531
2861.6G52401531j655638j998902k395391k719164l035546l325760l707945m421711
$$ 752401531 750745893 748746991 746351600 743632436 740596890 737271130 733563185 729141474
2877.9G29141474n327642n977512o005942n216599l559291j300276R94862K798080
$$ 729141474 723813832 717836320 711830378 706613779 703054488 701754212 702749074 705547154
2894.2G05547154L829777L951609L201306K142370J584172J865566K742529L675997
$$ 705547154 709376931 713328540 716529846 718672216 720256388 722121954 724864483 728540480
2910.5G28540480M193604M170597L689885K856195J824498P99716j68980j301407k666533
$$ 728540480 732734084 736904681 740594566 743450761 745275259 746074975 745905995 744604588 741938055
2928.9G41938055m295886o497741r427905j2952864j6798437k0505964k3476184k5133073
$$ 741938055 737642169 731144428 721716523 708763659 691965222 671459258 647983074 622850001
2945.2F22850001k5175214k3739696k1113038j7600059j3567686r126246m317939M91976
$$ 622850001 597674787 573935091 552822053 535221994 521654308 512528062 508210123 508702099
2961.5E08702099M785955Q178115J0553241J2034178J2807905J2927473J2471437J1763096
$$ 508702099 513488054 521666169 532219410 544253588 557061493 569988966 582460403 594223499
2977.8E94223499J1014819J0265470R615540R123028Q733690Q266031P622600O908297
$$ 594223499 605238318 615503788 625119328 634242356 642976046 651242077 658864677 665772974
2994.2F65772974O259442N798161N589723N671204O005525O419182O754339O995320
$$ 665772974 672032416 677830577 683420300 689091504 695097029 701516211 708270550 715265870
3010.5G15265870P163704P233500P155061O849110O341815N749106N086661M401862
$$ 715265870 722429574 729663074 736818135 743667245 750009060 755758166 760844827 765246689
3026.8G65246689L780842L139973K471328J754939P82609m68969k147019m630745p822334
$$ 765246689 769027531 772167504 774638832 776393771 777176380 776707411 774560392 769929647 762107313
3045.1G62107313j0836661j2087465j0204076n657077o00159K599716K743482Q07703
$$ 762107313 751270652 739183187 728979111 723322034 722721875 725321591 728065073 728872776
3061.5G28872776j142263j766086j069963J08600R62913J004278L78192j46508J75058
$$ 728872776 727730513 725964427 724894464 725003064 725965977 726970255 727348447 727201939 727376997
3079.8G27376997J602829L657162N396784O141901N569875L665924R76801j546502
$$ 727376997 728979826 732636988 738033772 744175673 749745548 753411472 754388273 752841771
3096.1G52841771l012836k959967j458704Q75473L200888M902721N634606N525112
$$ 752841771 749828935 746868968 745410264 746285737 749486625 754389346 760023952 765549064
3112.4G65549064M923045L867805K445877R58145k57016o90817j37032R90868K141297
$$ 765549064 770472109 774339914 776785791 777743936 777486920 776796103 776659071 777649939 779791236
3130.8G79791236K926052L164589K945185K480209J956939J576841J382053J258135
$$ 779791236 782717288 785881877 788827062 791307271 793264210 794841051 796223104 797481239
3147.1G97481239J133442R93550R29892R18507Q11041O56724N49614M66585L90649
$$ 797481239 798614681 799608231 800538123 801456630 802267671 802924395 803474009 803940594 804331243
3165.5H04331243L23117K41935K15530L07978L96013L58045K55525J98782J15394J3232
$$ 804331243 804654360 804896295 805111825 805419803 805815816 806173861 806429386 806628168 806743562 806756794
3185.9H06756794M9651J19865J42694K65657M08471M38154M57227M32432L10898K56657
$$ 806756794 806806445 806926310 807069004 807334661 807743132 808181286 808638513 809070945 809381843 809638500
3206.3H09638500K33889Q5115j34349k99036l35991l13640k99752k28345j63853j64211
$$ 809638500 809872389 809957504 809823155 809524119 809188128 808874488 808574736 808346391 808182538 808018327
3226.7H08018327r0480O4552J83940K52723K78414L06070L57329L52264L70681M52101
$$ 808018327 807927847 807992399 808176339 808429062 808707476 809013546 809370875 809723139 810093820 810545921
3247.1H10545921L52025J55568J49608K14577J79469J16706J08183R3519N6982P2301
$$ 810545921 810897946 811053514 811203122 811417699 811597168 811713874 811822057 811915576 811972558 812044859
3267.5H12044859J27137J15752k2113j73688k36094k24948k08676k57731l71933m68433
$$ 812044859 812171996 812287748 812265635 812091947 811855853 811630905 811422229 811164498 810792565 810324132
3287.8H10324132m53293l51071k74420k28703j41323J20J72376L11136L15786K52068
$$ 810324132 809870839 809519768 809245348 809016645 808875322 808875442 809047818 809358954 809674740 809926808
3308.2H09926808K29061J66356L4928j22070k40624l39210n44727p93814r75967j057625
$$ 809926808 810155869 810322225 810357153 810235083 809994459 809655249 809110522 808316708 807340741 806283116
3328.6H06283116r72211p04646l33667N2810L74794O09875P68542Q45313R05394R67563
$$ 806283116 805310905 804606259 804272592 804325402 804700196 805310071 806078613 806923926 807829320 808796883
3349H08796883J028418J036942Q87215O31988M19796L16262K16603L1770o4254J192
$$ 808796883 809825301 810862243 811749458 812381446 812801242 813117504 813334107 813365877 813301623 813302815
3369.4H13302815K9564m1306j40608k38776l61442m93050n92708o66202p85172j003265
$$ 813302815 813332379 813291073 813150465 812911689 812550247 812057197 811464489 810798287 810013115 809009850
3389.8H09009850j177728j246512j429439j835882k190590k367020k678394l260553
$$ 809009850 807832122 806585610 805156171 803320289 801129699 798762679 796084285 792823732
3406.1G92823732l895462m431665m862249n181252n405188n565405n615532n326808
$$ 792823732 788928270 784496605 779634356 774453104 769047916 763482511 757866979 752540171
3422.5G52540171m723787m089415l251493j989722o18577N70535J763165L006876L881097
$$ 752540171 747816384 743726969 740475476 738485754 737867177 738437712 740200877 743207753 747088850
3440.8G47088850M238367M355549M468799M517675M336476L995299L588498L124535
$$ 747088850 751327217 755682766 760151565 764669240 769005716 773001015 776589513 779714048
3457.1G79714048K766251K572835K222836J598477J165450J285553J467764J168609
$$ 779714048 782480299 785053134 787275970 788874447 790039897 791325450 792793214 793961823
3473.4G93961823O71744L37184K35915K60591Q7798j59025k00927k86937m83751o45280
$$ 793961823 794633567 794970751 795206666 795467257 795555055 795396030 795195103 794908166 794424415 793779135
3493.8G93779135q18968r08196r41157j065314j084209r74297j074970j381755j578450
$$ 793779135 792960167 792051971 791110814 790045500 788961291 787986994 786912024 785530269 783951819
3512.2G83951819j590014j588583j605987j708388j988531k164542k149642k196848
$$ 783951819 782361805 780773222 779167235 777458847 775470316 773305774 771156132 768959284
3528.5G68959284k202094k066195k044618k156436k111793j881897j606763j445234
$$ 768959284 766757190 764690995 762646377 760489941 758378148 756496251 754889488 753444254
3544.8G53444254j415252j028478m40300k18928L100M47690P31290R27925J364529
$$ 753444254 752029002 751000524 750560224 750341296 750344396 750792086 751523376 752451301 753815830
3563.2G53815830J777887J740098J736105K054393K070486J763106J559794J372576
$$ 753815830 755593717 757333815 759069920 761124313 763194799 764957905 766517699 767890275
3579.5G67890275J005530O66201K75373n02228q84414o99282j053810j616835j638532
$$ 767890275 768895805 769562006 769837379 769335151 768450737 767751455 766697645 765080810 763442278
3597.9G63442278j703680j986563j839816j756549k283931k474904k201557k142191
$$ 763442278 761738598 759752035 757912219 756155670 753871739 751396835 749195278 747053087
3614.2G47053087j745641j621843k064705j631260p27176o0797m23014q68082L75449
$$ 747053087 745307446 743685603 741620898 739989638 739262462 739201665 738778651 737910569 738286018
3632.5G38286018J178503J270652J554787J840353K048552K419234K926528L235698
$$ 738286018 739464521 740735173 742289960 744130313 746178865 748598099 751524627 754760325
3648.8G54760325L059387L186703L663540L684282L502250L534198L438472L364742
$$ 754760325 757819712 761006415 764669955 768354237 771856487 775390685 778829157 782193899
3665.2G82193899L471792L391504L040552L154338L023624K310932K260685K335310
$$ 782193899 785665691 789057195 792097747 795252085 798275709 800586641 802847326 805182636
3681.5H05182636K313137K545476K958774L057957K718389K384782K049744J710713
$$ 805182636 807495773 810041249 813000023 816057980 818776369 821161151 823210895 824921608
3697.8H24921608J435161J133084Q74996Q00490P09177N78820K93315K84075M72665
$$ 824921608 826356769 827489853 828364849 829165339 829874516 830453336 830746651 831030726 831503391
3716.2H31503391L45588R8169j63555l33786m26829k29538J21296M9293l03447k23995
$$ 831503391 831848979 831947148 831783593 831449807 831022978 830793440 830914736 830964029 830660582 830436587
3736.5H30436587K46108N77450L18348n97536o15716k21849o84798o28352R7633L07083
$$ 830436587 830682695 831260145 831578493 830980957 830365241 830143392 829458594 828830242 828927875 829234958
3756.9H29234958R2506J17540M39644M66109L32415K42173K04504L58820L74079K99036
$$ 829234958 829327464 829445004 829884648 830350757 830683172 830925345 831129849 831488669 831862748 832161784
3777.3H32161784J93179L1709J6571M7206O8367R537j10448j90735l86536m14371k75791
$$ 832161784 832354963 832386672 832403243 832450449 832518816 832528353 832417905 832227170 831840634 831426263 831150472
3799.8H31150472n27680j54972L05593k98J31309N15104M27782j03056j39535Q0824
$$ 831150472 830622792 830467820 830773413 830773115 830904424 831419528 831847310 831744254 831604719 831685543
3820.2H31685543j68502P8201K64287J00315L8981l3557R6440P3910l68417k03073
$$ 831685543 831517041 831595242 831859529 831959844 831998825 831965268 832061708 832135618 831767201 831564128
3840.6H31564128K27690K14994J19031J13487R0241n50627r58562J38878O65188L94941
$$ 831564128 831791818 832006812 832125843 832239330 832329571 831778944 830820382 830959260 831624448 832019389
3861H32019389j6392j84297O8664M3393j90676M5002J83701K28525R9003j24216L2782
$$ 832019389 832002997 831818700 831887364 831930757 831740081 831785083 831968784 832197309 832296312 832172096 832204878
3883.4H32204878j69456k12192J98304j0609k20657N4360m351k74658k18153j79351
$$ 832204878 832035422 831823230 832021534 832010925 831790268 831844628 831840277 831565619 831347466 831168115
3903.8H31168115j98543J9133J10448k4081j37865k51711k67505o8724L5941r239N0664
$$ 831168115 830969572 830988705 831099153 831075072 830937207 830685496 830417991 830349267 830385208 830375969 830426633
3926.2H30426633J81198R7931j16527p1168J31428J15931q2791k34067j44959l3021
$$ 830426633 830607831 830705762 830589235 830518067 830649495 830765426 830682635 830448568 830303609 830270588
3946.6H30270588j36077j11163K0266p9036k47776k60115k34067j72258k2113q3983
$$ 830270588 830134511 830023348 830043614 829964578 829716802 829456687 829222620 829050362 829028249 828944266
3967H28944266l40164m67002m30882l68953l48389l43800k93791k05934j57654j26422
$$ 828944266 828604102 828137100 827706218 827337265 826988876 826645076 826351285 826145351 825987697 825861275
3987.4H25861275j52230k21491j62899j9670J13964
$$ 825861275 825709045 825487554 825324655 825304985 825418949
3997.6H25418949
$$ 825418949
##END=$$ End of the data block
