##TITLE=Ekopro d maior que 1,28 $$ Begin of the data block
##JCAMP-DX=5.00 $$ ACD/SpecManager v 10.08
##SPECTROMETER/DATA SYSTEM=Alpha
##DATE=05 Nov 2014 10:34:16
##DATA TYPE=INFRARED SPECTRUM
##DATA CLASS=XYDATA
##ORIGIN=
##OWNER=
##NPOINTS=1765
##FIRSTX=399.76428223
##LASTX=3997.64306641
##MAXX=3997.64306641
##MINX=399.76428223
##MAXY=1.00000000
##MINY=0.09274396
##XFACTOR=1.0000000000
##YFACTOR=0.000000010000000
##FIRSTY=1.00000000
##DELTAX=2.03961372
##XUNITS=1/CM
##YUNITS=ARBITRARY UNITS
##XYDATA=(X++(Y..Y))
399.8A00000000k31367l27623m08721m74680n25576j027762j026851n49913m13591
418.1I5013916o44761o45786k46203K68906N41037M84413K97791K14553K83188L75396
438.5I5942450L62449K52563J61219J74844K62809L19868K77287J61755N1379j0919
458.9I7955704n2828j28227k50554l76702m52667m66830m54902m56846m75669m82035
479.3I4358444m55713m18598m24039n13130o77115q54707r60964r23115p05993l25805
499.7H8099265J46324N97149R08231J007057R02968O79827M46159K77710J91640J63925
520.1I3420255J65856J86610K27601K84338L40539L78585L94243L97771M01247M06289
540.5I6603334M04972L91179L68226L45277L27021L09080K83671K48444K08491J70135
$$ y = [100000000, 99768633, 99441010, 99032289, 98557609, 98032033, 97004271, 95977420, 95427507, 95013916, 94369155, 93723369, 93477166, 93746072, 94287109, 94771522, 95069313, 95283866, 95567054, 95942450, 96304899, 96557462, 96718681, 96893525, 97156334, 97476202, 97753489, 97915244, 97966623, 97955704, 97902876, 97774649, 97524095, 97147393, 96694726, 96227896, 95772994, 95316148, 94840479, 94358444, 93902731, 93484133, 93060094, 92546964, 91869849, 91015142, 90054178, 89131063, 88425070, 88099265, 88245589, 88842738, 89750969, 90758026, 91660994, 92340821, 92786980, 93064690, 93256330, 93420255, 93586111, 93772721, 94000322, 94284660, 94625199, 95003784, 95398027, 95795798, 96197045, 96603334, 97008306, 97399485, 97767711, 98112988, 98440009, 98749089, 99032760, 99281204, 99489695, 99659830]
560.9I9659830J34743R9402O3455L1728J0520%Tj1337L22l0505m6146n7322o6400p3904
589.4I9714386p7104p4929p1919p6288r0730j07765j15747j11323j03671j04081j11378
611.9I8669451j11675r7495q9330j32256k59930m51529o21337o60980n09733k03073
632.3I5532113J39487L81309M43047L37345J46192l5364j48588j87129j80417j64199
652.7I6263796j58900j65772j76841j88649k08926k51997l25757m20523n08988n57786
673.1I3299657n42372m55147l06088j21927N2446J55240J25688o5028l89648p72208
693.5I0980613j128739j406968j587873j648820j541251j239472q53032p06452j265836
711.8G9602170k886593n512148q539784j0997212j1964807j0994289q264578m401073
$$ y = [99659830, 99794573, 99893975, 99957430, 99989158, 99999678, 99999678, 99999678, 99988341, 99988663, 99958158, 99912012, 99854690, 99788290, 99714386, 99637282, 99562353, 99490434, 99414146, 99323416, 99215651, 99099904, 98988581, 98884910, 98780829, 98669451, 98557776, 98460281, 98370951, 98238695, 97978765, 97527236, 96905899, 96244919, 95735186, 95532113, 95671600, 96052909, 96495956, 96833301, 96979493, 96944129, 96795541, 96608412, 96427995, 96263796, 96104896, 95939124, 95762283, 95573634, 95364708, 95112711, 94786954, 94366431, 93857443, 93299657, 92757285, 92302138, 91996050, 91874123, 91926569, 92081809, 92207497, 92142469, 91752821, 90980613, 89851874, 88444906, 86857033, 85208213, 83666962, 82427490, 81574458, 80868006, 79602170, 76715577, 71203429, 62663645, 51666433, 39701626, 28707337, 20442759, 16041686]
728.1A6041686j20195M037446P730630J0666874J2486697J2839889J1615473R128499
744.5H4426999O078488L268844J261103J85299j94532k42764k24858k26158k19375
762.8I4113046j77562j28949j27137j92010k91044l81463m71068o33985r56416j445144
783.2H9308268j969856k293986k191192j583362o13224M02242J120281J339328J088196
801.6H4606695N86617J09446j58721j91611q6492L0595Q5330P4118K7567l6263j27852
824H4919429k66314m49252o42466p96420q72308q57127p59905o00362m01479j89161
844.4G9084635R000J71489K89672L59953L57455K09677j97715r61947k069539l324115
864.8G3928565m360122m764992m264873k876317r32968J040244K541447L282594L261686
$$ y = [16041686, 15921491, 19958937, 27689567, 38356441, 50843138, 63683027, 75298500, 84426999, 90505487, 93774331, 95035434, 95220733, 95026201, 94783437, 94558579, 94332421, 94113046, 93935484, 93806535, 93679398, 93487388, 93196344, 92814881, 92343813, 91709828, 90753412, 89308268, 87338412, 85044426, 82853234, 81269872, 80656648, 81058890, 82179171, 83518499, 84606695, 85193312, 85302758, 85144037, 84952426, 84865934, 84896529, 84981859, 85055977, 85083544, 85047281, 84919429, 84653115, 84203863, 83561397, 82764977, 81892669, 81035542, 80275637, 79675275, 79273796, 79084635, 79093635, 79265124, 79554796, 79914749, 80272204, 80481881, 80284166, 79322219, 77252680, 73928565, 69568443, 64803451, 60538578, 57662261, 56729293, 57769537, 60310984, 63593578, 66855264]
883.2F6855264K698165J892507J100785M81998J14292L1954K39724O97828J305079
901.5G5417596J910794K359444K545434K445489K114427J651639J160914P20882L73894
919.9I0700513J30159k0749r6994j16480r5045m8757M560M8017P0864P0847N1146J4979
944.3I0713060l7170j04355j82456k66582l58128m67730o06787p70748r28807j031488
964.7H5958809j033151r14234o88088l92437p7355K02936L98004M78059M53174L75223
985.1H4760940L07453K76935K53105J80268L9691j30093l02959n86235j266092k668345
1005.5H0864668m861409p398676r340853r648195p763260m021952M05672M052639N859769
1023.9D8148403N627176L968644J857364R4086r80139j425862j447696j174491o17635
$$ y = [66855264, 69553429, 71445936, 72546721, 73028719, 73143011, 73174965, 73414689, 74112517, 75417596, 77328390, 79687834, 82233268, 84678757, 86793184, 88444823, 89605737, 90326619, 90700513, 90830672, 90809923, 90712929, 90596449, 90501404, 90452647, 90457207, 90505224, 90576088, 90646935, 90698081, 90713060, 90675890, 90571535, 90389079, 90122497, 89764369, 89296639, 88689852, 87919104, 86990297, 85958809, 84925658, 84011424, 83323336, 82930899, 82853544, 83056480, 83454484, 83932543, 84385717, 84760940, 85068393, 85345328, 85598433, 85778701, 85818392, 85688299, 85385340, 84799105, 83533013, 80864668, 76003259, 68604583, 59263730, 49615535, 41852275, 37830323, 38235995, 42288634, 48148403, 53775579, 57744223, 59601587, 59695673, 58715534, 57289672, 55841976, 54667485, 54049850]
1042.2E4049850K26813J267064K301109L097826L496843L454948L026771K317036J440322
1060.6G4678582M97091m45211j367372k293891l257406m246616n175650n904204o299856
1079D6185467o301490n941921n319465m547899l718774k894068k116359j415991q08201
1097.3A3121299k90323J46901M97996P29952P95539O70695L91133N8952j91356k50503
1117.7A5680285q3648K57594O64500J024852J272337J410654J505907J657083J958205
1136.1B5347769K465758L176302M018178M860267N540261N909634N881291N456996
1152.4F2656456M718131L781098K744705J663661N68998m80211j356423j876706j876414
1170.7G0543295j306003k90281Q94106J917284K520520K602512K228784J573664Q34644
$$ y = [54049850, 54276663, 55543727, 57844836, 60942662, 64439505, 67894453, 70921224, 73238260, 74678582, 75175673, 74730462, 73363090, 71069199, 67811793, 63565177, 58389527, 52485323, 46185467, 39883977, 33942056, 28622591, 24074692, 20355918, 17461850, 15345491, 13929500, 13121299, 12830976, 12977877, 13475873, 14205825, 15001364, 15672059, 16063192, 16122144, 15930788, 15680285, 15596637, 15854231, 16518731, 17543583, 18815920, 20226574, 21732481, 23389564, 25347769, 27813527, 30989829, 35008007, 39868274, 45408535, 51318169, 57199460, 62656456, 67374587, 71155685, 73900390, 75564051, 76133049, 75652838, 74296415, 72419709, 70543295, 69237292, 68947011, 69841117, 71758401, 74278921, 76881433, 79110217, 80683881, 81518525]
1189.1H1518525J64723l54850p06929r14276j016205j053870j063424j075894j121193
1207.5G4376607j232153j442933j779622k247363k824188l467279m128367m763520
1223.8E2491182n328485n762604n979976n885855n418570m594967l528429k401032
1240.1A3591264j401146o58209k08865o350L8036J0152l3548o7940q6393q6737o6088
1262.5A1024176k3655L4252R3200J36076J51103J38159J07876P5271N2305M6158O5073
1285A1899994J27030K61815N01285Q59764J318008J822543K304557K709462L019175
1303.3B4823633L253642L451541L643360L835708M016003M168695M284356M345083
1319.6E5822021M291433M002350L321892K145935N33855j226080k663088l291994k834219
$$ y = [81518525, 81683248, 81328398, 80621469, 79707193, 78690988, 77637118, 76573694, 75497800, 74376607, 73144454, 71701521, 69921899, 67674536, 64850348, 61383069, 57254702, 52491182, 47162697, 41400093, 35420117, 29534262, 24115692, 19520725, 15992296, 13591264, 12190118, 11531909, 11323044, 11316694, 11354730, 11364882, 11331334, 11263394, 11177001, 11090264, 11024176, 11000521, 11034773, 11127973, 11264049, 11415152, 11553311, 11661187, 11736458, 11788763, 11834921, 11899994, 12027024, 12288839, 12790124, 13649888, 14967896, 16790439, 19094996, 21804458, 24823633, 28077275, 31528816, 35172176, 39007884, 43023887, 47192582, 51476938, 55822021, 60113454, 64115804, 67437696, 69583631, 70117486, 68891406, 66228318, 62936324, 60102105]
1338F0102105j373327O50645K617603L983349M475337M131085L181356J876467L77983
1356.4H0022603j225072k813142m152286m917187m827303l812366k093548j17540J622051
1374.7E7686210K772486L216177L038943K424514J558584N91332l59172j213598j970810
1393.1F7744666k736336l671068m838264o030428o722137o249535m169137n97900L696337
1411.4C6426198P552103R904006J0234380Q739346O140929L290117Q08358j051551
1427.7H2043886k312279l079581l409928l310996k828616k114976j402926q97658o64019
1446.1F2022907n91720m64332q8584N96583J490801K389461L082127L434461L419077
1464.5G5290781L100598K599609K056575J597744J300448J167894J135194J115012
$$ y = [60102105, 58728778, 59379423, 61997026, 65980375, 70455712, 74586797, 77768153, 79644620, 80022603, 78797531, 75984389, 71832103, 66914916, 62087613, 58275247, 56181699, 56064159, 57686210, 60458696, 63674873, 66713816, 69138330, 70696914, 71288246, 70929074, 69715476, 67744666, 65008330, 61337262, 56498998, 50468570, 43746433, 37496898, 33327761, 32729861, 36426198, 43978301, 53882307, 64116687, 72856033, 78996962, 82287079, 83095437, 82043886, 79731607, 76652026, 73242098, 69931102, 67102486, 64987510, 63584584, 62686926, 62022907, 61431187, 60966855, 60878271, 61474854, 62965655, 65355116, 68437243, 71871704, 75290781, 78391379, 80990988, 83047563, 84645307, 85945755, 87113649, 88248843, 89363855]
1480.8H9363855J055378R58812Q33494O12908J31351p79337k104896l513301m415196
1499.1H2143068m244750k812505m92579J910871L560239M002214L349441K133292R56524
1517.5I0505815J87450j31452j64109r0713L541J16181K52950L80820M43811M08464
1537.9I1912758K88260J28824k3544j40244k09075k29841k15680j94144j96111k38872
1558.3I0882331l24952m65900p07263j111799j687885k308851k704650k570331j748550
1576.6G7252150l67189J176280K392220K936155K759349K088398J265270N62369Q1599
1595I0146601k26778m71800p29364r99523j216644j288831j144159p69257k30855L34096
1615.4H3403486P64930R44811Q55142N80514K59739J2994j10251j34033j17302j07706
$$ y = [89363855, 90419233, 91378045, 92211539, 92824447, 92955798, 92176461, 90071565, 86558264, 82143068, 77898318, 75085813, 74593234, 76504105, 80064344, 84066558, 87415999, 89549291, 90505815, 90693265, 90561813, 90397704, 90306991, 90310532, 90426713, 90679663, 91060483, 91504294, 91912758, 92201018, 92329842, 92306298, 92166054, 91956979, 91727138, 91511458, 91317314, 91121203, 90882331, 90557379, 90091479, 89384216, 88272417, 86584532, 84275681, 81571031, 79000700, 77252150, 76884961, 78061241, 80453461, 83389616, 86148965, 88237363, 89502633, 90065002, 90146601, 89919823, 89448023, 88718659, 87719136, 86502492, 85213661, 84069502, 83300245, 83069390, 83403486, 84168416, 85113227, 85968369, 86548883, 86808622, 86821616, 86711365, 86577332, 86460030, 86352324]
1635.8H6352324j19024j38551j49953j49548j47045j57368j92833k61253l66593n07414
1656.2H4162742o74272q49461j013333j153231j268810j369696j466322j560212j639795
1674.5G3167610j683825j671177j592738j461994j320500j235151j286602j549470
1690.9F1366153k069789k845103l812218m845804n771723o396875o554490o156857
1707.2B2913294n235912l952033k556892j317422m29362M1698J63308Q2795n0925j44123
1727.6I514426j61606p8424J77995P42599J756420L261266N110477O964047Q391851
1745.9C5679051R041888Q786878P769358O324053M826033L549880K605784J966089
1762.2H0549014J541334J248956J041311Q96281P96431P20406O49315N76061N05447
$$ y = [86352324, 86233300, 86094749, 85944796, 85795248, 85648203, 85490835, 85298002, 85036749, 84670156, 84162742, 83488470, 82639009, 81625676, 80472445, 79203635, 77833939, 76367617, 74807405, 73167610, 71483785, 69812608, 68219870, 66757876, 65437376, 64202225, 62915623, 61366153, 59296364, 56451261, 52639043, 47793239, 42021516, 35624641, 29070151, 22913294, 17677382, 13725349, 11168457, 9851035, 9421673, 9463371, 9626679, 9709474, 9658549, 9514426, 9352820, 9274396, 9452391, 10194990, 11951410, 15212676, 20323153, 27287200, 35679051, 44720939, 53507817, 61277175, 67601228, 72427261, 75977141, 78582925, 80549014, 82090348, 83339304, 84380615, 85276896, 86073327, 86793733, 87443048, 88019109, 88524556]
1780.6H8524556M45593L98290L57932L17633K75749K36833K06214J85376J70476J56045
1801I1274697J38235J16157R0158O1012L0243J991j7149j9919j848L6406Q9050J46913
1825.5I1945946K00403K42376K70349K86675K97230L07137L17436L24536L22431L07685
1845.9I4822204K81978K51370K22260J97905J77682J59132J40560J22124J04469Q7202
1866.3I6566886O9123M9353K8968J0526l606j3071j9855k6655l5405m6337n8412p0471
1890.7I6451044q1551r0790r7459j01257j02514j02758j03766j06597j11067j15961
1911.1I5437324j20079j23418j26940j32370j40893j52809j67793j85364k05392k28232
1931.5I3854034k53618k79891l02941l16524l13360k87676k37447j65790q0675P457
$$ y = [88524556, 88970149, 89368439, 89726371, 90044004, 90319753, 90556586, 90762800, 90948176, 91118652, 91274697, 91412932, 91529089, 91619247, 91680259, 91710502, 91712493, 91695344, 91675425, 91673577, 91709983, 91799033, 91945946, 92146349, 92388725, 92659074, 92945749, 93242979, 93550116, 93867552, 94192088, 94514519, 94822204, 95104182, 95355552, 95577812, 95775717, 95953399, 96112531, 96253091, 96375215, 96479684, 96566886, 96636009, 96685362, 96714330, 96724856, 96721250, 96708179, 96688324, 96661669, 96626264, 96579927, 96521515, 96451044, 96369493, 96278703, 96181244, 96079987, 95977473, 95874715, 95770949, 95664352, 95553285, 95437324, 95317245, 95193827, 95066887, 94934517, 94793624, 94640815, 94473022, 94287658, 94082266, 93854034, 93600416, 93320525, 93017584, 92701060, 92387700, 92100024, 91862577, 91696787, 91616112, 91623569]
1951.9I1623569Q8828J56558K07692K41947K60514K64568K55805K36517K10321J81311
1972.3I3727630J53190J28383J08307R4205Q7446Q9127R8706J13475J28794J40297
1992.7I4869560J45262J43683J37610J29372J20520J11640J02865R4474Q6891Q0461
2013.1I6022338P4815O9344O3497N7185N0819M4924L9601L4410K8723K2066J4657P069
2037.6I6529448j07o688j3238k0468k8909l8272m7481n5522o1768o6399p0393p4548
2062.1I6045655p9143q3584q7106q8715q8120q5264q0574p4637o8188o2215n7387n4139
2086.6I5136583n2321n1236m9782m7153m3041l7736l2162k7168k3121j9514j5557j0520
2111I4727272m423K080P981J2613J5789J7679J8668J8871J8477J7739J6975J6516J6654
$$ y = [91623569, 91712397, 91868955, 92076647, 92318594, 92579108, 92843676, 93099481, 93335998, 93546319, 93727630, 93880820, 94009203, 94117510, 94211715, 94299161, 94388288, 94486994, 94600469, 94729263, 94869560, 95014822, 95158505, 95296115, 95425487, 95546007, 95657647, 95760512, 95854986, 95941877, 96022338, 96097153, 96166497, 96229994, 96287179, 96337998, 96382922, 96422523, 96456933, 96485656, 96507722, 96522379, 96529448, 96529341, 96522653, 96509415, 96488947, 96460038, 96421766, 96374285, 96318763, 96256995, 96190596, 96120203, 96045655, 95966512, 95882928, 95795822, 95707107, 95618987, 95533723, 95453149, 95378512, 95310324, 95248109, 95190722, 95136583, 95084262, 95033026, 94983244, 94936091, 94893050, 94855314, 94823152, 94795984, 94772863, 94753349, 94737792, 94727272, 94722849, 94724929, 94732910, 94745523, 94761312, 94778991, 94797659, 94816530, 94835007, 94852746, 94869721, 94886237, 94902891]
2137.5I4902891J7756K0129K4366L0637L8546M7165N5290O1988O6913P0071P1412P1132
2162I5478296O9207O6191O2800N9414N5795N1278M5121L7658L0095K4247K1148K0504
2186.5I6021754K0712J9485J4734N722o968k1332l4690m4304m8119m5198l6389k3895
2211I5821512j1027j127L422K163l475j0687j6868k0349k1148k0140j8394j6695j5372
2237.5I5671815j4872j5789j8215k1404k3943k3872k0397j3798n466K724R346J3071
2262I5539200J2613O652n657k3979m6188o8259q5318r2530q6141o5267l1853Q959N0163
2288.5I5112395Q4710J08064J18911J19001J11711J00249Q6963P2956N8812M4524L0220
2310.9I6048516J6242M006l982m744K968J7548L3956M6152N0026M5246L4487K0665
$$ y = [94902891, 94920647, 94940776, 94965142, 94995779, 95034325, 95081490, 95136780, 95198768, 95265681, 95335752, 95407164, 95478296, 95547503, 95613694, 95676494, 95735908, 95791703, 95842981, 95888102, 95925760, 95955855, 95980102, 96001250, 96021754, 96042466, 96061951, 96076685, 96082407, 96075439, 96054107, 96019417, 95975113, 95926994, 95881796, 95845407, 95821512, 95810485, 95809358, 95812780, 95814943, 95811468, 95800781, 95783913, 95763564, 95742416, 95722276, 95703882, 95687187, 95671815, 95656943, 95641154, 95622939, 95601535, 95577592, 95553720, 95533323, 95519525, 95514059, 95516783, 95526129, 95539200, 95551813, 95558465, 95552808, 95528829, 95482641, 95414382, 95329064, 95236534, 95150393, 95085126, 95053273, 95062232, 95112395, 95197105, 95305169, 95424080, 95543081, 95654792, 95755041, 95842004, 95914960, 95973772, 96018296, 96048516, 96064758, 96068764, 96064782, 96060038, 96063006, 96080554, 96114510, 96160662, 96210688, 96255934, 96290421, 96311086]
2335.4I6311086M381j5759m0192o5004q1879q2237o3365l2092k551J0443k74l1269
2359.9I5911288p1078j07032j31822j45036j50734j52928j52564j47992j36596j17546
2380.2I4597960r2251o3860l5602j0496R936K5105L5584M2749M8035N2458N6434O0028
2404.7I4726080O2996O5315O6965O7878O8301O8599O9499P1281P3618P5299P5012P2110
2429.2I5562953O7019O0994N5259N0324M6081M1854L7217L1930K6191K0283J4651R477
2453.7I6024233M929M95m160r394j4877k0081k4343k7376k9534l1346l3272l5476l8135
2480.2I5761663m1342m5127m9489n3770n7202n9063n8829n6607n2631m7320m1211l4988
2504.7I5164084k9480k5570k3669k3735k5064k6518k6899k5201k1309j5789r877m846
$$ y = [96311086, 96315467, 96299708, 96259516, 96194512, 96112633, 96030396, 95967031, 95934939, 95932388, 95942831, 95942557, 95911288, 95840210, 95733178, 95601356, 95456320, 95305586, 95152658, 95000094, 94852102, 94715506, 94597960, 94505709, 94441849, 94406247, 94395751, 94405687, 94430792, 94466376, 94509125, 94557160, 94609618, 94666052, 94726080, 94789076, 94854391, 94921356, 94989234, 95057535, 95126134, 95195633, 95266914, 95340532, 95415831, 95490843, 95562953, 95629972, 95690966, 95746225, 95796549, 95842630, 95884484, 95921701, 95953631, 95979822, 96000105, 96014756, 96024233, 96029162, 96029657, 96025497, 96016103, 96001226, 95981145, 95956802, 95929426, 95899892, 95868546, 95835274, 95799798, 95761663, 95720321, 95675194, 95625705, 95571935, 95514733, 95455670, 95396841, 95340234, 95287603, 95240283, 95199072, 95164084, 95134604, 95109034, 95085365, 95061630, 95036566, 95010048, 94983149, 94957948, 94936639, 94920850, 94910973, 94906127]
2529.1I4906127j424L10P03K56p39j895k575k181l94K438N454P874R429J0568J1796
2559.7I4945747J3244J4359J4436J2976J0413P546N889O663J0687J8245K8533M0120
2584.2I5128858N0920N9039O2972O2263N7077M8364L7604K6739J7470J1003P421O008
2608.7I5575738M983K563k658j1266k2095l2050l6662l1472j4579J1885M1956O8140
2633.2I5554483Q4335Q8411Q1813O8683N3239L8856K7609K0224J6695J5843J6195J6117
2657.6I6082503J4823J2416R245N817K265j162l797m655l332r5L731O598P790P302
2686.2I6139449N859M005J759j353n639j1223j7196k2352k5261k5206k2656j9139j6809
2712.7I5984238j7380k1261k7454l4207l9876m3475m4895m4316m2236l9333l6716l5542
$$ y = [94906127, 94904703, 94905013, 94905716, 94905972, 94905233, 94903338, 94900763, 94898582, 94898188, 94900626, 94906080, 94913954, 94923383, 94933951, 94945747, 94958991, 94973350, 94987786, 95000762, 95011175, 95018721, 95024610, 95031273, 95041960, 95060205, 95088738, 95128858, 95179778, 95238817, 95301789, 95364052, 95421129, 95469493, 95507097, 95533836, 95551306, 95562309, 95569730, 95575738, 95580721, 95583284, 95580626, 95569360, 95547265, 95515215, 95478553, 95447081, 95432502, 95444387, 95486343, 95554483, 95638818, 95727229, 95809042, 95877725, 95930964, 95969820, 95997429, 96017653, 96034348, 96050191, 96066386, 96082503, 96097326, 96109742, 96118987, 96124804, 96127069, 96125907, 96122110, 96117455, 96114123, 96114028, 96117759, 96124357, 96132147, 96139449, 96145308, 96149313, 96151072, 96149719, 96144080, 96132857, 96115661, 96093309, 96068048, 96042842, 96020186, 96001047, 95984238, 95966858, 95945597, 95918143, 95883936, 95844060, 95800585, 95755690, 95711374, 95669138, 95629805, 95593089, 95557547]
2737.2I5557547l6681m0191m4859m9049n1045m9734m5133l7789k8843j9508j0956m124
2761.6I5139635J61J782R59j591m929q703j3125j8805k6035l4094m1384m6277m8399
2788.2I4899195m8875m9949n3161n8055o2019o1452n3609l8308j8412J020J4472J7893
2812.6I4488740J0604m959k3997m1855n5873o6334p5072q3983r4009j05339j19155
2835.1I3828768j37836j64211j98543k37036k71851k94053k97350k80613k48217k08283
2855.5I1490775j69730j40273j24187j22207j31995j49911j73360k02322k38961k84517
2875.9H9753312l35926l82900m09281l97814l37428k29913r1821M9180J63436K30289
2896.3H8011134K45666K23077J86866J61064J59359J81132K13933K41512K51007K37394
$$ y = [95557547, 95520866, 95480675, 95435816, 95386767, 95335722, 95285988, 95240855, 95203066, 95174223, 95154715, 95143759, 95139635, 95139796, 95141578, 95142537, 95140946, 95136017, 95127314, 95114189, 95095384, 95069349, 95035255, 94993871, 94947594, 94899195, 94850320, 94800371, 94747210, 94689155, 94627136, 94565684, 94512075, 94473767, 94455355, 94456375, 94470847, 94488740, 94499344, 94494385, 94470388, 94428533, 94372660, 94306326, 94231254, 94147271, 94053262, 93947923, 93828768, 93690932, 93526721, 93328178, 93091142, 92819291, 92525238, 92227888, 91947275, 91699058, 91490775, 91321045, 91180772, 91056585, 90934378, 90802383, 90652472, 90479112, 90276790, 90037829, 89753312, 89417386, 89034486, 88625205, 88227391, 87889963, 87660050, 87568229, 87617409, 87780845, 88011134, 88256800, 88479877, 88666743, 88827807, 88987166, 89168298, 89382231, 89623743, 89874750, 90112144]
2916.6I0112144K02662J52480R1994K2864n7924j58399k89845m63564o85828r52536
2937H7974048j245648j534504j781475j950646k016049j965869j802158j537705j192420
2955.4G2947574p91514l65156N2947M28831P34401R52786J081550J131010J119817
2973.8G7292246J069039R97984R21488Q49265P85506P29894O78992O29086N78671N30065
2994.2H5062236M88245M58634M43894M42934M51868M65638M80115M92585N00488N01252
3014.5H9787889M92018M71479M40615M02510L60936L18355K75629K31767J84232J26946
3034.9I3092376M9227o1792k12532l91316n62430o73830o79440n65523l64345j43570
3055.3H9486825K5231J00952Q9920L4821j4847l1436j8388K360J3245J6617L2026Q0258
$$ y = [90112144, 90314806, 90467286, 90559280, 90582144, 90524220, 90365821, 90075976, 89612412, 88926584, 87974048, 86728400, 85193896, 83412421, 81461775, 79445726, 77479857, 75677699, 74139994, 72947574, 72156060, 71790904, 71843851, 72272682, 73007083, 73959869, 75041419, 76172429, 77292246, 78361285, 79359269, 80280757, 81130022, 81915528, 82645422, 83324414, 83953500, 84532171, 85062236, 85550481, 86009115, 86453009, 86895943, 87347811, 87813449, 88293564, 88786149, 89286637, 89787889, 90279907, 90751386, 91192001, 91594511, 91955447, 92273802, 92549431, 92781198, 92965430, 93092376, 93141603, 93079811, 92867279, 92475963, 91913533, 91239703, 90560263, 89994740, 89630395, 89486825, 89512056, 89613008, 89702928, 89737749, 89722902, 89691466, 89673078, 89675438, 89688683, 89705300, 89737326, 89817584]
3079.8H9817584J65295K67059L49229L75986L29197K17408P3010n9331j38670j42199
3100.2I1254568p1645M8757J82700K94626L60012L69960L29912K55125J65987Q3673
3120.6I3273675K6089M131J8406N9408J10805J55651J82128J86849J73754J50680J25176
3143I4466752J02120Q3441O9404N9700N3775N0575M8530M5752M1330L5650L0016K5762
3167.5I5112807K3257K1774K0337J8185J5289J1688P719M006J609K158O514J4043K2441
3194I5281827K8801L1144K9498K5177J9646J3631P016l99q083j4913j9973k2585k3084
3220.5I5347703k1744j8990j4860r602l278L743J0991J7691K3073K6267K7013K5535
3245I5413542K2554J8913J5336J2410J0389R215Q309O818M173Q16j877k754j472O14
$$ y = [89817584, 89982879, 90249938, 90599167, 90975153, 91304350, 91521758, 91594768, 91535437, 91396767, 91254568, 91182923, 91231680, 91414380, 91709006, 92069018, 92438978, 92768890, 93024015, 93190002, 93273675, 93299764, 93303895, 93322301, 93381709, 93492514, 93648165, 93830293, 94017142, 94190896, 94341576, 94466752, 94568872, 94652313, 94721717, 94781417, 94835192, 94885767, 94934297, 94980049, 95021379, 95057029, 95087045, 95112807, 95136064, 95157838, 95178175, 95196360, 95211649, 95223337, 95231056, 95235062, 95236671, 95238829, 95245343, 95259386, 95281827, 95310628, 95341772, 95371270, 95396447, 95416093, 95429724, 95436740, 95436341, 95428258, 95413345, 95393372, 95370787, 95347703, 95325959, 95306969, 95292109, 95282507, 95279229, 95282972, 95293963, 95311654, 95334727, 95360994, 95388007, 95413542, 95436096, 95455009, 95470345, 95482755, 95493144, 95502359, 95510668, 95517486, 95521659, 95522475, 95520598, 95517844, 95516372, 95516986]
3273.6I5516986J508j08m571j0717j7220k2894k6536k7222k4324j8388j1176m590O62
3300.1I5351410N668J2243K0921K9803L5268L4034K5278J0759o354k3162l7700m8536
3324.6I5409632n4580n4723m8453l5888j8114L356K5982M6485O1643O9941P2282P1740
3349I5549303P1132P0805O8307O0612M7087L0339J5110N215J592K605N620Q470R626
3375.5I5945823P653J312r680k3925l8696n1576o1684p0137p8780q9246j02353j19096
3400I5309615j40565j68109k01792k39527k77579l11637l38656l57234l67242l68172
3420.4I2539102l57872l32332k87199k20352j34224l6502O2245J51533K24471K78473
3440.8I1887343L13830L32058L34734L24308L04258K78843K51293K22915J93686J64395
$$ y = [95516986, 95518494, 95518386, 95513815, 95503098, 95485878, 95462984, 95436448, 95409226, 95384902, 95366514, 95355338, 95350748, 95351410, 95357078, 95369321, 95390242, 95420045, 95455313, 95489347, 95514625, 95525384, 95519030, 95495868, 95458168, 95409632, 95355052, 95300329, 95251876, 95215988, 95197874, 95201230, 95227212, 95273697, 95335340, 95405281, 95477563, 95549303, 95620435, 95691240, 95759547, 95820159, 95867246, 95897585, 95912695, 95917910, 95919502, 95922107, 95927727, 95936197, 95945823, 95953476, 95954788, 95945108, 95921183, 95882487, 95830911, 95769227, 95699090, 95620310, 95531064, 95428711, 95309615, 95169050, 95000941, 94799149, 94559622, 94282043, 93970406, 93631750, 93274516, 92907274, 92539102, 92181230, 91848898, 91561699, 91341347, 91207123, 91170621, 91232866, 91384399, 91608870, 91887343, 92201173, 92533231, 92867965, 93192273, 93496531, 93775374, 94026667, 94249582, 94443268, 94607663]
3461.2I4607663J37639J16623J02889R4563Q7285P7152O3312M7809L3677K2280J2898
3483.6I5403790L541o962j8388k9313l8213m4000m6545m6903m7308n0283n7244o7359
3508.1I4954813p8124q6779r2333r5594r8199j00946j03849j06925j11115j17225j24895
3530.6I3838829j31440j33282j28275j17076j02299q6475p0607n4676l8868k3758r382
3553I2942691O342K6554N3244Q4466J14471J36596J46627J44768J34629J20980J07681
3575.4I4019049R6941Q9157Q2380P3182N7703L3981L839k7836n5653p6431q9848r7674
3599.9I4108790j01644j02865j02455j02007j03229j06723j10787j12343j07777r4998
3620.3I3063962p3826m6515j7512P713K4551L2520L6436M5103O6668J03188J48862
$$ y = [94607663, 94745302, 94861925, 94964814, 95059377, 95146662, 95223814, 95287126, 95334935, 95368612, 95390892, 95403790, 95407331, 95400369, 95381981, 95352668, 95314455, 95270455, 95223910, 95177007, 95129699, 95079416, 95022172, 94954813, 94876689, 94789910, 94697577, 94601983, 94503784, 94402838, 94298989, 94192064, 94080949, 93963724, 93838829, 93707389, 93574107, 93445832, 93328756, 93226457, 93139982, 93069375, 93014699, 92975831, 92952073, 92942691, 92949033, 92975587, 93028831, 93113297, 93227768, 93364364, 93510991, 93655759, 93790388, 93911368, 94019049, 94115990, 94205147, 94287527, 94360709, 94418412, 94452393, 94456232, 94428396, 94372743, 94296312, 94206464, 94108790, 94007146, 93904281, 93801826, 93699819, 93596590, 93489867, 93379080, 93266737, 93158960, 93063962, 92990136, 92943621, 92926109, 92933822, 92958373, 92990893, 93027329, 93072432, 93139100, 93242288, 93391150]
3642.7I3391150J92547K23082K34783K29389K14117J97977J87886J87105J94734K08062
3663.1I5460832K23601K37411K44797K39700K17324J78254J32262R6512Q7273J09494
3683.5I7227460J51783J91331K07466J93244J57935J19132R0736P6496P1681O9612
3703.9I8556876O6149N9873N0426L7795K3544J1337M679L814N639O694O759Q631J3929
3730.4I8856145J9664K0271J3411L630o44M644J4305J7053N650j6171l6311m3380l5101
3756.9I8823166j8042r18J1962K0737K6178K7281K3192J6332J2219J4472K0754K4242
3781.4I9001575J9854Q702k825r215r823p063k635M214J2953J9008J6319M035r500
3807.9I9045599j2070K068K5487M3142M4071K9773J0848l082r674j1140p176N215K5666
$$ y = [93391150, 93583697, 93806779, 94041562, 94270951, 94485068, 94683045, 94870931, 95058036, 95252770, 95460832, 95684433, 95921844, 96166641, 96406341, 96623665, 96801919, 96934181, 97030693, 97117966, 97227460, 97379243, 97570574, 97778040, 97971284, 98129219, 98248351, 98339087, 98415583, 98487264, 98556876, 98623025, 98682898, 98733324, 98771119, 98794663, 98806000, 98810679, 98814493, 98820132, 98826826, 98833585, 98842216, 98856145, 98875809, 98896080, 98909491, 98913121, 98912477, 98917121, 98931426, 98948479, 98954129, 98937958, 98901647, 98858267, 98823166, 98805124, 98804206, 98816168, 98836905, 98863083, 98890364, 98913556, 98929888, 98942107, 98956579, 98977333, 99001575, 99021429, 99030131, 99027306, 99018091, 99008268, 99001205, 98998570, 99002784, 99015737, 99034745, 99051064, 99055099, 99045599, 99033529, 99035597, 99061084, 99104226, 99148297, 99178070, 99188918, 99185836, 99176162, 99165022, 99157846, 99163061, 99188727]
3834.4I9188727M3899M5061K2948j0896l3551k9159k861K3526L0494J6290m083j3966
3858.9I9276429r012L368J4514K2012K7078K7823J9265J090j6880k1565r703N829Q059
3885.4I9348307o676k2578j9735N203L3856M4006L0750R602l010q273k1070m7321o9642
3912I9273419o1732j8412L2461N3912L7354J2917J7076M9901P0978M1884k7216q1229
3936.4I9401313p5871k6947M172k0396o5881n7090L4499J44136J69754Q3042k8026
3958.9I9562705m7005L2634P6520n2297l13145m73994l28374N3537L30949K32458o5750
3981.3I9008238L2044%r4527R58800j23954p6329M7642K48086
3997.6A00000000
$$ y = [99188727, 99232626, 99277687, 99300635, 99289739, 99256188, 99227029, 99224168, 99247694, 99278188, 99294478, 99290395, 99276429, 99267417, 99270785, 99285299, 99307311, 99334389, 99362212, 99381477, 99382567, 99365687, 99344122, 99334419, 99340248, 99348307, 99341631, 99319053, 99299318, 99304521, 99338377, 99382383, 99413133, 99422735, 99419725, 99411452, 99390382, 99343061, 99273419, 99211687, 99193275, 99225736, 99279648, 99317002, 99329919, 99346995, 99396896, 99467874, 99509758, 99482542, 99401313, 99325442, 99298495, 99302667, 99282271, 99216390, 99159300, 99193799, 99337935, 99507689, 99590731, 99562705, 99515700, 99548334, 99624854, 99572557, 99259412, 98785418, 98457044, 98510581, 98841530, 99073988, 99008238, 99040282, 99040282, 98945755, 99904555, 99780601, 99704272, 99751914, 100000000]
##END=$$ End of the data block
