##TITLE=Ekopro d maior que 1,0 e menor que 1,28 $$ Begin of the data block
##JCAMP-DX=5.00 $$ ACD/SpecManager v 10.08
##SPECTROMETER/DATA SYSTEM=Alpha
##DATE=05 Nov 2014 10:34:16
##DATA TYPE=INFRARED SPECTRUM
##DATA CLASS=XYDATA
##ORIGIN=
##OWNER=
##NPOINTS=1765
##FIRSTX=399.76428223
##LASTX=3997.64306641
##MAXX=3997.64306641
##MINX=399.76428223
##MAXY=0.83367139
##MINY=0.05820152
##XFACTOR=1.0000000000
##YFACTOR=1.000000000000000e-9
##FIRSTY=0.80656719
##DELTAX=2.03961372
##XUNITS=1/CM
##YUNITS=ARBITRARY UNITS
##XYDATA=(X++(Y..Y))
399.8H06567192J15454j269817j703918j656711k073586k666652k979398l258765m258275
$$ 806567192 806682646 805412829 803708911 802052200 799978614 797311962 794332564 791073799 786815524
418.1G86815524l490925p96497L45529P42733O22153K93136P28309J605630J808882
$$ 786815524 783324599 782528102 782873631 783616364 784238517 784531653 785259962 786865592 788674474
436.5G88674474J471579J355350J836836K689660L020286K479673J486957R93609M85838
$$ 788674474 790146053 791501403 793338239 796027899 799048185 801527858 803014815 804008424 804494262
454.8H04494262k52784O6996L49820n28336j564443k009571k101779k354860k302348
$$ 804494262 804241478 804308474 804658294 804129958 802565515 800555944 798454165 796099305 793796957
473.2G93796957j933337j884639j835823j917422k201855k109408k095819k793908
$$ 793796957 791863620 789978981 788143158 786225736 784023881 781914473 779818654 777024746
489.5G77024746l864288m776478n245149m605413k163112J584947M909158O471038
$$ 777024746 773160458 768383980 763138831 758533418 756370306 757955253 762864411 769335449
505.8G69335449O907522O083429L955841J875222P59780P28846J183152J270652J261473
$$ 769335449 776242971 782326400 786282241 788157463 788917243 789646089 790829241 792099893 793361366
524.2G93361366J800298K264083K240539K345681K575934K692341K704263K743840
$$ 793361366 795161664 797425747 799666286 802011967 804587901 807280242 809984505 812728345
540.5H12728345K662123K285480J960874J897037J903057J853406J752675J600921
$$ 812728345 815390468 817675948 819636822 821533859 823436916 825290322 827042997 828643918
556.8H28643918J387119J062215P67827M78089L84211N72682L48389n4837j2219R3997
$$ 828643918 830031037 831093252 831861079 832339168 832723379 833296061 833644450 833589613 833577394 833671391
577.2H33671391m2856j17242m6015k5272j59800m61579o23941m45128k99871l49879
$$ 833671391 833628535 833511293 833465278 833440006 833280206 832818627 832194686 831749558 831449687 831099808
597.6H31099808l82483m73678n65469m32909l02016m56810o67513p15434p66814o88791
$$ 831099808 830717325 830243647 829678178 829245269 828943253 828486443 827818930 827103496 826336682 825647891
618H25647891n06223q43525j665890k561092m851878o965816k653718M959583O082297
$$ 825647891 825141668 824298143 822632253 820071161 815219283 808253467 805599749 810559332 816641629
636.4H16641629K316594q9765r07361j210988j083493j038849j402319j735568j467347
$$ 816641629 818958223 818868458 817961097 816750109 815666616 814627767 813225448 811489880 810022533
654.7H10022533p15673l71337n80430r72092j593590k876937l282547j906991k434492
$$ 810022533 809306860 808935523 808355093 807383001 805789411 802912474 799629927 797722936 795288444
673.1G95288444l919006m547298l606081j217425P94053J071036J50562j004696k214909
$$ 795288444 791369438 786822140 783216059 781998634 782792687 783863723 784014285 783009589 780794680
691.4G80794680l803313o021678q847892j1631012j2645603j1566698j0295093r797752
$$ 780794680 776991367 770969689 762121797 750490785 737845182 726278484 715983391 706185639
707.7G06185639r455323j0162652j5569091k9470741n5116892r3309313j26506508
$$ 706185639 696730316 686567664 670998573 641527832 586410940 493101627 366595119
722C66595119j19615614o6757828n060226L4314245N6021243P5656206R8212689J14127785
$$ 366595119 246979505 180221677 175161451 209475696 265496939 341153145 439365834 553493619
738.3E53493619J07867181P9347790M6097874K2501052R869277L930450J166880k04921
$$ 553493619 661360800 740708590 786806464 809307516 819176793 823107243 824274123 824069202
754.7H24069202r80139j424074j642525j903355k295375k688408l018618l188789l267407
$$ 824069202 823089063 821664989 820022464 818119109 815823734 813135326 810116708 806927919 803660512
773H03660512l363490l525615m061460n193413o909728r515524j3080835j6295731
$$ 803660512 800297022 796771407 792709947 787516534 780606806 771091282 758010447 741714716
789.3G41714716j5383601o159246P829129J4765502J0079562K429664r77873j228273
$$ 741714716 726331115 720171869 728000998 742766500 752846062 755275726 754297853 753069580
805.6G53069580p96736m66644j47880L15547N19991K74539k51412r95517j805365k534091
$$ 753069580 752272844 751806200 751658320 751973867 752493858 752768397 752516985 751521468 749716103 747182012
826G47182012l256977m147530n104959n725145n705893n027652l856361k637267j785636
$$ 747182012 743925035 739777505 734672546 728947401 723241508 718213856 714357495 711720228 709934592
844.4G09934592j076400j74344P12097J256049J301586O92726q87871m115343r561777
$$ 709934592 708858192 708683848 709395945 710651994 711953580 712646306 711758435 707643092 698081315
862.8F98081315j7308891k6751995l4952045l4544825k0096481J284003J7323077K4042785
$$ 698081315 680772424 654020429 619068384 584523559 564427078 565711081 583034158 607076943
879.1F07076943K3686409J9382834J4068842R382308N532324K397120L05951j83106
$$ 607076943 630763352 650146186 664215028 673597336 679129660 681526780 681832731 681649625
895.4F81649625J186014M232645Q244991J1985242J4245570J4475822J2823105J0040224
$$ 681649625 682835639 687068284 695313275 707298517 721544087 736019909 748843014 758883238
911.7G58883238P108152M559159K523124J061380J16706n03957q75473r50754q31664
$$ 758883238 765991390 770550549 773073673 774135053 774251759 773747802 772872329 771921575 771089911
930.1G71089911o40749m28737k61187j51813j08898k28167n59389r57489j273453j524926
$$ 771089911 770449162 770020425 769759238 769607425 769498527 769270360 768710971 767753482 766480029 764955103
950.5G64955103j842320k395510l172934m037023m996836o169260p429599q272589
$$ 764955103 763112783 760717273 757544339 753507316 748510480 742341220 734911621 726639032
966.8G26639032q017361o057560k560735J120448L513694M294872L954232L051341
$$ 726639032 718621671 712564111 710003376 711123824 714637518 718932390 722886622 725937963
983.1G25937963J981914R81271M00543J57535m72665j730025l215134m743099o220817
$$ 725937963 727919877 728901148 729301691 729459226 728986561 727256536 724041402 719298303 713077486
1001.4G13077486q152962j2463689k0859659l5184800n9255600q5280270q3053261
$$ 713077486 704924524 692460835 671601176 636416376 577160776 491880506 408827245
1015.7D08827245l5578221K6035458N8002412N4724157L7703097K0227134O316543
$$ 408827245 373249024 399284482 457286894 512011051 549714148 569941282 576257825
1030E76257825j641452n399347p655501q670211p446706l466606K670884R536445J5528738
$$ 576257825 574616373 569217026 561561525 552891314 545444608 541978002 544648886 554185331 569714069
1048.4E69714069J9437135K0721435J9367814J5521109R933412L947497j500428o247103
$$ 569714069 589151204 609872639 629240453 644761562 654694974 658642471 657142043 650894940
1064.7F50894940j0571540j5207469k0817399k7356267l4217775m0483892m5080900
$$ 650894940 640323400 625115931 604298532 576942265 542724490 502240598 457159698
1079D57159698m7037691m6229482m3963909m1886151l9923057l6561742l0796215k2969931
$$ 457159698 410122007 363892525 319928616 278042465 238119408 201557666 170761451 147791520
1095.3A47791520j4143303n231783L196835J0896385J7233700K0397261J7661169Q863032
$$ 147791520 133648217 128416434 131613269 142509654 159743354 180140615 197801784 206664816
1111.6B06664816j392320p705212p909551k987906M416421J1457517J6094029J7756611
$$ 206664816 205272496 197567284 189657733 186669827 191086248 202543765 218637794 236394405
1127.9B36394405J7913521J8885106K1915853K6425659L1042308L5232603L9329499
$$ 236394405 254307926 273193032 295108885 321534544 352576852 387809455 427138954
1142.2D27138954M2959243M4570208M3182612L9235055L3542156K6682377J9488990
$$ 427138954 470098197 514668405 557851017 597086072 630628228 657310605 676799595
1156.5F76799595J2916446P388175K568364k507091q437931j3668359j4876246j0410547
$$ 676799595 689716041 697104216 699672580 697165489 688727558 675059199 660182953 649772406
1172.8F49772406k128244O406009J2471378J4925838J3703584R855092N214155J181423
$$ 649772406 647644162 654050171 666521549 681447387 695150971 705006063 710220218 711401641
1189.1G11401641j874327m168093n812228o793618p331193p739663q189440q714974
$$ 711401641 709527314 705359221 699546993 692753375 685422182 677682519 669493079 660778105
1205.4F60778105r310901j0110617j1444926j3575673j6682863k0823360k5599181
$$ 660778105 651467204 641356587 629911661 616335988 599653125 578829765 553230584
1219.7E53230584l0257523l4235806l7455290m0514589m4383704m9016148n2350551
$$ 553230584 522973061 488737255 451281965 410767376 366383672 317367524 265016973
1234B65016973n1310450m4489533l3716872k2617750j3701088p585370l871358j944580
$$ 265016973 213706523 169216990 135500118 112882368 99181280 91595910 87724552 85779972
1250.3H5779972j329578j739621k706126l311149k761178r68188J425817L917359O158889
$$ 85779972 84450394 82710773 80004647 76693498 73932320 72964132 74389949 78307308 84466197
1268.6H4466197P793203Q317642P561914O136261M971877M679337N258262O531984
$$ 84466197 92259400 100577042 108138956 114275217 119247094 123926431 129184693 135716677
1285A35716677Q337527J0879010J4446512J9405678K5906905L3266992L9120272M0320098
$$ 135716677 144054204 154933214 169379726 188785404 214692309 247959301 287079573 327399671
1301.3C27399671L6701650L2545864L1742811L2957584L3295989L2038629K9777706
$$ 327399671 364101321 396647185 428389996 461347580 494643569 526682198 556459904
1315.6E56459904K8059125K7581751K6980400K4912536K0565868J3366818L085256
$$ 556459904 584519029 612100780 639081180 663993716 684559584 697926402 701011658
1329.8G01011658j0177255k4323285l4712970l6112904k3743809Q20399K5847137M0458321
$$ 701011658 690834403 666511118 631798148 595685244 571941435 572761834 598608971 639067292
1346.2F39067292M0203750L0066908J8407225R119630J847863n168855j4353394k6506067
$$ 639067292 679271042 709337950 727745175 736864805 738712668 733543813 719190419 692684352
1362.5F92684352l4498870l3134580k5050342j0945260L810227J5114307K0302296
$$ 692684352 658185482 625050902 600000560 589055300 592865527 607979834 628282130
1376.7F28282130J9759774J6261160J0725916M516125j064301m917681p749319j2160004
$$ 628282130 648041904 664303064 675028980 679545105 678480804 673563123 665813804 653653800
1393.1F53653800j7451524k0952165k6419223l3716023m4921517n9430927n3569824
$$ 653653800 636202276 615250111 588830888 555114865 510193348 450762421 397192597
1407.3C97192597j6943305L7307471Q0405891Q7727844P2618306N2127183K7386665
$$ 397192597 380249292 417556763 497962654 585690498 658308804 710435987 737822652
1421.6G37822652J0708809J931786n516648j3194859j7945349j9140661k1494210j8818915
$$ 737822652 748531461 750463247 744946599 731751740 713806391 694665730 673171520 654352605
1437.9F54352605r426772m549742l263593l433406m637778m495919k810537N4299O680668
$$ 654352605 644925833 640376091 637112498 633679092 629041314 624545395 621734858 621789157 628469825
1456.3F28469825J8283546K1727144K0171881K0625711J8069803J0695637N304455
$$ 628469825 646753371 668480515 688652396 709278107 727347910 738043547 743348002
1470.6G43348002N430341Q420050Q889735P673800O465852N568624M059672K041042
$$ 743348002 748778343 757198393 766088128 773761928 780227780 785796404 789856076 791897118
1486.9G91897118P08878N56648j157940o721854j6056001k6344061l3623457l1388819
$$ 791897118 792605996 793162644 792004704 785282850 769226849 742882788 709259331 677870512
1503.2F77870512j2774408K8065086M1242241K4502457J2686014M895806R79960o91235
$$ 677870512 665096104 693161190 734403431 758905888 771591902 776487708 777467668 776776433
1519.5G76776433j506805k35022R71199J645922K080262J431107J733303J999558m25399
$$ 776776433 775269628 775034606 776005805 777651727 779731989 781163096 782896399 784895957 784470558
1537.9G84470558k831518j89603K209902J661479P5102j364052j812160k459705l793478
$$ 784470558 781639040 781449437 783659339 785320818 785395920 784031868 782219708 779760003 775966525
1556.2G75966525n335867j635254J059115j584410m513562p972777j1628986j2847363
$$ 775966525 770630658 768995404 770054519 768470109 763956547 755983770 744354784 731507421
1572.6G31507421j7258943j9679963l732681J4020264K2098303K0204782J2820125
$$ 731507421 714248478 694568515 690835834 704856098 726954401 747159183 759979308
1586.8G59979308O544292L222167J523376K40564j070082k651155m302144n524814
$$ 759979308 766523600 769745767 771269143 771509707 770439625 767788470 763486326 757961512
1603.2G57961512o374061p287145p510007n991935l076375J136243O786526P340133
$$ 757961512 751587451 744300306 736790299 730798364 727721989 728858232 735644758 742984891
1619.5G42984891L331304N14626p8559k00093k65419o72996k455294l251434j68025
$$ 742984891 746316195 746830821 746752262 746552169 746286750 745613754 743158460 739907026 739739001
1637.8G39739001J194358j28389k055406l919840k680719q54909l583789m458607m80949
$$ 739739001 740933359 740804970 738749564 734829724 732149005 731294096 727710307 723251700 722770751
1656.2G22770751j483024m860460p699848p925033p328630r625017j0902882q509397
$$ 722770751 721287727 716427267 708727419 700802386 693473756 683848739 672945857 664436460
1672.5F64436460r493828j1197329j0147333j0202825j2092590j2469471p063270o110608
$$ 664436460 654942632 643745303 633597970 623395145 611302555 598833084 591769814 585659206
1688.8E85659206r554744j2673497k0380795k8218985l5030245m8801035m7694624
$$ 585659206 576104462 563430965 543050170 514831185 479800940 430999905 383305281
1703.1C83305281n3341806o5625637o1245531n1838979m0789530k8904699j7428659
$$ 383305281 329963475 264337838 203092307 151253328 110463798 81559099 64130440
1717.4F4130440n928922L81000K558928L858179N598456P635861J0709323J8569746
$$ 64130440 58201518 58582518 61141446 64999625 70598081 78233942 88943265 107513011
1733.7A07513011K8457641L6260113N5640981P6466769Q4779978Q4079563P5550199
$$ 107513011 135970652 172230765 227871746 304338515 389118493 473198056 548748255
1748E48748255O4988971M9991071L2751918K2693574J7544270J2682437J0080457Q065224
$$ 548748255 613737226 663728297 696480215 719173789 736718059 749400496 759480953 767546177
1764.3G67546177N505741L520965K253831K456843L608942L317893K027333J443743
$$ 767546177 773051918 776572883 778826714 781283557 784892499 788210392 790237725 791681468
1780.6G91681468J462877J438618J189530M76360o17325k06292J201034J010001J53839
$$ 791681468 793144345 794582963 795772493 796248853 795631528 795425236 796626270 797636271 797790110
1799G97790110J59383Q17954P11203J6451n83828m70101J1921o8784l84152l13521
$$ 797790110 797949493 798767447 799478650 799495101 798911273 798441172 798453093 798384309 798000157 797686636
1819.4G97686636k77876n03064j96218K51710O72758J799881K225757J590908J277804
$$ 797686636 797408760 796905696 796709478 796961188 797633946 799433827 801659584 803250492 804528296
1837.7H04528296J149535N09739L65019J534402K174735J781643J296222Q94129O30260
$$ 804528296 805677831 806187570 806552589 808086991 810261726 812043369 813339591 814233720 814863980
1856.1H14863980M80830M52221L48747r5427q31187q80897M24385J096666N18501o2406
$$ 814863980 815344810 815797031 816145778 816050351 815219164 814338267 814762652 815859318 816377819 816315413
1876.5H16315413k21253k89440l97146n10752p34925r63748o35266l21984n72443n56410
$$ 816315413 816094160 815804720 815407574 814896822 814161897 813198149 812562883 812240899 811668456 811112046
1896.9H11112046m15385n59687p27952p95722q92877q91984o47902n65052r35257j297354
$$ 811112046 810696661 810136974 809409022 808613300 807720423 806828439 806180537 805615485 804680228 803382874
1917.3H03382874j054407q24749p96080o13987p49171j092136j248419j365066j504659
$$ 803382874 802328467 801503718 800707638 800093651 799344480 798252344 797003925 795638859 794134200
1935.6G94134200j661301k006114k290785j804292r57489n72145l75569j24216J61588
$$ 794134200 792472899 790466785 788176000 786371708 785414219 784842074 784466505 784342289 784503877
1954G84503877M74930P50720R86577J246213J375795J346886J427591J416802J125455
$$ 784503877 784978807 785729527 786716104 787962317 789338112 790684998 792112589 793529391 794654846
1972.3G94654846Q36015O82354N56707M60387M39941L99292L34740L13460L46542O21140
$$ 794654846 795490861 796173215 796729922 797190309 797630250 798029542 798364282 798677742 799024284 799645424
1992.7G99645424R78947R45746P39635O49154N78463M87089M02033L66807L70324L26633
$$ 799645424 800624371 801570117 802309752 802958906 803537369 804024458 804426491 804793298 805163622 805490255
2013.1H05490255K17498K18987L62694L93391K96712K50220K16961J48833J03831P2122
$$ 805490255 805707753 805926740 806289434 806682825 806979537 807229757 807446718 807595551 807699382 807771504
2033.5H07771504L2186k7239q8572r3937r8348j76668k46465k67566k77996l13580
$$ 807771504 807803690 807776451 807687879 807593942 807495594 807318926 807072461 806804895 806526899 806213319
2053.9H06213319l69191l83139l96013m93169n85615n17428l94464l97384m88579n34713
$$ 806213319 805844128 805460989 805064976 804571807 803986192 803468764 803074300 802676916 802188337 801653624
2074.3H01653624m73202l67939l10898l41594m12405m01318l18706k69294k79843l08574
$$ 801653624 801180422 800812483 800501585 800159991 799747586 799346268 799027562 798758268 798478425 798169851
2094.7G98169851k78651k02716j61350j59204j37686j12713j12354j03176p7725m6730
$$ 798169851 797891200 797688484 797527134 797367930 797230244 797117531 797005177 796902001 796824276 796777546
2115.1G96777546N484P5877J23679J16945P5817R0778J13725N7876L2783P5758J04010
$$ 796777546 796783030 796858907 796982586 797099531 797175348 797266126 797379851 797437727 797470510 797546268 797650278
2137.5G97650278R6738J04070J39832J62184J86742K50876L13163L25024L16083L52979
$$ 797650278 797747016 797851086 797990918 798153102 798339844 798590720 798903883 799228907 799544990 799897969
2157.9G99897969L84509L56973L50654L58760L52860L44634K76982J83344J69873J97948
$$ 799897969 800282478 800639451 800990105 801348865 801701725 802046359 802323341 802506685 802676558 802874506
2178.3H02874506J78933J13964O6936P7784P3135J5735k3782j3351j5498r2566k18272
$$ 802874506 803053439 803167403 803234339 803312123 803385258 803400993 803377211 803363860 803348362 803255796 803037524
2200.8H03037524k99454k95519k64228k30849j65462p6830j8955j3351k9266q3566
$$ 803037524 802738070 802442551 802178323 801947474 801782012 801705182 801686227 801672876 801643610 801560044
2221.2H01560044j42157j44243j40488j48952j58370j43766r2864q0586j16348j54316
$$ 801560044 801417887 801273644 801133156 800984204 800825834 800682068 800589204 800508618 800392270 800237954
2241.6H00237954j86682j87814j50562j45852j82390j87576j35899o9618k1696K5451
$$ 800237954 800051272 799863458 799712896 799567044 799384654 799197078 799061179 798991561 798969865 798995316
2262G98995316M4048k861n4896j19865k26796l06010l96550m89235m94539m00841k06590
$$ 798995316 799039364 799036503 798981607 798861742 798634946 798328936 797932386 797443151 796948612 796547771 796341181
2284.4G96341181p987J44481K97785M35472M89056M11630K87652K24709J66178K1338
$$ 796341181 796333194 796477675 796775460 797210932 797699988 798111618 798399270 798623979 798790157 798811495
2304.8G98811495j41203k41101k71022k58446l50773o08504q17537q17061o17623k78235
$$ 798811495 798670292 798429191 798158169 797899723 797548950 796940446 796122909 795305848 794688225 794409990
2325.2G94409990r7394k06291k72274k43724k55048k21729k43247k70545q703N44966
$$ 794409990 794312596 794106305 793834031 793590307 793335259 793113530 792870283 792599738 792591035 793136001
2345.6G93136001P37965L5763j079739j712620j555741j193344q29041m38035j69635
$$ 793136001 793873966 793909729 792829990 791117370 789561629 788368285 787539244 787101209 786931574
2363.9G86931574N1618L12209M91738N59807N54741N83768O63816O59705N37932L83257
$$ 786931574 786983192 787295401 787787139 788346946 788901687 789485455 790149271 790808976 791346908 791730165
2384.3G91730165K35618J40726J31667J61707J86861J83046K07185K88129L46184L70681
$$ 791730165 791965783 792106509 792238176 792399883 792586744 792769790 792976975 793265104 793611288 793981969
2404.7G93981969L91066L74437L43382L38376L20554K97963L44694M16517M12345L83139
$$ 793981969 794373035 794747472 795090854 795429230 795749784 796047747 796392441 796808958 797221303 797604442
2425.1G97604442L76165L64065L48270L47733L27408K64347K49147K53201K06113J45614
$$ 797604442 797980607 798344672 798692942 799040675 799368083 799632430 799881577 800134778 800340891 800486505
2445.5H00486505R9361J16944J46687R1493L0101M351j9729q881K1815K4796k1935
$$ 800486505 800585866 800702810 800849497 800940990 800971091 800975442 800955713 800946832 800968647 800993443 800971508
2467.9H00971508j02639j54913j62959j56998j64032j71960j55449j79827k39611k65955
$$ 800971508 800868869 800713956 800550997 800393999 800229967 800058007 799902558 799722731 799483120 799217165
2488.3G99217165k98858l19660k91824k53976k13325j78992j85311j85549j55092j37269
$$ 799217165 798918307 798598647 798306823 798052847 797839522 797660530 797475219 797289670 797134578 796997309
2508.7G96997309j07050j00970j51992j55270j02461p3671q6844j18792j05143m1902
$$ 796997309 796890259 796789289 796637297 796482027 796379566 796305895 796219051 796100259 795995116 795953214
2529.1G95953214K6643N4479J2219o080k503l3379j4245L5107K1338J1623K3961J8001
$$ 795953214 795979857 796034336 796046555 796040475 796037972 796004593 795990348 796025455 796046793 796058416 796082377 796100378
2553.6G96100378M7803P8559N4002L3080P2718J19746J19209R1672M0114k682n603
$$ 796100378 796148181 796226740 796280742 796313822 796386540 796506286 796625495 796717167 796757281 796754599 796748996
2576G96748996J7345P3671J75357K80559L20554L01480K82586K75671K64466K29776
$$ 796748996 796766341 796840012 797015369 797295928 797616482 797917962 798200548 798476219 798740685 798970461
2596.4G98970461J95205J82629J42634N7161P689Q821j6034Q047O4552J728q8274j37270
$$ 798970461 799165666 799348295 799490929 799548090 799555779 799564600 799548566 799556613 799621165 799622893 799534619 799397349
2620.9G99397349j89006j75297j04428k4378J37568L52502M65571M44651L82841L15845
$$ 799397349 799208343 799033046 798928618 798904240 799041808 799394310 799859881 800304532 800687373 801003218
2641.3H01003218K23100J41859R5725N7638K7358M0412O6161O0022N5194M1127L8326
$$ 801003218 801226318 801368177 801463902 801521540 801548898 801589310 801655471 801715493 801770687 801811814 801850140
2663.7H01850140O4790L9518j1503j9074l3200l1650K7657O9797P1466N1200Q166n0008
$$ 801850140 801914930 801954448 801942945 801923871 801890671 801859021 801886678 801956475 802027941 802079141 802087307 802037299
2688.2H02037299p3731l9161k9027o8128j08361j19984j16706j30475j50084j44422
$$ 802037299 801963568 801924407 801895380 801827252 801718891 801598907 801482201 801351726 801201642 801057220
2708.6H01057220q9944n3584j16230j63853j10388j20639k60532l17633k21670j84655
$$ 801057220 800967276 800913692 800797462 800633609 800523221 800402582 800142050 799824417 799602747 799418092
2729G99418092k35558k38001k19405j83999j33932j29402j99198l11196l24250k35617
$$ 799418092 799182534 798944533 798725128 798541129 798407197 798277795 798078597 797767401 797443151 797207534
2749.4G97207534j59859j42217j52648j09374m8935m2379k7836L934j2338k2888k7180
$$ 797207534 797047675 796905458 796752810 796643436 796594501 796552122 796524286 796528220 796515882 796492994 796465814
2771.8G96465814q2016j14381r8527j17898k10762k84969k73943k30432k01285k23279
$$ 796465814 796383798 796269417 796170890 796052992 795842230 795557261 795283318 795052886 794851601 794628322
2792.2G94628322k88427l19361l06011k91407k59042j66177l5942O5386J14441J36793
$$ 794628322 794339895 794020534 793714523 793423116 793164074 792997897 792961955 793027341 793141782 793278575
2812.6G93278575J17183L2663q6486k13623l20375l54529l49581m04358n04970n84305
$$ 793278575 793395758 793428421 793341935 793128312 792807937 792453408 792103827 791699469 791194499 790610194
2833G90610194o63698p09533p42138q47995r72986j117170j285434j389920j402677
$$ 790610194 789946496 789236963 788494825 787646830 786673844 785556674 784271240 782881320 781478643
2851.4G81478643j325368j141608r06766p81059p98047q10444p79331q01742r02235
$$ 781478643 780153275 779011667 778104901 777323842 776525795 775715351 774936020 774134278 773232043
2869.7G73232043j051605j208365j372933j635373j939952k125264k090215j750171
$$ 773232043 772180438 770972073 769599140 767963767 766023815 763898551 761808336 760058165
2886.1G60058165j140356l87967M26114J084387J366436J286805R15527M64380K87652
$$ 760058165 758917809 758529842 758955956 760040343 761406779 762693584 763609111 764073491 764361143
2904.4G64361143N55039J155257J744568J998484J895428J625955J285374Q78752M51922
$$ 764361143 764916182 766071439 767816007 769814491 771709919 773335874 774621248 775500000 775951922
2922.8G75951922m17n31197j109064j773417k634644l685653m973173o515921q045196
$$ 775951922 775951505 775420308 774311244 772537827 769903183 766217530 761244357 754728436 746683240
2941.1G46683240r344697j0313928j0735631j0492146r608627q208811o449878m386067
$$ 746683240 737338543 727024615 716288984 705796838 696188211 687979400 681529522 677143455
2957.4F77143455k120078J31726K115369L667116M773677N535483O048381O237388
$$ 677143455 675023377 675155103 677270472 680937588 685711265 691246748 697295129 703532517
2973.8G03532517O033063N567610N020857M513264M103124L786862L575563L394902
$$ 703532517 709565580 715133190 720154047 724667311 728770435 732557297 736132860 739527762
2990.1G39527762L105521K739966K427936K241730K172292K125203K116561K252877
$$ 739527762 742633283 745373249 747801185 750042915 752215207 754340410 756456971 758709848
3006.4G58709848K378344K392591K458810K623916K737463K641856K408624K128422
$$ 758709848 761088192 763480783 765939593 768563509 771300972 773942828 776351452 778479874
3022.7G78479874J797199J508236J284182J061798Q56697O24120K57135k19822q02398
$$ 778479874 780277073 781785309 783069491 784131289 784987986 785612106 785869241 785649419 784847021
3041.1G84847021j625299k735436l833592m247129l493071j890719j94371R23813J047253
$$ 784847021 783221722 780486286 776652694 772405565 768912494 767021775 766827404 767751217 768798470
3059.4G68798470L68596m09484o43909l17037J11878L81887M05728J88232J2874J55628
$$ 768798470 769167066 768757582 768113673 767796636 767908514 768290401 768696129 768884361 768897235 769052863
3079.8G69052863O66320J360417J901686K118945J876950J148522K25187o06716j096606
$$ 769052863 769719183 771079600 772981286 775100231 776977181 778125703 778350890 777744174 776647568
3098.2G76647568j046956m56929M30047J263082J827717J990915J883089J689494J291394
$$ 776647568 775600612 775143683 775573730 776836812 778664529 780655444 782538533 784228027 785519421
3116.5G85519421P44343K26676j78516k79784m7743L37839P24793J005768J107991
$$ 785519421 786263764 786490440 786311924 786032140 785984397 786322236 787047029 788052797 789160788
3134.9G89160788J049817Q68380O12735M72188M62890M22597L62337L21686K84135
$$ 789160788 790210605 791078985 791691720 792163908 792626798 793049395 793411732 793733418 794017553
3153.2G94017553K59579K50697K39253K10941J18494q643j7703M7803O0857O5148O9022
$$ 794017553 794277132 794527829 794767082 794978023 795096517 795087874 795070171 795117974 795178831 795243979 795313001
3175.7G95313001N8889J01090J33335J7643r9242j9669P0333L8922M9353Q6784J00315
$$ 795313001 795371890 795472980 795606315 795623958 795524716 795505047 795575380 795614302 795663655 795750439 795850754
3198.1G95850754J71244J98722J17063K4140k0921k0802n7936j37269j82569j89364
$$ 795850754 796021998 796220720 796337783 796361923 796341002 796320200 796262264 796124995 795942426 795753062
3218.5G95753062j15812j0252j3411m9055N96P2956N9009L338L0696Q5056O5327M4882
$$ 795753062 795637250 795626998 795613587 795564532 795565128 795638084 795697093 795700431 795731127 795816183 795881510 795926392
3243G95926392J22905J60396O4850J8239L7014L4809N484k5690K1995N6088K7596N1082
$$ 795926392 796049297 796209693 796274543 796292782 796329796 796364605 796370089 796344399 796366394 796422482 796450078 796501160
3267.5G96501160O5863k2412j09612q4878m8756o9678o0081l8565j05798j96397j48654
$$ 796501160 796567023 796544611 796434999 796350121 796301365 796231687 796171606 796133041 796027243 795830846 795682192
3289.9G95682192l9637l5584q2970j01387l6955J38998K28822J02997J1325N7578M6372
$$ 795682192 795642555 795606971 795524001 795422614 795385659 795524657 795753479 795856476 795867801 795925379 795971751
3312.3G95971751M232j9967n5612r2923j83463k48373k98798l50594k85507k05695
$$ 795971751 795975983 795956016 795900404 795807481 795624018 795375645 795076847 794726253 794440746 794235051
3332.7G94235051p4864J52290K58446K54869K36452K02656K76744M11213M01377K85447
$$ 794235051 794160187 794312477 794570923 794825792 795062244 795264900 795541644 795952857 796354234 796639681
3353.1G96639681K30372K36153K06113J89841J62482N0485q165j5438m9055k2709L3319
$$ 796639681 796870053 797106206 797312319 797502160 797664642 797715127 797706962 797691524 797642469 797619760 797653079
3375.5G97653079k5511j27852j84238k44915k55346k07782k34843l37183l69668m13299
$$ 797653079 797627568 797499716 797315478 797070563 796815217 796607435 796372592 796035409 795665741 795252442
3395.9G95252442n55217o21200o65485q62539j118720j313805j513839j722038j801431
$$ 795252442 794697225 794076025 793410540 792548001 791429281 790115476 788601637 786879599 785078168
3414.3G85078168j789153j896858k018392j871705j718164j734256j478672p64370
$$ 785078168 783289015 781392157 779373765 777502060 775783896 774049640 772570968 771806598
3430.6G71806598J8537N51700J046837J572013J776456J676262J485586J487613J759171
$$ 771806598 771825135 772376835 773423672 774995685 776772141 778448403 779933989 781421602 783180773
3449G83180773J754880J457215J248419J026869P97331P39276O91832M59492L12507
$$ 783180773 784935653 786392868 787641287 788668156 789465487 790204763 790896595 791356087 791668594
3467.3G91668594M85659O11722M21882J88827K4736j22368q226J73211K9088q5295
$$ 791668594 792154253 792765975 793187857 793376684 793401420 793279052 793270826 793444037 793473125 793387830
3487.7G93387830j1325j04248l43144m45247l95000m86791o50883m05430j24455l26693
$$ 793387830 793376505 793272257 792929113 792483866 792088866 791602075 790951192 790545762 790421307 790094614
3508.1G90094614m81844l68118l77953n37396o62863p95245r49264r55879q84951o99341
$$ 790094614 789612770 789244652 788866699 788329303 787666440 786871195 785921931 784966052 784081101 783381760
3528.5G83381760l55303k79784n60761p52866o29902o09577r02950j046479n93961
$$ 783381760 783026457 782746673 782185912 781433046 780803144 780193567 779290617 778244138 777650177
3546.9G77650177j728L5286N8889L76940L32296K1577o4671k65002p36237k9027J817882
$$ 777650177 777648449 777683735 777742624 778119564 778451860 778473437 778408766 778143764 777407527 777378500 779196382
3569.3G79196382K165794J291692P04289N51641M49240K72333k51650j117707r23812
$$ 779196382 781362176 782653868 783358157 783909798 784359038 784631371 784379721 783262014 782338202
3587.7G82338202M90010M90308n90444p73430l47197l32296l59475n06580j217485
$$ 782338202 782828212 783318520 782728076 781954646 781607449 781275153 780915678 780409098 779191613
3606G79191613j601696j111865q40843p13646o30319r82821l18885Q43465L91245j343190
$$ 779191613 777589917 776478052 775637209 774923563 774293244 773310423 772991538 773835003 774226248 772883058
3626.4G72883058k212346K17021K008080J542628J100600Q85784O80506M33743l96847
$$ 772883058 770670712 770887733 772895813 774438441 775539041 776424825 777105331 777539074 777142227
3644.8G77142227j614750j022160K406955L731847K307415J567006K012014J863361
$$ 777142227 775527477 774505317 776912272 780644119 782951534 784518540 786530554 788393915
3661.1G88393915J293599O95944k98798q60751K61128N64635J48058J909554K891243
$$ 788393915 789687514 790383458 790084660 789223909 789485037 790049672 790197730 792107284 794998527
3679.4G94998527K123415J059115j41323j000344j15216K013445K468586J539349N65291
$$ 794998527 797121942 798181057 798039734 797039390 796924174 798937619 801406205 802945554 803510845
3697.8H03510845j12176m3214O69957L72052r64344j579225q7321J753748J397669
$$ 803510845 803398669 803355455 804025412 804397464 803433120 801853895 801766574 803520322 804917991
3716.2H04917991R537q10206p13050k56718J48356K31147p12156k069175j772523N64694
$$ 804917991 804927528 804117322 803404272 803147554 803295910 803527057 802814901 800745726 798973203 799537897
3736.5G99537897J948595J002908r33886j596033k49624l22462n10156J327813J793802
$$ 799537897 801486492 802489400 801555514 799959481 799709857 799387395 798877239 800205052 801998854
3754.9H01998854O39259K03312Q58664P35879j52051m31538j02639P51257J191139
$$ 801998854 802638113 802841425 803700089 804435968 804283917 803852379 803749740 804500997 805692136
3773.3H05692136M11272n06222m74512K38955L90052K80977M09186K33232j71959p17282
$$ 805692136 806103408 805597186 805122674 805361629 805751681 806032658 806441844 806675076 806503117 805785835
3793.7H05785835j245916j173258j175284p21455P38740Q69095Q05319J158535M27187
$$ 805785835 804539919 803366661 802191377 801469922 802208662 803077757 803883076 805041611 805468798
3812H05468798r40502j542389r55224o65009M09960J506865R20713K66493k57373o88732
$$ 805468798 804528296 802985907 802030683 801365674 801775634 803282499 804203212 804469705 804212332 803523600
3832.4H03523600p23362j058400q85665N52297J474023J412093P61807m45306k098262
$$ 803523600 802800238 801741838 800856173 801408470 802882493 804294586 805056393 804611087 802512825
3850.8H02512825k831817K73108K636850J563490j23680r70066m03225K5511n20706
$$ 802512825 799681008 799954116 802590966 804154456 804030776 803060710 802657485 802682996 802162290
3869.1H02162290j11044Q75712J084983N56886n44190n40436R2149P7605M18067J64807
$$ 802162290 802051246 802926958 804011941 804568827 804024637 803484201 803576350 803653955 804072022 804236829
3889.5H04236829k87711M22358M96209o94990j398146q04246K74718J270890J455486
$$ 804236829 803949118 804371476 804867685 804172695 802774549 801970303 802245021 803515911 804971397
3907.9H04971397P57635K2172n11348q36491m73440K09272K33948k1458J50621J63019
$$ 804971397 805729032 805751204 805239856 804403365 803929925 804139197 804373145 804351687 804502308 804665327
3928.3H04665327k03550r4294M24802M90189J40726k54512l77297r5129n3823j58608
$$ 804665327 804461777 804367483 804792285 805282474 805423200 805168688 804791391 804696262 804642439 804483831
3948.7H04483831J86145M34697J95324o6697j17243j01804p511P9811n722j71900k83539
$$ 804483831 804669976 805104673 805299997 805233300 805116057 805014253 805006742 805086553 805080831 804908931 804625392
3971.1H04625392k63631r8169N9724K0027j04189j52707j37329j9253J04010K4975
$$ 804625392 804361761 804263592 804323316 804343343 804239154 804086447 803949118 803929865 804033875 804058850
3991.5H04058850j32203q2434R2209
$$ 804058850 803926647 803844213 803936422
3997.6H03936422
$$ 803936422
##END=$$ End of the data block
