##TITLE=Eduardo $$ Begin of the data block
##JCAMP-DX=5.00 $$ ACD/SpecManager v 10.08
##SPECTROMETER/DATA SYSTEM=Alpha
##DATE=30 Sep 2014 13:58:06
##DATA TYPE=INFRARED SPECTRUM
##DATA CLASS=XYDATA
##ORIGIN=
##OWNER=
##NPOINTS=1765
##FIRSTX=399.76428223
##LASTX=3997.64306641
##MAXX=3997.64306641
##MINX=399.76428223
##MAXY=1.00021744
##MINY=0.21807808
##XFACTOR=1.0000000000
##YFACTOR=0.000000010000000
##FIRSTY=1.00000000
##DELTAX=2.03961372
##XUNITS=1/CM
##YUNITS=ARBITRARY UNITS
##XYDATA=(X++(Y..Y))
399.8A00000000j521134j839793k996671m545772n321908l389842J303292N003404
416.1H6691576N985439M518712J835984M57888K75183K35218r4980o31297o02227n32973
436.5I8138523j088285j941926k794015l597575l755546k499634J93018L138429M346084
454.8I0139073L630316K431578J424897M87202l33959o86538r52828j897734k962453
473.2I1279554k192974N42885K811814K940088K044040J408690P96003J19948o7550
491.5I9682498J81019J36483k55775l89940j50460k12306p96151j272011j345390j272261
511.9I4305706p76899M61352J674914J762170Q98755K38132K63447L56674K6393k64472
532.3I8946172o3831J75846o2019l63296k05266L6186j83934n17100m24791k37518
$$ y = [100000000, 98478866, 96639073, 93642402, 89096630, 83774722, 80384880, 81688172, 86691576, 92677015, 97195727, 99031711, 99489599, 99764782, 100000000, 99905020, 99273723, 98671496, 98138523, 97050238, 95108312, 92314297, 88716722, 84961176, 82461542, 82654560, 85792989, 90139073, 93769389, 96200967, 97625864, 98113066, 97779107, 97092569, 96139741, 94242007, 91279554, 89086580, 89629465, 92441279, 95381367, 97425407, 98834097, 99630100, 99750048, 99682498, 99863517, 100000000, 99744225, 99354285, 99203825, 98991519, 98195368, 96923357, 95577967, 94305706, 93528807, 93990159, 95665073, 97427243, 98325998, 98564130, 98827577, 99184251, 99210644, 98946172, 98882341, 99058187, 98996168, 98632872, 98427606, 98463792, 98279858, 97762758, 97337967, 97100449]
552.7I7100449n23878j079994j402163j671649k292251k743083j962602O8426J957547
571.1H7450802K581704K303636J769120Q77791n22983j892686k143562n70851J858622
589.4I1711593K977502K264971J106381J73098m60434o36894p15297r04459q45528
607.8I4670933m75096k54053k97487j12003N24533R44328N15479l80272j109284j882315
628.2I2144763l325712n030972n369931l012777J031900M015773M754305M205132L229868
646.6I2642349K071035J219511R88793R12989N25492J79166K89076M70692K55650j06752
667I9448001k6255K97504J28818j70332q8382K20614J61332j66106j51831J67018J79619
689.4A00000000j34015j87528J14178J90413j10900k40397K4145J72317q2683k65259
$$ y = [97100449, 96576571, 95496577, 94094414, 92422765, 90130514, 87387431, 85424829, 85493255, 87450802, 90032506, 92336142, 94105262, 94983053, 94460070, 92567384, 90423822, 89852971, 91711593, 94689095, 96954066, 98060447, 98233545, 97773111, 97136217, 96420920, 95516461, 94670933, 94195837, 93941784, 93644297, 93532294, 94056827, 95001155, 95516634, 95136362, 94027078, 92144763, 88819051, 83788079, 78418148, 75405371, 76437271, 80453044, 85207349, 89412481, 92642349, 94713384, 95932895, 96921688, 97834677, 98360169, 98539335, 98828411, 99299103, 99554753, 99448001, 99421746, 99719250, 99848068, 99677736, 99589354, 99809968, 99971300, 99805194, 99653363, 99820381, 100000000, 99865985, 99678457, 99792635, 99983048, 99872148, 99631751, 99655896, 99828213, 99745530, 99480271]
709.8I9480271k6434J87981k2888k60902q4746J74511L0392k33346j21826J48606O0851
732.2I9332470k31898j93858Q1032N4538k37578k60120J7023P1800j93221k71195p516
754.7I8161477J10268j31088k82967p6103Q2850j18911l18664j69397J9074j26166
775.1I7150373l40652k22272M632r3264l46100l00890o6042j04195l70276m05294j97595
797.5I4708425j89293m41438n42873l88670l69668o40624q47877q11070q55815j193172
817.9H8427925j545632j709950j954740k505451l144074l860390n167872o669396o131220
836.2E5739200k147096K756083M563302K719563r7299r19986J875401O248504Q085227
854.6G8822899O667024M273313K435976J560814J521861J668781J407850Q55631M82320
$$ y = [99480271, 99453837, 99641818, 99618930, 99358028, 99273282, 99447793, 99478185, 99244839, 99123013, 99271619, 99332470, 99100572, 98906714, 98987746, 99042284, 98804706, 98544586, 98561609, 98633409, 98440188, 98168993, 98161477, 98271745, 98140657, 97857690, 97781587, 97864437, 97745526, 97426862, 97257465, 97276539, 97150373, 96809721, 96587449, 96592081, 96498817, 96152717, 95851827, 95785785, 95681590, 95311314, 94906020, 94708425, 94519132, 94077694, 93534821, 93146151, 92776483, 92135859, 91287982, 90476912, 89621097, 88427925, 86882293, 85172343, 83217603, 80712152, 77568078, 73707688, 68539816, 61870420, 55739200, 53592104, 56348187, 60911489, 63631052, 63533753, 62613767, 64489168, 70737672, 78822899, 85489923, 89763236, 92199212, 93760026, 95281887, 96950668, 98358518, 99214149, 99696469]
873I9696469L04604j073l65001m87786m26513n78016r72385j309943j602912j936334
893.4I2321110j658762j47348J620978K033704J104498J41794j95015k86221n28533
911.7I4406205p55316p21103o23709p44557r34368q97080p58457q52239j134926j318860
932.1H5665590j363159j365775j423406j716167k326548l149575l994167m768824n526704
950.5F0031265n617213l147757J972663O031942N923999K568060j270914m028487n702806
968.8E6760752o524855o373569n063972k719521J62991K874297M816929N744791N728614
987.2E5406457N085349M263294L498894K502561Q39662p46405l69614J324325J083267
1005.5G2887790j666891m871136p063783o845301k792281L822452Q894849R954464
$$ y = [99696469, 100001073, 100000000, 99634999, 99147213, 98720700, 98142684, 97170299, 95860356, 94257444, 92321110, 90662348, 90515000, 92135978, 94169682, 95274180, 95415974, 95220959, 94934738, 94406205, 93650889, 92929786, 92306077, 91561520, 90627152, 89730072, 88971615, 88119376, 86984450, 85665590, 84302431, 82936656, 81513250, 79797083, 77470535, 74320960, 70326793, 65557969, 60031265, 54414052, 51266295, 53238958, 59270900, 65194899, 67762959, 66492045, 62463558, 56760752, 50235897, 43862328, 38798356, 36078835, 36241826, 39116123, 43933052, 49677843, 55406457, 60491806, 64755100, 68253994, 70756555, 71596217, 70849812, 70480198, 71804523, 72887790, 71220899, 66349763, 59285980, 52440679, 49648398, 53470850, 62365699, 72320163]
1021.8G2320163Q132178N641568L709447K368891J305139N63455K18332m0889m85087
1040.2I3733197r33659j162034j330644j636356j927882k035398k136379k494866l049034
1058.6G7026945l589964m128599m672241m721838l587431j454997N10556J448828J454353
1076.9E8285612P42006n45156j310128M4620L006244N019432N022627M099280L243017
1095.3G7607554K583611J932276J318562R82958R23329Q40175O13958M37325M09544
1113.6H7649292L60185J92862Q6457J56778K27112J37949L0422P1961J34676L3409
1134H9081103j30135j61064j29545k33239m35149n50163o05422p74187j012898j092523
1154.4H3956778j007289j051724j407146j868254j960945j241577J13082J093078J037788
$$ y = [72320163, 80452341, 86093909, 89803356, 92172247, 93477386, 94040841, 94259173, 94218284, 93733197, 92799538, 91637504, 90306860, 88670504, 86742622, 84707224, 82570845, 80075979, 77026945, 73436981, 69308382, 64636141, 59914303, 56326872, 54871875, 55382431, 56831259, 58285612, 59027618, 58482462, 57172334, 57216954, 60223198, 65242630, 70265257, 74364537, 77607554, 80191165, 82123441, 83442003, 84424961, 85348290, 86188465, 86802423, 87239748, 87649292, 88009477, 88202339, 88288796, 88445574, 88672686, 88810635, 88841057, 88913018, 89047694, 89081103, 88950968, 88789904, 88660359, 88427120, 87991971, 87441808, 86836386, 86062199, 85049301, 83956778, 82949489, 81897765, 80490619, 78622365, 76661420, 75419843, 75532925, 76626003, 77663791]
1172.8G7663791M66973N746l77870q03912j264846j812381k374231k743382k896463
1191.1F5863425l010381l180361l291112l154176k650458j763144o38834L53995Q46360
1209.5D9375314R69404J320075K228803L387272M194975M261780L652167K657473J474655
1227.9G3521918K74104p36260j524336k207440k641082k352637j083678M30018P05344
1246.2F4385951n46998j731616j666040j208365j254689n02009K357269N044430M453033
1264.6F9330966J725573l67141j449841k225316l033393m034418m635543l320670l11279
1282.9E1678938J513076Q63099o16169j579333j987055k097472k073834j966145j749104
1301.3D1986001j356802p86051k08595Q2552k7046l61189o50686p07847m65762k998
$$ y = [77663791, 78130764, 78136510, 77758640, 76954728, 75689882, 73877501, 71503270, 68759888, 65863425, 62853044, 59672683, 56381571, 53227395, 50576937, 48813793, 48174959, 48528954, 49375314, 50344718, 51664793, 53893596, 57280868, 61475843, 65737623, 69389790, 72047263, 73521918, 73796022, 73059762, 71535426, 69327986, 66686904, 64334267, 63250589, 63680607, 64385951, 63838953, 62107337, 60441297, 59232932, 57978243, 57476234, 59833503, 64877933, 69330966, 71056539, 70689398, 69239557, 67014241, 63980848, 59946430, 55310887, 51990217, 51678938, 53192014, 54055113, 53438944, 51859611, 49872556, 47775084, 45701250, 43735105, 41986001, 40629199, 39843148, 39634553, 39717105, 39690059, 39328870, 38678184, 37970337, 37504575, 37501577]
1321.7C7501577N11640R94158J413238J749298K007958K237594K531824K992671L403479
1340E5343437L297919K754694J954264P42292o78718j596564j531547o89441M27145
1358.4F0023481J478785K251464K426589K232557K077109J394754r16302m006749m322922
1376.7F2638766k091676j48470O72269n52928k575016j738519O48183P60227j096224
1395.1E6516612j814992J84113K872491L830117L241754K107310J361984J292872J531709
1413.5G1123970J654446J543468J208979O39140K04856O6542K23261M38488L73292
1431.8G7476442K92706P37316J209032Q42887J6183r52333j385146p01565K96146M20373
1452.2G8252041j52480q78519p17533N16242J198351J292736J192748J120091J138496
$$ y = [37501577, 38013217, 39007375, 40420613, 42169911, 44177869, 46415463, 48947287, 51939958, 55343437, 58641356, 61396050, 63350314, 64092606, 63413888, 61817324, 60285777, 59596336, 60023481, 61502266, 63753730, 66180319, 68412876, 70489985, 71884739, 70968437, 66961688, 62638766, 60547090, 60398620, 61070889, 60517961, 57942945, 56204426, 56852609, 57612836, 56516612, 54701620, 54885733, 57758224, 61588341, 64830095, 66937405, 68299389, 69592261, 71123970, 72778416, 74321884, 75530863, 76170003, 76374859, 76441401, 76664662, 77103150, 77476442, 77769148, 78506464, 79715496, 80558383, 80574566, 79622233, 78237087, 77535522, 77831668, 78252041, 78099561, 77221042, 76503509, 77019751, 78218102, 79510838, 80703586, 81823677, 82962173]
1470.6H2962173J167822R87452P59006O82866P13689P24911O06174M60326M11165M38672
1491H9914256M23777M06754M27825M16457L49784K88391L07966L24255J94454R6345
1511.4I3150264R4730J44714J47134L0929j15121r2005O2394J32769J52183K50548
1531.8I3958539L44163K92629K03353J06388q320K0855J13499K07180K64818K00271
1552.2I5703375N5039n9545l14969p76034p45142n32978k03217K53016M98677M55349
1572.6I4333571M38500M26495K09200J8710m5043m8828q3894j60771j93990j72233
1593I4721717k13540l40497l97772k90960j25712q1229j53482k34157k86758l35098
1613.4I2262512m40037n49078m19509k76977k90096k61044j85728j73074j41830o4730
$$ y = [82962173, 84129995, 85117447, 85876453, 86559319, 87273008, 87997919, 88604093, 89064419, 89475584, 89914256, 90338033, 90744787, 91172612, 91589069, 91938853, 92227244, 92535210, 92859465, 93053919, 93150264, 93244994, 93389708, 93536842, 93567771, 93452650, 93360645, 93423039, 93555808, 93707991, 93958539, 94302702, 94595331, 94798684, 94905072, 94896752, 94917607, 95031106, 95238286, 95503104, 95703375, 95758414, 95698869, 95383900, 94607866, 93862724, 93329746, 93126529, 93379545, 93878222, 94333571, 94772071, 95198566, 95407766, 95426476, 95381433, 95332605, 95248711, 95087940, 94893950, 94721717, 94508177, 94167680, 93769908, 93478948, 93353236, 93272007, 93118525, 92884368, 92597610, 92262512, 91822475, 91273397, 90853888, 90576911, 90286815, 90025771, 89840043, 89666969, 89525139, 89460409]
1633.7H9460409p1228j65003j97214j53965m2862K4057r269K9475J67662J85346K4122
1656.2H9251530o1965j09237k01947l34799m11797n93376q71950q66330p27731o71470
1676.6H4400928p10154q84860j090420r82272k25204K50989J86884J3924j55634l67200
1697H0436981p39539j293987j365459j405132j667231j692623j662594j735085k000088
1715.3F6875243k559006k694982k381295k419204k508557k338469k105367j867026
1731.7D8001337j989979k029287j890323k457222l134439l353217l336784l054109
1748B6755977k564805j741851o41513M65469J564869K518176L228160L095559K450332
1766.3C5130373J885885J275870P42146K70644j28156m86284q51775j148203j357966
$$ y = [89460409, 89389181, 89224178, 89026964, 88872999, 88830137, 88854194, 88844925, 88874400, 89042062, 89227408, 89251530, 89189565, 89080328, 88878381, 88543582, 88131785, 87538409, 86666459, 85800129, 85072398, 84400928, 83690774, 82805914, 81715494, 80733222, 80508018, 80759007, 80945891, 80959815, 80804181, 80436981, 79697442, 78403455, 77037996, 75632864, 73965633, 72273010, 70610416, 68875331, 66875243, 64316237, 61621255, 59239960, 56820756, 54312199, 51973730, 49868363, 48001337, 46011358, 43982071, 42091748, 39634526, 36500087, 33146870, 29810086, 26755977, 24191172, 22449321, 21807808, 22273277, 23838146, 26356322, 29584482, 32680041, 35130373, 37016258, 38292128, 39034274, 39304918, 39176762, 38690478, 37838703, 36690500, 35332534]
1784.7C5332534j413220j117665l85997Q37571J953563K535787K878234K920297K541786
1803D6082890K006909J644895J443767J240683R71055Q21131R19146J110923J181608
1821.4E7423007J090211R04316P21246P37893R07302J044858J102984J045161R19175
1839.8F5896153Q23427P19881M67920J84304L0642O4129L04365O19370P93236P56479
1860.2G0659906N99032M79240N06478O29902O83266O13648N57702N38510N08351M48775
1880.5G6224810L96728L89994L99381L92824L74120L77512L87246L61168L08615K82312
1900.9G9894710K69824K26760J60831J17403J20795J47146J78063K10738K54792K95025
1921.3H1876087L12138L07768L09462L08919K76076K36071K25287K39897K39527K18153
$$ y = [35332534, 33919314, 32801649, 32415652, 33253223, 35206786, 37742573, 40620807, 43541104, 46082890, 48089799, 49734694, 51178461, 52419144, 53390199, 54211330, 55130476, 56241399, 57423007, 58513218, 59417534, 60138780, 60876673, 61783975, 62828833, 63931817, 64976978, 65896153, 66719580, 67439461, 67907381, 68091685, 68122327, 68186456, 68490821, 69110191, 69903427, 70659906, 71258938, 71738178, 72244656, 72874558, 73557824, 74171472, 74729174, 75267684, 75776035, 76224810, 76621538, 77011532, 77410913, 77803737, 78177857, 78555369, 78942615, 79303783, 79612398, 79894710, 80164534, 80391294, 80552125, 80669528, 80790323, 80937469, 81115532, 81326270, 81581062, 81876087, 82188225, 82495993, 82805455, 83114374, 83390450, 83626521, 83851808, 84091705, 84331232, 84549385]
1941.7H4549385K01249K02549J95402J69980J56403J66041J77043J73444J73223J83540
1962.1H6348259J85061J57076J19805J14185J33038J38974J38020J55825J77538J74916
1982.5H7842697J48076J31744J39582J45751J29032J14155J27059J41174J28448J09011
2002.9H9156729J11002J19775J08963Q2547P1740Q3655Q9228P6533O8801P2456N9330
2025.4I0100759K4319M184J9723L8875L8480M0514O2888P5728L9071k8110p6079r0951
2049.8I0249401q1831l8957M1782J29044J77992J78861J71888J82087J82515J52093
2070.2I1344875J21564J22005J31040J14203Q3828P3981P6002N8508L2610L6943O5362
2092.7I2260921P2706N6839O4313J02079J17606Q9532O1906O7281P0030K9105k6995
$$ y = [84549385, 84750634, 84953183, 85148585, 85318565, 85474968, 85641009, 85818052, 85991496, 86164719, 86348259, 86533320, 86690396, 86810201, 86924386, 87057424, 87196398, 87334418, 87490243, 87667781, 87842697, 87990773, 88122517, 88262099, 88407850, 88536882, 88651037, 88778096, 88919270, 89047718, 89156729, 89267731, 89387506, 89496469, 89579016, 89650756, 89734411, 89823639, 89900172, 89968973, 90041429, 90100759, 90125078, 90129262, 90148985, 90187860, 90226340, 90266854, 90329742, 90405470, 90444541, 90416431, 90340352, 90249401, 90167570, 90128613, 90170395, 90299439, 90477431, 90656292, 90828180, 91010267, 91192782, 91344875, 91466439, 91588444, 91719484, 91833687, 91917515, 91991496, 92067498, 92126006, 92158616, 92195559, 92260921, 92333627, 92390466, 92454779, 92556858, 92674464, 92763996, 92825902, 92893183, 92963213, 92992318, 92965323]
2115.1I2965323l6651j884O986m4972j18732j46067q1045M4298J39302J54365R9384
2137.5I2980307J5569m3249o4242p7093q7088n6547K2060R7650J31005J44392J66011
2160I3228775J78886J57797J25456J19269J21343R4289N1075L5983M6194L7855P480
2182.4I4204402j448K1851L7491K9206K3556L8826N3007M8113M2194N0431N4127L0274
2206.9I4632030q113k9653l7587n5575o3229k8079L3098P2593P1120N2792L1590j1796
2231.4I4659191o8563p5918k402J01262J61457J64384J41054J01554L8106l7545r6762
2253.8I5085818j26952j25111p9005N042P3177P1209R478m4245l2198L6370J04988
2276.2I4978571J40876J52152J39684J01745O5398N2238M6301K8687J3423K4867M7428
$$ y = [92965323, 92928672, 92926788, 92933774, 92888802, 92770070, 92624003, 92542958, 92587256, 92726558, 92880923, 92980307, 92995876, 92952627, 92888385, 92811292, 92724204, 92667657, 92689717, 92787367, 92918372, 93062764, 93228775, 93407661, 93565458, 93690914, 93810183, 93931526, 94025815, 94076890, 94112873, 94159067, 94196922, 94204402, 94202954, 94224805, 94262296, 94291502, 94315058, 94353884, 94406891, 94455004, 94497198, 94547629, 94601756, 94632030, 94623917, 94594264, 94556677, 94501102, 94437873, 94409794, 94442892, 94515485, 94586605, 94639397, 94670987, 94659191, 94590628, 94514710, 94512308, 94613570, 94775027, 94939411, 95080465, 95182019, 95220125, 95182580, 95085818, 94958866, 94833755, 94754750, 94759792, 94832969, 94904178, 94913656, 94869411, 94837213, 94873583, 94978571, 95119447, 95271599, 95411283, 95513028, 95578426, 95630664, 95676965, 95705652, 95719075, 95743942, 95791370]
2298.7I5791370L8331r584o4778j08296j51712j79624j43087n3895Q875J2321m292
2321.1I5135629R84K0885J4109j0163j568L4595M0763J4788J6815P0906J31809J60504
2345.6I5630056J50478R5957N901q1903j06072p3838n0170n0693n0867m4799l5453
2368I5388597k5296j4216R621M8542R0384J17302J08093N9384j1331o4027n2476J8096
2392.5I5672673Q9252J22231J29515J36584J44601J37377J16604R9796R1339Q0377
2412.9I6820349O3490M8978M1025L2825J6570L683Q023J7911J5146R566K0254L9452
2437.4I7137272M2957K7883J8371K3251K5803J7494J4937K4420K6387P451j5182j3059
2461.8I7337985M524M727m292J0520L4118K9326O616M780K4450K8711R454Q40J1885
$$ y = [95791370, 95829701, 95820117, 95755339, 95647043, 95495331, 95315707, 95172620, 95118725, 95127600, 95139921, 95135629, 95136613, 95157498, 95171607, 95161444, 95159876, 95194471, 95235234, 95250022, 95266837, 95337743, 95469552, 95630056, 95780534, 95876491, 95882392, 95800489, 95694417, 95620579, 95570409, 95519716, 95468849, 95424050, 95388597, 95363301, 95349085, 95358706, 95407248, 95497632, 95614934, 95723027, 95782411, 95771080, 95707053, 95654577, 95672673, 95761925, 95884156, 96013671, 96150255, 96294856, 96432233, 96548837, 96648633, 96739972, 96820349, 96883839, 96932817, 96973842, 97006667, 97023237, 97026920, 97034943, 97052854, 97068000, 97077566, 97097820, 97137272, 97180229, 97208112, 97226483, 97249734, 97275537, 97293031, 97307968, 97332388, 97358775, 97366226, 97351044, 97337985, 97342509, 97347236, 97342944, 97353464, 97387582, 97416908, 97423524, 97428304, 97452754, 97481465, 97490919, 97491759, 97503644]
2488.3I7503644Q786j9616m0054k5296Q94R709J8257M2373N1999J7434k9152m3190
2512.8I7495788l3515k3932j2064Q059K0939J049l8147m7499j6588J2171J9038L5155
2537.3I7420454O1774O1465L0964O151O771L320k4139l9274j2797K2471K7645J5908
2561.8I7580713J4287J2672j5414n7154p1973o1047n7662n9920l8630L231K4336Q184
2586.2I7281623o265P683J9223M363o247J2464L5846L7593K8944L4088M7361M0883
2610.7I7537559K1565K0820K6411j144n2661p2491l3868K4987N4103N3519M8542L9094
2635.2I7666436J8967Q124K0897K8014N520j2785N626L8958N0092L9917M1401O1405
2659.7I7972572O5023M1735K8765M0173M4078K6488J4025K2865L1775K1219N311N567
$$ y = [97503644, 97512430, 97492814, 97452760, 97427464, 97428358, 97438067, 97456324, 97498697, 97550696, 97568130, 97538978, 97495788, 97462273, 97438341, 97426277, 97434336, 97455275, 97456324, 97418177, 97370678, 97354090, 97366261, 97385299, 97420454, 97482228, 97543693, 97574657, 97580808, 97587579, 97590899, 97566760, 97527486, 97514689, 97537160, 97564805, 97580713, 97595000, 97607672, 97592258, 97535104, 97463131, 97402084, 97344422, 97284502, 97245872, 97249103, 97273439, 97281623, 97275358, 97283041, 97302264, 97306627, 97300380, 97312844, 97348690, 97386283, 97415227, 97449315, 97496676, 97537559, 97559124, 97579944, 97606355, 97605211, 97552550, 97480059, 97446191, 97471178, 97525281, 97578800, 97627342, 97666436, 97685403, 97693527, 97714424, 97742438, 97747958, 97735173, 97740799, 97779757, 97829849, 97869766, 97911167, 97972572, 98037595, 98079330, 98108095, 98148268, 98192346, 98218834, 98232859, 98255724, 98287499, 98308718, 98314029, 98319596]
2684.1I8319596J2463N436o377k379J4055J6850J26n317M309R6j5289j3983R155K6661
2712.7I8365402K1899J7762K9701L6758K2811M798Q94j2058o6173j47146j98197j46443
2737.2I7930008M810J27960J40994R7913N1027P439j6373j1957N54n078k3603l5137
2761.6I8268557m4626n3627l9237N978N1612O4784M7475L0595K4521P046k2477m1485
2786.1I8299116m3231l6854k6584q422R966R573j5998m9305o4933n1672k3251o962
2810.6I7991443j2303l6734o9249p8779n1999j3602L421r751l0869l9876m5687o6203
2835.1I7539812r1797j00058r1094p8994o6513m9042l9030n1528p5793r2882j00887
2857.5I6702194j03181r3657p7635q4168j32519j95599k17598j78933j17201p1305
$$ y = [98319596, 98332059, 98337495, 98331118, 98328739, 98342794, 98359644, 98359770, 98354453, 98358762, 98358858, 98343569, 98329586, 98338741, 98365402, 98387301, 98405063, 98434764, 98471522, 98494333, 98499131, 98500025, 98487967, 98421794, 98274648, 98076451, 97930008, 97934818, 98062778, 98203772, 98301685, 98352712, 98360151, 98343778, 98331821, 98332375, 98327297, 98303694, 98268557, 98223931, 98170304, 98131067, 98137045, 98188657, 98253441, 98300916, 98331511, 98356032, 98363078, 98340601, 98299116, 98255885, 98219031, 98192447, 98184025, 98193991, 98203564, 98187566, 98138261, 98073328, 98021656, 97998405, 97991443, 97979140, 97942406, 97873157, 97794378, 97742379, 97728777, 97732198, 97722447, 97691578, 97651702, 97606015, 97539812, 97448015, 97347957, 97256863, 97177869, 97111356, 97062314, 97023284, 96971756, 96895963, 96803081, 96702194, 96599013, 96505356, 96427721, 96343553, 96211034, 96015435, 95797837, 95618904, 95501703, 95430398]
2877.9I5430398n0884m0007j5164J2619J0502j7255m5830p4268r8532r7186p6139p4738
2902.4I4863516r9158j15550j26737j84906l29363n63085q72725j253891j757855k503234
2922.8H7057012l564667m538948m231322j777416J685381L877723L955686K844817
2939.1H5308266J590222N83011r7364l79682k73597Q7672N32329Q72886R81033Q90750
2959.5I0095526P21562N55307M33993L71373L42571L16739K84213K55871K44331K28697
2979.9I3850183J77831J09941M8393m5276k21246n25856j069522k008140l298468m389435
3000.3H2628405m135668j899260Q73196K166217K053464J781892J735485J565468J189816
3018.6H7959015Q83508P86227P69252O92004N66095M47136L59285L00890K67380K55251
$$ y = [95430398, 95379514, 95339507, 95324343, 95336962, 95347464, 95330209, 95284379, 95210111, 95111579, 95014393, 94938254, 94863516, 94764358, 94648808, 94522071, 94337165, 94007802, 93444717, 92571992, 91318101, 89560246, 87057012, 83492345, 78953397, 74722075, 72944659, 74630040, 78507763, 82463449, 85308266, 86898488, 87481499, 87384135, 87004453, 86730856, 86818528, 87350857, 88223743, 89204776, 90095526, 90817088, 91372395, 91806388, 92177761, 92520332, 92837071, 93121284, 93377155, 93621486, 93850183, 94028014, 94137955, 94186348, 94141072, 93919826, 93393970, 92324448, 90316308, 87017840, 82628405, 78492737, 76593477, 77466673, 79632890, 81686354, 83468246, 85203731, 86769199, 87959015, 88842523, 89628750, 90398002, 91090006, 91656101, 92103237, 92462522, 92763412, 93030792, 93286043]
3039I3286043K24477J60456J05202Q4287Q6707R0420R2382R8538Q6552N7983N2381
3061.5I4425428P0828P9310O4999N5081P3695J02901J18375J12033Q4770N7268L9106
3083.9I5283794K6948L4922M7135L2628J2314J7172L6562L1376m792k3526n168O133
3108.4I5495498j6713k2286K2077N4324L7032M018q464N245K2358K7233K2841K0563
3132.8I5663726K2942K4450K1398M840j2863j5259m732K2167M2420J3876l2842l7658
3157.3I5712465j8865j8352k7216k3317j4228j7929l2729m0954l6168l5077m5902n3650
3181.8I5348078n1045n0319n8686o3742n8484o0308p4750q1605p3248o5773o9917p6455
3206.3I4563746p4219o3837o0892o5750n7882m3672m9037o8861p3624o2775n8789o1637
$$ y = [93286043, 93510520, 93670976, 93776178, 93860465, 93947172, 94037592, 94129974, 94228512, 94315064, 94373047, 94425428, 94496256, 94575566, 94640565, 94695646, 94769341, 94872242, 94990617, 95102650, 95187420, 95244688, 95283794, 95310742, 95345664, 95392799, 95425427, 95437741, 95454913, 95491475, 95522851, 95518059, 95494533, 95489365, 95495498, 95478785, 95456499, 95478576, 95532900, 95569932, 95573950, 95565486, 95570731, 95593089, 95620322, 95643163, 95663726, 95686668, 95711118, 95732516, 95737356, 95724493, 95709234, 95704502, 95726669, 95769089, 95782965, 95750123, 95712465, 95693600, 95675248, 95648032, 95624715, 95610487, 95592558, 95559829, 95518875, 95482707, 95447630, 95401728, 95348078, 95297033, 95246714, 95188028, 95124286, 95065802, 95005494, 94930744, 94849139, 94775891, 94710118, 94640201, 94563746, 94489527, 94425690, 94364798, 94299048, 94241166, 94197494, 94148457, 94079596, 94005972, 93943197, 93884408, 93822771]
3230.7I3822771o4993p9691r8044j02609r7823q2219o3664p4446j03044r6858o5940
3253.2I2893440n8377p2545p5287n8990n2399n9521m7404k0784l0571p2408q8238p0852
3277.7I2186064n4831n9539o7627n8180m3917l9959n6392q5592j04112j24305j45585
3300.1I1346025j28096q6164q8394j38873j72323j67382j61647j75810j84095j76031
3320.5H9867210j72317j82032k04224k19333k23678k38550k47443k37447k48599k90459
3340.9H7603128l16989l11012k88879k70957k83569l07954l05330k96027l02940l15285
3361.3H4604186l22020l22730l32993l60894l87770l85302l57247l29864l00789k68602
3381.7H1235975k49362k36070k10756j81902j84136k13397k16424j84906j65546j84542
$$ y = [93822771, 93757778, 93678087, 93580043, 93477434, 93379611, 93297392, 93233728, 93159282, 93056238, 92959380, 92893440, 92835063, 92762518, 92687231, 92628241, 92575842, 92516321, 92468917, 92448133, 92417562, 92345154, 92256916, 92186064, 92131233, 92071694, 92004067, 91945887, 91901970, 91862011, 91805619, 91720027, 91615915, 91491610, 91346025, 91217929, 91131765, 91043371, 90904498, 90732175, 90564793, 90403146, 90227336, 90043241, 89867210, 89694893, 89512861, 89308637, 89089304, 88865626, 88627076, 88379633, 88142186, 87893587, 87603128, 87286139, 86975127, 86686248, 86415291, 86131722, 85823768, 85518438, 85222411, 84919471, 84604186, 84282166, 83959436, 83626443, 83265549, 82877779, 82492477, 82135230, 81805366, 81504577, 81235975, 80986613, 80750543, 80539787, 80357885, 80173749, 79960352, 79743928, 79559022, 79393476, 79208934]
3402.1G9208934k06345j89281j54531j38676j39862j37675j24383j09905j02597r0206
3422.5G7815473o1721l5816k8056k5922j2588M786R519Q136K5791N4872O5189O5434
3446.9G7885097P5460Q9156R3490R3389R9104J05793J02406Q6660P3254P7545Q9133
3469.4G8870487Q9759Q8501R1803Q8626P6872O1327M0347R894l1268o3843o2138l1209
3493.8G9229158K7549J22172K24149K81847K81316K44135J96743J47038R5129O3169
3514.2H0912405O4087Q6320J02907R3859O9780M3159Q697o038N3870J94890L53741
3536.7H1977677M51243M76957M72742M54050M18163L79920L52978L35801L08377K75385
3557.1H5903293K57069K49147K50483K50858K28745K00742K13581K58083L07917L54493
$$ y = [79208934, 79002589, 78813308, 78658777, 78520101, 78380239, 78242564, 78118181, 78008276, 77905679, 77815473, 77753752, 77717936, 77689880, 77663958, 77651370, 77656156, 77665675, 77673811, 77699602, 77754474, 77819663, 77885097, 77960557, 78049713, 78143203, 78236592, 78335696, 78441489, 78543895, 78630555, 78703809, 78781354, 78870487, 78960246, 79048747, 79140550, 79229176, 79306048, 79367375, 79407722, 79417616, 79386348, 79322505, 79260367, 79229158, 79256707, 79378879, 79603028, 79884875, 80166191, 80410326, 80607069, 80754107, 80849236, 80912405, 80976492, 81062812, 81165719, 81259578, 81329358, 81372517, 81381214, 81375176, 81429046, 81623936, 81977677, 82428920, 82905877, 83378619, 83832669, 84250832, 84630752, 84983730, 85319531, 85627908, 85903293, 86160362, 86409509, 86659992, 86910850, 87139595, 87340337, 87553918, 87812001, 88119918, 88474411]
3577.5H8474411L80945L79574L79330M05473M13876L58654L15684L28403L33226L12501
3597.9I2082077L04508L12055L27515L41082L30931L03674K93731K85769K64865K49636
3618.3I5095843K31552K15268K31570K56175K42853J88041J52886J50394J53917J56695
3638.7I7075194J55109J65165K01028K23780J71018P3844N3686Q3649Q5133O2573O3265
3661.1I8413444Q2504J05340J13868Q5891N8245N5248Q470m4281j7368K5880N9008
3683.5I8946249R3550J12760Q1074K8611J8674L7843N9509O2621L7741K3145N1415
3706I9553192Q1354O0874l928k9182p2K5219K8181K0731J6367J2332K1005N3358P2110
3732.5I9911541K5153m5198l3307L1322M8417P790R561L3480j2541o2222l4534m381
$$ y = [88474411, 88855356, 89234930, 89614260, 90019733, 90433609, 90792263, 91107947, 91436350, 91769576, 92082077, 92386585, 92698640, 93026155, 93367237, 93698168, 94001842, 94295573, 94581342, 94846207, 95095843, 95327395, 95542663, 95774233, 96030408, 96273261, 96461302, 96614188, 96764582, 96918499, 97075194, 97230303, 97395468, 97596496, 97820276, 97991294, 98065138, 98118824, 98202473, 98287606, 98350179, 98413444, 98495948, 98601288, 98715156, 98801047, 98859292, 98914540, 98923010, 98878729, 98861361, 98887241, 98946249, 99039799, 99152559, 99233633, 99262244, 99280918, 99318761, 99378270, 99440891, 99478632, 99501777, 99553192, 99634546, 99695420, 99691492, 99662310, 99662238, 99687457, 99715638, 99736369, 99752736, 99765068, 99786073, 99839431, 99911541, 99936694, 99891496, 99858189, 99889511, 99937928, 99945718, 99955279, 99988759, 99976218, 99913996, 99879462, 99875081]
3756.9I9875081j8520m3547m1079k0421J097J1420P618J1360L2080L8361Q178j5295
3781.4I9846333k163Q094N66J067K3741M1151K9003J6570J2917L0o557k1690m2063
3807.9I9906999j5921K6429L5048K7120L2651N687n1642m5979j341J9830J1099M869
3832.4I9954849K2221K2930m244k8175l8725l1656L421N1463O9660r66q6194m9317
3856.9I9885267Q613L1876J1421k2221k4861l1328o1208r5493j09905p2610k7389l862
3881.4I9488300L0762O4480P6515O4212L2759J9902L9911M7135K6798j436l0774m0001
3905.8I9818563j3369J5158K8681L4160K8127J4067Q094N710o121j1367O44l880l6419
3932.3I9882048m9817l3111k5934l2573k7580J091L1346L9101L0744J9622J3560J0735
$$ y = [99875081, 99856561, 99813014, 99771935, 99751514, 99752611, 99764031, 99771649, 99783009, 99815089, 99853450, 99861628, 99846333, 99844170, 99852264, 99852830, 99853897, 99877638, 99918789, 99947792, 99964362, 99977279, 99977309, 99970752, 99949062, 99906999, 99891078, 99917507, 99952555, 99979675, 100012326, 100018013, 99966371, 99920392, 99919051, 99938881, 99949980, 99954849, 99977070, 100000000, 99995756, 99967581, 99928856, 99897200, 99900621, 99952084, 100021744, 100020778, 99934584, 99885267, 99893880, 99925756, 99937177, 99914956, 99890095, 99858767, 99797559, 99702066, 99592161, 99519551, 99492162, 99488300, 99519062, 99583542, 99660057, 99724269, 99757028, 99776930, 99816841, 99863976, 99890774, 99889338, 99858564, 99818563, 99805194, 99820352, 99849033, 99883193, 99911320, 99925387, 99933481, 99939191, 99933070, 99921703, 99922347, 99918467, 99882048, 99832231, 99799120, 99773186, 99740613, 99713033, 99714124, 99745470, 99784571, 99815315, 99834937, 99848497, 99859232]
3956.8I9859232M327l523m297K795Q661J6409K4855K5690K2906J8024J2672J2249R990
3983.3A00009990m280j5926j8311l0112n3465o9344o5363
3997.6I9753189
$$ y = [99859232, 99863559, 99860036, 99855739, 99858534, 99867195, 99883604, 99908459, 99934149, 99957055, 99975079, 99987751, 100000000, 100009990, 100005710, 99989784, 99971473, 99941361, 99887896, 99818552, 99753189]
##END=$$ End of the data block
