##TITLE=EPS L. plantarum $$ Begin of the data block
##JCAMP-DX=5.00 $$ ACD/SpecManager v 10.08
##SPECTROMETER/DATA SYSTEM=Alpha
##DATE=01 Apr 2015 08:53:30
##DATA TYPE=INFRARED SPECTRUM
##DATA CLASS=XYDATA
##ORIGIN=
##OWNER=
##NPOINTS=1765
##FIRSTX=399.76428223
##LASTX=3997.64306641
##MAXX=3997.64306641
##MINX=399.76428223
##MAXY=1.00086141
##MINY=0.43925011
##XFACTOR=1.0000000000
##YFACTOR=0.000000010000000
##FIRSTY=1.00000000
##DELTAX=2.03961372
##XUNITS=1/CM
##YUNITS=ARBITRARY UNITS
##XYDATA=(X++(Y..Y))
399.8 100000000 99781847 100000000 99780792 99124378 98884022 99220139 99346626 98980486 98680758 98825043
420.2 98825043 98814136 98215663 97542024 97541392 97920167 97834790 97305334 97107470 97351450 97281200 96604812
442.6 96604812 96043020 96072757 96102756 95609158 95021886 95025742 95401132 95319945 94852370 94748741 95014572
465 95014572 94945204 94329959 93800378 93727535 93599367 92970055 92205209 91853392 91716874 91183978 90311843
487.5 90311843 89694601 89404607 88880080 87913907 86998492 86512923 86151385 85502350 84813458 84557217
507.9 84557217 84652144 84587693 84258175 84098917 84310693 84486371 84324193 84160584 84400928 84842420
528.3 84842420 85041976 85047013 85270238 85756779 86030567 85881805 85727668 85921967 86210167 86227632
548.7 86227632 86165428 86474180 87108296 87552297 87630677 87735456 88088834 88376027 88351649 88319969 88640159
571.1 88640159 89094239 89216810 89041978 89029443 89266825 89350426 89101762 88877261 88946342 89031541 88787401
593.5 88787401 88391650 88247097 88309830 88179564 87789351 87511641 87532663 87560833 87335622 87057304
613.9 87057304 87036210 87208265 87297148 87340498 87642705 88209558 88664842 88824093 88950467 89293426
634.3 89293426 89685720 89840806 89842898 90014082 90391856 90658975 90666527 90676916 90890568 91105926 91089690
656.8 91089690 90997255 91110271 91368073 91517198 91504204 91564423 91839820 92090696 92176586 92224836 92448449
679.2 92448449 92749459 92876565 92858964 92942977 93163610 93286479 93210155 93145144 93269759 93467021 93562227
701.6 93562227 93642527 93911284 94335693 94695115 94940203 95257884 95742089 96221727 96546966 96853894
722 96853894 97321224 97851461 98213649 98403031 98627055 98931992 99113578 99067378 98978305 99013060 99046057
744.5 99046057 98876917 98569006 98310643 98073328 97668433 97114044 96698850 96612293 96726346 96847320
764.9 96847320 97005165 97309065 97662103 97838175 97816694 97826022 98029214 98367292 98734307 99135590
785.3 99135590 99585003 99936056 100000000 99845153 99704468 99646014 99522513 99289715 99109125 99068058
805.6 99068058 99019408 98808509 98543811 98437864 98466223 98427898 98303920 98308337 98558253 98909003 99198633
828.1 99198633 99466032 99779803 100017369 100000000 99796033 99624926 99528360 99288374 98805666 98304009
848.5 98304009 97990990 97738153 97313583 96758926 96295750 95965403 95606816 95195055 94950765 95021003
868.9 95021003 95244694 95387697 95475566 95679146 95974600 96143550 96114141 96061724 96072614 95973873 95623708
891.3 95623708 95154768 94756913 94351125 93706787 92814744 91906035 91144353 90521681 90035278 89755082
911.7 89755082 89664155 89578617 89334571 89004600 88795894 88728052 88580543 88217753 87781066 87435299
932.1 87435299 87103248 86631083 86088586 85683906 85445738 85206032 84893674 84657305 84608346 84600520
952.5 84600520 84433955 84152520 83936983 83784580 83498991 83005661 82465827 81989896 81444973 80678356
972.9 80678356 79757684 78823596 77825350 76584524 75081277 73505926 72004783 70536864 69050658
991.3 69050658 67653048 66488761 65537816 64647424 63746077 62900382 62140012 61374032 60545290 59749264
1011.6 59749264 59115106 58643270 58270216 58044767 58107924 58478343 58953357 59289938 59439272 59508669
1032 59508669 59533304 59443408 59238231 59037876 58926493 58854997 58752763 58666974 58712178 58911872 59191847
1054.5 59191847 59514570 59921402 60416561 60896128 61244571 61461538 61617267 61704826 61658108 61515564
1074.9 61515564 61444980 61568916 61851907 62203485 62627697 63171089 63761324 64226973 64492190 64650625
1095.3 64650625 64801341 64909416 64909482 64864182 64899778 65022123 65116286 65140778 65189296 65324455 65475684
1117.7 65475684 65557563 65612525 65751088 65981174 66211963 66425359 66704404 67083329 67460787 67717761
1138.1 67717761 67881680 68063867 68268389 68392193 68416470 68472016 68675733 69000524 69385523 69897872
1158.5 69897872 70662057 71665144 72749245 73806328 74876076 75998539 77072102 77962524 78692496
1176.9 78692496 79393822 80078536 80611813 80936688 81167346 81394535 81529641 81454372 81229728 81007075
1197.3 81007075 80791825 80461884 79996985 79543293 79207325 78913790 78563201 78211951 77982110 77867168
1217.7 77867168 77737904 77537239 77355021 77255434 77153003 76950920 76708305 76557505 76509917 76466578
1238.1 76466578 76402432 76417643 76576704 76792985 76953661 77085894 77287382 77545834 77743602 77840573
1258.4 77840573 77937502 78118628 78327209 78473729 78593993 78791857 79064101 79303640 79480129 79692155
1278.8 79692155 80012500 80374652 80679876 80952948 81290066 81682682 82012582 82228917 82416356 82646108
1299.2 82646108 82849818 82931572 82931405 82966942 83044916 83052206 82949507 82844585 82819360 82797915 82679063
1321.7 82679063 82499355 82361031 82265759 82111919 81866968 81636852 81510067 81421214 81260097 81070548
1342.1 81070548 80968070 80940336 80881637 80752802 80630398 80561370 80468756 80281359 80035645 79791987
1362.5 79791987 79558456 79305637 79027158 78803664 78676349 78538644 78310102 78054005 77843100 77700371
1382.9 77700371 77622730 77572113 77527142 77514553 77489048 77349961 77118790 76887709 76687878 76474285 76194644
1405.3 76194644 75934923 75790775 75725454 75693119 75737590 75919533 76205546 76457304 76682466 76957422
1425.7 76957422 77297688 77645135 77896142 78070313 78249609 78382617 78396356 78335267 78258461 78203994
1446.1 78203994 78123957 77987838 77887762 77931470 78154826 78419018 78625953 78939754 79460353 80048150
1466.5 80048150 80569041 81169540 81991047 82807958 83414322 83875388 84260619 84588134 84806675 84866297
1486.9 84866297 84704769 84342355 83949733 83492428 82798308 81969744 81240207 80639344 79897237 78600335
1507.3 78600335 77344388 76393241 75521940 74743778 74115717 73679268 73262900 72781074 72318286 71890366
1527.7 71890366 71572936 71332610 71083355 70925111 70940322 71024102 71010292 70977265 71027404 71176708 71407324
1550.1 71407324 71697170 72063607 72510839 73047179 73460293 73650610 73854619 74088931 74253660 74288374
1570.5 74288374 74256730 74209410 74035239 73731601 73403496 73048490 72653991 72186452 71632278 71019602
1590.9 71019602 70384485 69713199 69004321 68287688 67568403 66827863 66051239 65217489 64309418 63387352
1611.3 63387352 62517393 61544734 60361946 59414059 58707452 58014828 57453012 57076073 56819946 56686193
1631.7 56686193 56629008 56533110 56394476 56289107 56228620 56206369 56189901 56157112 56158078 56193101 56222659 56291860
1656.2 56291860 56449318 56706196 57037890 57396090 57750446 58154160 58587974 58959991 59342116 59760660
1676.6 59760660 60157961 60565084 61029637 61536610 61927265 62236118 62554872 62859821 63199091 63597292
1697 63597292 64066368 64683312 65254802 65773159 66278219 66697609 67066979 67426944 67775899 68084300
1717.4 68084300 68318486 68536597 68803853 69131851 69517034 69963658 70447516 71013772 71611661 72157866
1737.8 72157866 72789270 73501581 74230033 75009102 75836456 76705766 77559513 78343147 79141575 79966676
1758.2 79966676 80753392 81549436 82289159 82963824 83644289 84302151 84925175 85461634 85915571 86369580
1778.6 86369580 86844063 87297833 87720609 88133562 88555187 88996005 89418024 89769858 90101725 90457338
1799 90457338 90805918 91112244 91396636 91696841 92005908 92288744 92529351 92761999 93009079 93255931
1819.4 93255931 93494385 93731856 93973929 94204974 94406128 94564956 94712663 94875365 95045233 95218670
1839.8 95218670 95400107 95576447 95718110 95828289 95929718 96039850 96161813 96287698 96403688 96508753
1860.2 96508753 96616966 96743816 96878171 96975607 97024912 97070003 97137135 97213125 97285950 97359276 97435844
1882.6 97435844 97510409 97582424 97647911 97702265 97757441 97806591 97844857 97890139 97946852 97998023 98041058 98085302
1907.1 98085302 98130089 98171234 98212224 98262638 98314548 98357660 98393315 98419946 98439455 98464358 98497015 98530221
1931.5 98530221 98562199 98594880 98636830 98689759 98737568 98760784 98772848 98795313 98828769 98865414 98899966 98932606
1956 98932606 98962015 98991412 99023807 99062794 99103808 99135011 99158496 99185747 99220490 99258304 99294078 99325126
1980.5 99325126 99357241 99395621 99438387 99480349 99517697 99544996 99566442 99591041 99615687 99638182 99661976 99690783
2005 99690783 99717885 99737281 99756086 99781418 99806273 99816906 99809289 99789882 99757326 99726760 99744946 99801236
2029.4 99801236 99846458 99872589 99885571 99889690 99895984 99907517 99913365 99908644 99901778 99904096 99913406 99918336 99915981
2056 99915981 99916899 99928522 99942499 99947047 99945384 99954844 99973780 99984521 99985760 99992323 100010431 100027800 100033402 100034690
2084.5 100034690 100046158 100065219 100074255 100068259 100063610 100070870 100083125 100086141 100076604 100069189 100071239 100069928 100056350
2111 100056350 100043416 100043559 100047302 100036907 100014579 100000322 100000000 100015390 100014091 100009751 100019348 100036502 100039172 100029075
2139.6 100029075 100029612 100044215 100053144 100045085 100035763 100042748 100056088 100052643 100034237 100026321 100035572 100038338 100019908
2166.1 100019908 99996614 99994206 100010824 100015879 100002575 99994636 100000000 100011039 100002611 99990940 99998355 100016975 100019515
2192.6 100019515 100004554 99998015 100010562 100019586 100006771 99989736 99992406 100005162 100000000 99984270 99977297 99989134
2217.1 99989134 99994749 99973136 99945939 99943310 99954581 99944341 99909139 99882984 99879557 99870831 99835628 99792612
2241.6 99792612 99769044 99755925 99725062 99676037 99634707 99611646 99582660 99530476 99476022 99444211 99423015 99381369
2266 99381369 99316400 99258262 99224782 99191952 99132776 99061847 99012035 98979819 98931849 98860025 98792922 98747706
2290.5 98747706 98701960 98633045 98557609 98502976 98460484 98401392 98321623 98249078 98201680 98155630 98081988 97994530
2315 97994530 97924137 97866201 97793454 97705328 97627407 97564888 97494960 97399324 97294253 97207338 97134817 97052640
2339.5 97052640 96957028 96878129 96841687 96825039 96780974 96699524 96614081 96545935 96471965 96381372 96301764 96250683
2363.9 96250683 96205044 96137756 96061188 96004999 95963389 95907158 95836514 95783162 95753139 95710570 95632106 95544702
2388.4 95544702 95484334 95440763 95377898 95292348 95215482 95159334 95099902 95018011 94929343 94861263 94808352 94738799
2412.9 94738799 94650966 94576514 94524235 94466722 94382948 94292533 94226867 94175613 94105142 94014901 93935031 93876755
2437.4 93876755 93813181 93724900 93634164 93566626 93508792 93431866 93337715 93255109 93195200 93130732 93041086 92948216
2461.8 92948216 92876965 92814720 92735189 92640674 92557955 92494714 92424107 92329788 92234635 92162627 92102170 92025560
2486.3 92025560 91933006 91850173 91782933 91709954 91622573 91537875 91473365 91418159 91345650 91257721 91181171 91124511
2510.8 91124511 91064692 90985161 90905190 90847188 90798903 90735358 90660030 90596247 90548360 90496778 90431798 90369183
2535.3 90369183 90323669 90284270 90229791 90161258 90103644 90065104 90021867 89961827 89901292 89851558 89805633 89753222
2559.7 89753222 89692628 89636564 89591646 89539933 89468968 89393973 89332545 89276606 89206344 89122432 89045584 88982421
2584.2 88982421 88914967 88829970 88739389 88661969 88591260 88507468 88413179 88328212 88254398 88173532 88078123 87980127
2608.7 87980127 87892294 87809324 87714607 87608677 87510002 87421155 87325364 87218320 87112516 87012851 86911440
2631.1 86911440 86800969 86684942 86575824 86476117 86373538 86259717 86143678 86038834 85941583 85837388
2651.5 85837388 85727262 85626322 85534894 85439569 85333931 85226035 85127485 85033709 84930724 84822142
2671.9 84822142 84722221 84628659 84528214 84417379 84306985 84205693 84106529 84000838 83893889 83794218
2692.3 83794218 83699512 83599961 83492070 83384866 83283681 83182907 83076471 82965714 82857150 82753593
2712.7 82753593 82649553 82538319 82423824 82313091 82204515 82094032 81981254 81869382 81764734 81664282
2733.1 81664282 81558955 81455112 81360489 81267315 81168127 81067860 80975145 80888611 80798632 80701494 80603611
2755.5 80603611 80508083 80410892 80310619 80205745 80095458 79987091 79879928 79764181 79642898 79523289
2775.9 79523289 79403156 79278749 79151517 79025841 78904486 78785563 78662646 78534669 78407186 78280592
2796.3 78280592 78150219 78015536 77882689 77753282 77618939 77476084 77331734 77192563 77054918 76910216
2816.7 76910216 76760495 76613933 76469320 76318705 76159430 75993901 75822097 75643069 75454122 75253057
2837.1 75253057 75039893 74807882 74551994 74273980 73974419 73662949 73358417 73070782 72799790 72544324
2857.5 72544324 72293949 72025084 71722633 71392876 71053940 70728046 70438027 70196247 70003611 69858003
2877.9 69858003 69752127 69671160 69599563 69521928 69426078 69312298 69186997 69053280 68907726 68745035
2898.3 68745035 68570417 68391716 68203187 67996883 67776173 67547816 67311674 67065084 66818833 66589123
2918.7 66589123 66385627 66215408 66079003 65977210 65911007 65874141 65871602 65921038 66025907 66175979 66364884
2941.1 66364884 66579604 66790152 66970932 67118764 67242652 67341614 67414218 67479652 67558050 67651576 67755818
2963.6 67755818 67876685 68020666 68178451 68344975 68523306 68708169 68900174 69102675 69299817 69483250
2984 69483250 69665170 69847918 70023608 70180750 70305580 70397437 70457858 70487386 70496798 70489955 70466030
3006.4 70466030 70431209 70383269 70309490 70205945 70081371 69947946 69813019 69675380 69530225 69376880
3026.8 69376880 69223762 69077861 68936986 68788242 68625551 68467891 68321669 68170005 68007582 67841047
3047.2 67841047 67678928 67523170 67364818 67202461 67044258 66894716 66753030 66617662 66488004 66360998
3067.6 66360998 66232914 66105390 65985548 65879297 65782690 65679842 65566504 65459526 65363616 65270227
3088 65270227 65172404 65065718 64959043 64864653 64778990 64686501 64581388 64473945 64370704 64267123 64155364
3110.4 64155364 64039588 63930601 63823199 63704485 63569808 63428277 63292950 63160640 63023925 62884259
3130.8 62884259 62742251 62599850 62461632 62325227 62182289 62030703 61875868 61724126 61583805 61453944
3151.2 61453944 61311734 61145544 60976326 60820454 60670996 60515535 60353959 60196149 60044956 59892392
3171.6 59892392 59732348 59570014 59412396 59256470 59094036 58924669 58756775 58594209 58431721 58266956
3192 58266956 58101654 57937348 57776886 57615858 57448083 57279873 57120097 56966728 56813997 56660670
3212.4 56660670 56509590 56359124 56204081 56047112 55892116 55738097 55585003 55434155 55285394 55138385
3232.8 55138385 54983139 54813445 54640818 54471731 54304510 54137605 53969228 53796446 53620923 53449982
3253.2 53449982 53284341 53116763 52946383 52779114 52613562 52448708 52292162 52148819 52014095 51880485
3273.6 51880485 51747733 51621908 51505333 51394349 51286602 51186758 51098490 51017988 50936908 50850034 50761592
3296 50761592 50676072 50594497 50518334 50446844 50371510 50284231 50186199 50082499 49978513 49875766 49774033
3318.4 49774033 49671125 49562982 49452063 49337354 49212074 49079379 48947972 48821288 48697636 48567802
3338.8 48567802 48423776 48271519 48121014 47974163 47824100 47662833 47490779 47314626 47145188 46989089
3359.2 46989089 46837291 46679196 46519637 46364442 46205890 46036035 45868579 45719540 45583120 45453206
3379.6 45453206 45328510 45209628 45101422 45009181 44930434 44848055 44748923 44648540 44572616 44514659 44443673
3402.1 44443673 44352269 44267595 44204184 44151494 44102001 44055408 44013625 43980595 43955231 43934435 43925011 43935472
3426.5 43935472 43964744 44000456 44040516 44092426 44147226 44191468 44240516 44313061 44403929 44506329 44609991
3449 44609991 44714525 44831797 44965395 45111054 45262921 45408934 45552766 45718321 45904723 46082526
3469.4 46082526 46237290 46390429 46561399 46754038 46954134 47141311 47323459 47518066 47718132 47917497
3489.8 47917497 48127666 48350820 48580593 48808017 49037522 49276024 49508226 49726650 49955615 50207239
3510.2 50207239 50469315 50726962 50975293 51232773 51513314 51816976 52116495 52390707 52663380 52957886
3530.6 52957886 53269750 53591853 53915185 54232585 54570645 54942006 55318028 55672163 56014532 56366932
3551 56366932 56736046 57111222 57497388 57914054 58352911 58785307 59211320 59672940 60141391 60572517
3571.3 60572517 61008054 61486852 61996353 62522262 63063926 63612437 64168221 64738214 65296286 65825713
3591.7 65825713 66375339 66965729 67570466 68175548 68780875 69382662 69979388 70596462 71228695 71858156
3612.1 71858156 72487980 73093390 73696989 74330103 74933940 75506234 76075178 76688439 77329022 77889276
3632.5 77889276 78423274 78972131 79527235 80100274 80682117 81254071 81823522 82403833 82941955 83386016
3652.9 83386016 83797729 84261453 84734827 85165375 85581273 86010802 86446393 86885345 87322778 87687677
3673.3 87687677 87994367 88294661 88568085 88841599 89157677 89506125 89853561 90140641 90348691 90547401
3693.7 90547401 90772015 91003156 91214907 91408604 91611552 91838145 92071229 92264724 92405224 92550993
3714.1 92550993 92712426 92877036 93042237 93196958 93329078 93454307 93607002 93790203 93996173 94165051
3734.5 94165051 94247758 94334543 94466192 94575065 94662541 94798064 94911039 94951266 94985867 95067436 95165497
3756.9 95165497 95245332 95323473 95413613 95508271 95600963 95673078 95729500 95795751 95887977 96003932 96109760
3779.4 96109760 96180087 96227622 96279347 96346748 96424800 96515256 96617341 96734267 96862459 96948522 96990144
3801.8 96990144 97042376 97072744 97082245 97132331 97229952 97331464 97422463 97517014 97558063 97562945 97601056 97652155
3826.3 97652155 97706181 97770244 97858918 97970682 98051924 98081130 98094589 98098987 98108047 98162174 98276073 98390818
3850.8 98390818 98399889 98355794 98382241 98442531 98513967 98575002 98622346 98669690 98706526 98737431 98749077 98760247 98804832
3877.3 98804832 98865050 98933095 98976982 98985499 99009031 99034774 99035937 99049145 99099964 99170512 99227339 99241310
3901.8 99241310 99216861 99195230 99194002 99205703 99235982 99281150 99317312 99333382 99345523 99363083 99387240 99420267
3926.2 99420267 99451125 99464208 99463403 99466228 99476850 99493760 99516571 99544293 99573910 99599099 99618387 99635088
3950.7 99635088 99651730 99662709 99664915 99673992 99695444 99712843 99726021 99747360 99776423 99801356 99813813 99819273
3975.2 99819273 99827874 99842268 99861932 99883795 99900126 99910730 99923313 99940217 99958378 99977553 100000000
3997.6 100000000
##END=$$ End of the data block
