##TITLE=EAlquinol $$ Begin of the data block
##JCAMP-DX=5.00 $$ ACD/SpecManager v 10.08
##SPECTROMETER/DATA SYSTEM=Alpha
##DATE=05 Nov 2013 11:22:34
##DATA TYPE=INFRARED SPECTRUM
##DATA CLASS=XYDATA
##ORIGIN=
##OWNER=
##NPOINTS=1667
##FIRSTX=599.63549805
##LASTX=3997.56909180
##MAXX=3997.56909180
##MINX=599.63549805
##MAXY=0.99919426
##MINY=0.34311619
##XFACTOR=1.0000000000
##YFACTOR=1.000000000000000e-9
##FIRSTY=0.99523610
##DELTAX=2.03957605
##XUNITS=1/CM
##YUNITS=ARBITRARY UNITS
##XYDATA=(X++(Y..Y))
599.6I95236099l30031n92053M09961J605093J617670R16958L28004K563j06334k71023
620I98816907n83291o87301p02679r59575j304805j876831l279329n341887o398082
638.4I77683127m017472j90080r10699m194736k055765M735053Q384287O980121M059792
656.7I90473628K073884J032770M14014j88828j233697j132190O02484N02288k14458
675.1I92329895m60803n71549o98566p67291p58827o90102o54161o59287o81877n54026
695.5I85833406l21567k77936m36485o41584r02534j192987j574337k318323l707230
713.9I74460423o435394j1344433j5915513j2339652L70324J1170149J3074279R646833
730.2I62687016N819320K731145m6552k689540l684282j157701K604186L425479J841426
$$ y = [995236099, 994906068, 994314015, 994723976, 996329069, 997946739, 998863697, 999191701, 999194264, 999087930, 998816907, 998233616, 997546315, 996843636, 995884061, 994579256, 992702425, 989423096, 984081209, 977683127, 973665655, 973475575, 972564876, 968370140, 966314375, 971049428, 979433715, 986413836, 990473628, 992547512, 993580282, 993994296, 993805468, 992571771, 991439581, 992042065, 992544353, 992329895, 991869092, 991297543, 990598977, 989831686, 989072859, 988382757, 987728596, 987069309, 986387432, 985833406, 985511839, 985233903, 984797418, 984155834, 983253300, 982060313, 980485976, 978167653, 974460423, 968025029, 956680596, 940765083, 928425431, 928795755, 939965904, 953040183, 962687016, 968506336, 971237481, 971190929, 968501389, 964817107, 963659406, 966263592, 969689071, 971530497]
748.5I71530497O89983L82841Q7798o10113j647294k251089j656830l58879M91142
766.9I66658056M87208R6560l47615p56979j207888j903414k522588k300143j292706
785.2I56910491l18170K22922R0122o92427k174556m261613n600393m532814k281010
803.6I37362552j790524l254473n667985r601771j3504804j1206269m954755o522000
819.9H80859971j1892497r186566r569824k5023997m1194022m1114449k8272569j6133964
836.2F98472083o277144R205162L9883852P4027717P3989511M1754842J4785051L722370
852.5I49563444k88427j836956q42809J856446K993464J684189K47479k59400n41150
870.9I52576280q77381j176893j420141j879394k547920l349602m210233m582286m266978
$$ y = [971530497, 972220480, 972603321, 972691119, 972081006, 970433712, 968182623, 966525793, 966166914, 966658056, 967145264, 967241824, 966894209, 966137230, 964929342, 963025928, 960503340, 958203197, 956910491, 956592321, 956815243, 956905365, 956212938, 954038382, 949776769, 944176376, 939643562, 937362552, 935572028, 932317555, 926649570, 917047799, 903542995, 892336726, 887381971, 880859971, 868967474, 859780908, 850211084, 825187087, 783993065, 742878616, 714606047, 698472083, 692194939, 701400101, 741283953, 815311670, 889301181, 931056023, 945841074, 949563444, 949275017, 947438061, 946595252, 948451698, 951445162, 953129351, 953376830, 953117430, 952576280, 951698899, 950522006, 949101865, 947222471, 944674551, 941324949, 937114716, 932532430, 928265452]
889.3I28265452m577577o775200j1079788j7566383k4725974k7231633j8373430J437545
905.6H19373012K1584451L0824482K7628899J8708527J0642767N559802K512455L88920
921.9I37223315j043737j564622r09924L12805O36816k68280j523674k533019l178179
940.2I27151501l319859k925575l068268n061746q786321j3806641k0563662k8868496
956.6H40750933l5030485l0281662n825580K9595852M8259080L9551556K1315455Q809209
972.9I17144358K872288L25263o99997j115143j435638j630068j567840j502812j895845
991.2I10494566l030002m922152o789922p137597n337477k853811j800894k989650
1007.5H75633061n832851q876145j2486935j8893957k4976551k1905184o200731J4299572
$$ y = [928265452, 923687875, 916912675, 905832887, 888266504, 863540530, 836308897, 817935467, 819373012, 840957463, 871781945, 899410844, 918119371, 928762138, 934321940, 936834395, 937223315, 936179578, 934614956, 933705032, 934017837, 934654653, 934386373, 932862699, 930329680, 927151501, 923831642, 920906067, 917837799, 912776053, 903989732, 890183091, 869619429, 840750933, 805720448, 775438786, 769613206, 799209058, 847468138, 887019694, 908335149, 917144358, 920016646, 920341909, 919641912, 918526769, 917091131, 915461063, 913893223, 912390411, 910494566, 907464564, 902542412, 895752490, 888614893, 883277416, 880423605, 878622711, 875633061, 869800210, 860924065, 848437130, 829543173, 804566622, 782661438, 776460707, 790760279]
1023.9G90760279K7257263K7633548K0545900J3151824Q108080M726291K121985p6533
1040.2H94228637j985073l486037l811598k066910J199722L867865M450679L607690
1056.5H96004975K645314K040445J409352L36826n86450m22239M55498Q15511M83453
1074.9I03182685K49148L28123K40445r4056l96311n56767p66694j244009j822710
1093.2H99119854k401948l386796n548596j0210395j7755449k4154365k1331489l679454
1109.5H10651362J8025935K3196160J2564481K361595k266764m308641n539000o081999
1125.8H48603129n429804l255606j058280j185298l322899n682886p748485r571075
1142.2H11348796j0845244j1628568j2634158j5184045k0130933k6408016l0994058
$$ y = [790760279, 818017542, 845651090, 866196990, 879348814, 887456894, 892183185, 894305170, 894228637, 892243564, 888757527, 884945929, 882879019, 884078741, 887946606, 892397285, 896004975, 898650289, 900690734, 902100086, 902436912, 901850462, 901428223, 901883721, 902699232, 903182685, 903431833, 903759956, 904000401, 903906345, 903510034, 902953267, 902186573, 900942564, 899119854, 896717906, 893331110, 887782514, 877572119, 859816670, 835662305, 814330816, 810651362, 828677297, 851873457, 864437938, 866799533, 864532769, 860224128, 854685128, 848603129, 843173325, 839917719, 838859439, 837674141, 834351242, 828668356, 820919871, 811348796, 800503552, 788874984, 776240826, 761056781, 740925848, 714517832, 683523774]
1156.4F83523774k9986262k1389961q783997o22332k799153q028865K047777L1038225
1172.7F44999206N6857228N9435130M2796731K3566126J2159825R215891J0305464
1187H59335601J0578037Q349001M973650J979888j71185j405656j910746k378405l173947
1205.4H76176238m103601n167425o439149p278800p027149o511092o921232p986844
1221.7H24740946q746564q986592r251297j0221064j2418032j6040742k0837784k6202679
1238G12036192l1053483l3417046l0869663k1593273o855368P914543J8905401K7889848
1254.3F42957151L6167860L9248049L2520950J8499434M211366n247175q162082n769610
1270.6G54425943j876831K31325J150847K768457L647566J619398k425134o964505
$$ y = [683523774, 653537512, 632147551, 623363554, 622741222, 619942069, 611913204, 613960981, 644999206, 701856434, 761291564, 804088295, 827654421, 839814246, 849030137, 859335601, 869913638, 878262639, 883236289, 885216177, 885044992, 883639336, 881728590, 879350185, 876176238, 872072637, 866905212, 860466063, 853187263, 846160114, 839649022, 832727790, 824740946, 815994382, 807007790, 797756493, 787535429, 775117397, 759076655, 738238871, 712036192, 680982709, 647565663, 616696000, 595102727, 588247359, 596161902, 615067303, 642957151, 679125011, 718373060, 750894010, 769393444, 773604810, 768357635, 760195553, 754425943, 752549112, 752780437, 753931284, 756699741, 760347307, 761966705, 759541571, 752577066]
1287G52577066j0064184o709636O589175K3883760L3234834K8527499J3109028k755702
1303.3H38391840n778610N057692J3900876J1882186N886436K126395O08862q2731
1319.6H71992946o78957j188040j507699j688838j677156j484155j291812j321077
1335.9H61155212j626790j755535j393080j000524j150727j978159l263354m911244
1352.2H44075799p225990j0312081j2884915j2159943p829249m849792o355285r242296
1368.5G73216248r422422m889727K448023O072938M985452N218744P255316P128477
1384.9G92013049N163908L783524L879368O661535J1124074J2579262J0967792Q431375
1401.2H54603887N836665M425407L239333J405597o56247j795948q82625Q89241J422942
$$ y = [752577066, 742512882, 735803246, 742392421, 766276181, 799511015, 828038514, 841147542, 838391840, 832613230, 837670922, 851571798, 863453984, 869340420, 871466815, 872075677, 871992946, 871313989, 870125949, 868618250, 866929412, 865252256, 863768101, 862476289, 861155212, 859528422, 857772887, 856379807, 855379283, 854228556, 852250397, 848987043, 844075799, 836849809, 826537728, 813652813, 801492870, 793663621, 788813829, 782458544, 773216248, 763793826, 758904099, 761352122, 767425060, 772410512, 777629256, 784884572, 792013049, 797176957, 800960481, 804839849, 811501384, 822625458, 835204720, 846172512, 854603887, 860440552, 864865959, 868105292, 869510889, 868854642, 867058694, 866176069, 867065310, 868488252]
1419.5H68488252J18494j451373k667129l661752m129886l850699l614008l244639
1435.9H45987260j832187j403391l228128o018102q490503r709835r135485p920742
1452.2G98248887o457388m272759k242327m387558j1917114k2644758k2318184l822208
1468.5G20186591J5704274K2489250J4161766J4266133K4204433K4914145J4964283
1482.8H50890875M018783l094792p034242o830096m381538n829870j2991190k1862448
1499.1G92885482k8963208l6639154n6562781p8592956l7517727L0418158P4599862
1513.4F59627676Q3016157O3722909L6845624K0393014J1687577N956054L566265J875758
1529.7H86691034L61144J7107k29776j537502k022803n27084K07425j69576q75651
$$ y = [868488252, 868606746, 867155373, 864488244, 860826492, 856696606, 852845907, 849231899, 845987260, 844155073, 842751682, 839523554, 833505452, 825014949, 815305114, 806169629, 798248887, 791791499, 787518740, 785276413, 780888855, 768971741, 746326983, 724008799, 720186591, 735890865, 758380115, 772541881, 786808014, 811012447, 835926592, 850890875, 854909658, 851814866, 844780624, 837950528, 833568990, 827739120, 814747930, 792885482, 763922274, 727283120, 670720339, 592127383, 554609656, 585027814, 659627676, 742643833, 806366742, 843212366, 863605380, 875292957, 881249011, 884815276, 886691034, 887052178, 887069285, 886839509, 885302007, 883279204, 882752120, 882959545, 882789969, 881914318]
1548H81914318j471877j659871k094566l108085l803908k301574k314329n902172r442746
1566.4H49815190p928968M11868O476880O141424M841387K608061k53260k418041l894687
1584.7H55799854m785359n705357p675826j0419965j2393296j3089120j4900744k0902336
1601.1G65927851l0438840l4809232j8470645K2046745N5017710N1646292L1515241
1615.3H42435122J6602039P134855K219200P58469K92361l05415p68601j447738k272427
1633.7H64647865j946449m95017l87847j253605k212643k617896j718223j306832j551271
1652H51158082K79010J632094R16600M69745Q28981J257479M70102l49700j3888K08318
1672.4H56856823j8895J7643m58955j405061j586675J17003J334847O25431J8001o52016
$$ y = [881914318, 880442441, 878782570, 876688004, 873579919, 869776011, 867474437, 865160108, 859257936, 849815190, 841886222, 842298090, 848774970, 854916394, 859757781, 862365842, 862112582, 859694541, 855799854, 851014495, 845309138, 837633312, 827213347, 814820051, 801730931, 786830187, 765927851, 735489011, 700679779, 682209134, 704255879, 759273589, 810919881, 842435122, 859037161, 866172016, 868391216, 869149685, 869442046, 869136631, 868368030, 866920292, 864647865, 862701416, 862206399, 861818552, 860564947, 858352304, 855734408, 854016185, 852709353, 851158082, 851437092, 853069186, 853985786, 854455531, 855284512, 856541991, 857012093, 856662393, 856648505, 856856823, 856837928, 856855571, 856396616, 854991555, 853404880, 853521883, 854856730, 855482161, 855500162, 854848146]
1692.8H54848146j166939j006246m97222O39141Q24332J51873J56223J6630o50406
1711.2H53315532j339972j563191m24922J117707R54032L48687J51336j36733o29127
1729.5H51793349j018167l89755P57158K86043k86400j62721k23219o05643r35078
1747.9H49215567n24640L33905K63572j60933j45077o4254K87235N74827K99156R2566
1768.3H50171924J79886Q62539J459658J012028M25338K88368L19004K63691O2048
1786.7H55044484n23627q62717j97590L29256n602k45214K4974L44158K20477j33037
1807H53995562l07560j57655N96p4744j36077j69814l99828o50942o14047n41449l28898
1829.5H50615144K01225K05338j86622l32892m83215q36313p32600q9407P4625j45197
$$ y = [854848146, 853681207, 852674961, 852177739, 852816880, 853641212, 853793085, 853949308, 853965938, 853315532, 851975560, 850412369, 849987447, 851105154, 852059186, 852407873, 852559209, 852422476, 851793349, 850775182, 850385427, 851142585, 851428628, 851142228, 850979507, 850756288, 850150645, 849215567, 848690927, 849024832, 849288404, 849127471, 848982394, 848918140, 849205375, 849780202, 850079358, 850171924, 850351810, 851214349, 852674007, 853686035, 854111373, 854399741, 854718745, 854982436, 855044484, 854520857, 853658140, 853460550, 853789806, 853784204, 853538990, 853563964, 853908122, 854128599, 853995562, 853688002, 853530347, 853530943, 853456199, 853320122, 853150308, 852750480, 852099538, 851485491, 850944042, 850615144, 850816369, 851021707, 850835085, 850502193, 850018978, 849182665, 848450065, 848360658, 848435283, 848290086]
1849.9H48290086l45230m94302n64813n50986n00381n11467o82712r36687o96241j4067
1870.3H42993200N8651m41730q39353r91762r68694p41720m55976n46575r77575j338184
1890.7H35750282j624167j590490j088143n02884L43501J627803K455294K138615J290917
1909H38800728O04391N9307m33743n61893k85983m8935J66595L11315J36911j38223
1929.4H38610470k91764l34144l25799l49760m62651m64380k32876j09910j81735k49624
1949.8H35607827k93672k81513j72734q3387j34468k51532l19123k95222k26438k43485
1970.2H33306253l13282k95818k44319k78831l63469l74556l38733l71218m34815m40777
1990.6H29850435l22222k34127l06368l92855m43637m84347m97520m46022l77118l96133
$$ y = [848290086, 847944856, 847450554, 846885741, 846334755, 845834374, 845322907, 844640195, 843703508, 843007267, 842993200, 843051851, 842610121, 841770768, 840779006, 839810312, 839068592, 838612616, 838066041, 837088466, 835750282, 834126115, 832535625, 831447482, 830944598, 831288099, 832915902, 835371196, 837509811, 838800728, 839405119, 839464426, 839030683, 838468790, 838182807, 838133872, 838300467, 838611782, 838748693, 838610470, 838318706, 837984562, 837658763, 837309003, 836846352, 836381972, 836149096, 836039186, 835857451, 835607827, 835314155, 835032642, 834859908, 834776521, 834642053, 834390521, 834071398, 833776176, 833549738, 833306253, 832992971, 832697153, 832452834, 832174003, 831810534, 831435978, 831097245, 830726027, 830291212, 829850435, 829528213, 829294086, 828987718, 828594863, 828151226, 827666879, 827169359, 826723337, 826346219, 825950086]
2011H25950086m88162n59986n31852m36067l76463l05653j59681k4378K801p3671j46866
2033.4H22850108j28448l2067L5822K0445m6611j33991k16544k77817l10898l63469
2053.8H21396530m52638m91261m49598m37379m54068m07339l57449l40163k99812k28762
2074.2H17478061j16110J7881N5254K9921K2114m8936j11341p6831l8623l7075o6041
2096.7H17108274j39475k21134k60889k65002k42472k29061k67029k90274k64943k32518
2117.1H14695477k06112k25068k82824k74419j97947j65880j82867j96874k23041k28166
2137.5H12512279j96279k20596l11137l14295k30968k39134l02851k94387k41280k23994
2157.9H09937358k46704k66075k85804k95401k92241k90454k70009k49445k52128k75969
$$ y = [825950086, 825461924, 824901938, 824370086, 823934019, 823557556, 823251903, 823092222, 823067844, 823070645, 822996974, 822850108, 822721660, 822689593, 822725415, 822745860, 822699249, 822565258, 822348714, 822070897, 821759999, 821396530, 820943892, 820452631, 820003033, 819565654, 819111586, 818704247, 818346798, 818006635, 817706823, 817478061, 817361951, 817379832, 817435086, 817465007, 817487121, 817438185, 817326844, 817250013, 817211390, 817174315, 817108274, 816968799, 816747665, 816486776, 816221774, 815979302, 815750241, 815483212, 815192938, 814927995, 814695477, 814489365, 814264297, 813981473, 813707054, 813509107, 813343227, 813160360, 812963486, 812740445, 812512279, 812316000, 812095404, 811784267, 811469972, 811239004, 810999870, 810697019, 810402632, 810161352, 809937358, 809690654, 809424579, 809138775, 808843374, 808551133, 808260679, 807990670, 807741225, 807489097, 807213128]
2178.2H07213128l07322k86877k22683k13862l11315m11152m03464l50595k94745k53916
2198.6H04157197k63512l17156l95417m62115n45084o79613q22126r47297j091898
2217G98632979j298189j498639j482368j172244p13289k08855K91705O71745Q94308
2235.4G94117153J055598J135707J036167P90417N25892K75791N2929n7578r1255j67966
2255.8G98672855k94149l35455k74301k81095l76463l91543l29137l31580l47436l21388
2276.1G95390308l42012l86476l56555k99454k72333k57016k40326k35259k81274l37780
2296.5G92381823l33250l15725l88384n46336o67930o70195o49154p27832q26478q99017
2316.9G86357522q63314n69880k29358k21491n06222o16372l82781k16603k02775j42277
$$ y = [807213128, 806905806, 806618929, 806396246, 806182384, 805871069, 805459917, 805056453, 804705858, 804411113, 804157197, 803893685, 803576529, 803181112, 802718997, 802173913, 801494300, 800672174, 799724877, 798632979, 797334790, 795836151, 794353783, 793181539, 792468250, 792259395, 792551100, 793222845, 794117153, 795172751, 796308458, 797344625, 798135042, 798660934, 798936725, 798989654, 798932076, 798840821, 798672855, 798378706, 798043251, 797768950, 797487855, 797111392, 796719849, 796390712, 796059132, 795711696, 795390308, 795048296, 794661820, 794305265, 794005811, 793733478, 793476462, 793236136, 793000877, 792719603, 792381823, 792048573, 791732848, 791344464, 790798128, 790130198, 789460003, 788810849, 788083017, 787256539, 786357522, 785494208, 784924328, 784694970, 784473479, 783967257, 783350885, 782968104, 782751501, 782548726, 782406449]
2337.3G82406449j90675k49326K44856P56621j37091j533329k210379k142369j824201
2355.7G75120556j496970p24852L22699Q60512J002253J166641J235068J250744J236618
2374G79973269J106917J015664R87589P98821M36664J17600o8903j66297k07901k53320
2394.4G83740103k90513k81453k73645k82407k64823k61903l10600l07798k37286k01047
2414.8G81028628j88648j68741j98841k30193j76192j27196j53899k19941k89917l16918
2435.2G78958142k99752k45213j52529o9439l1889o6936j38223j83821k12729k61962
2455.6G77295649l22342l18289k54213k13802k24829k62082k99215l14772l03567k98440
2476G74484098k72036j80661j30952k16782k86102k26319j87695k14279k37584l17991
$$ y = [782406449, 782215774, 781966448, 782211304, 782967925, 782830834, 781297505, 779087126, 776944757, 775120556, 773623586, 772898734, 773221433, 774081945, 775084198, 776250839, 777485907, 778736651, 779973269, 781080186, 782095850, 783083439, 783882260, 784318924, 784436524, 784367621, 784201324, 783993423, 783740103, 783449590, 783168137, 782894492, 782612085, 782347262, 782085359, 781774759, 781466961, 781229675, 781028628, 780839980, 780671239, 780472398, 780242205, 780066013, 779938817, 779784918, 779564977, 779275060, 778958142, 778658390, 778413177, 778260648, 778191209, 778159320, 778092384, 777954161, 777770340, 777557611, 777295649, 776973307, 776655018, 776400805, 776187003, 775962174, 775700092, 775400877, 775086105, 774782538, 774484098, 774212062, 774031401, 773900449, 773683667, 773397565, 773171246, 772983551, 772769272, 772531688, 772213697]
2496.4G72213697m42981m83334m64797n01812n30183n38707n94139o20246o04391n95689
2516.8G66837418n93305n32627m17292l69131l73185l50952k54274o9320J12236J94192
2537.2G64183760J47521L8147N067O5743J21356R1552K4855L9280P1406K1100m9233
2559.6G64760554j11759k04384k58148k40147k74479l53992l32594k28942j67548j74582
2580G62413979k32220k63393k00748j44661j63078k31684l40819m26412m24146l55125
2600.4G59631693k98202k85744k68877k43306k33829k49624k68340k57493k64942l12328
2620.8G56949008l40760l85881m55200m12703k93076k26378j46449k9504k4140j27614
2641.2G54507303k10285k69413k82645j94311j01805j24931j85311k28048l22818m06623
$$ y = [772213697, 771770716, 771287382, 770822585, 770320773, 769790590, 769251883, 768657744, 768037498, 767433107, 766837418, 766244113, 765711486, 765294194, 764925063, 764551878, 764200926, 763946652, 763877332, 763989568, 764183760, 764331281, 764369428, 764374495, 764440238, 764561594, 764653146, 764678001, 764717281, 764788687, 764809787, 764760554, 764648795, 764444411, 764186263, 763946116, 763671637, 763317645, 762985051, 762756109, 762588561, 762413979, 762181759, 761918366, 761717618, 761572957, 761409879, 761178195, 760837376, 760410964, 759986818, 759631693, 759333491, 759047747, 758778870, 758535564, 758301735, 758052111, 757783771, 757526278, 757261336, 756949008, 756608248, 756222367, 755767167, 755354464, 755061388, 754835010, 754688561, 754659057, 754634917, 754507303, 754297018, 754027605, 753744960, 753550649, 753448844, 753323913, 753138602, 752910554, 752587736, 752181113]
2661.6G52181113m31597m73142n16355m90248m40479m06384l57926k95639j99676j01387
2682G48468280o9201q5831r8944j25825k09212k86341l27051l72648m48227n27024
2702.4G45917976n18620m60923m41134m33683m20749l75092l43502m40419o02305p06076
2722.8G41175473p57456o91116n06937l74735l40819m01914m89116n40912o14941o64473
2743.2G35793054p29263p78794o16193m12047l90351m43279n30660o11186o07431n93245
2763.6G30080605n46277m63307m44353n12838n81324n28157m77016o09576q00670q93354
2784G24223733r75132j074374j051605j015067j149714j311302j380920j415849j477122
2802.4G13372648j591623j665831j647770j617313j704514j951158k204835k386451
$$ y = [752181113, 751749516, 751276374, 750760019, 750269771, 749829292, 749422908, 749064982, 748769343, 748569667, 748468280, 748399079, 748313248, 748214304, 748088479, 747879267, 747592926, 747265875, 746893227, 746445000, 745917976, 745399356, 744938433, 744497299, 744063616, 743642867, 743267775, 742924273, 742483854, 741881549, 741175473, 740418017, 739726901, 739219964, 738845229, 738504410, 738102496, 737613380, 737072468, 736457527, 735793054, 735063791, 734284997, 733668804, 733256757, 732866406, 732423127, 731892467, 731281281, 730673850, 730080605, 729534328, 729071021, 728626668, 728113830, 727532506, 727004349, 726527333, 725917757, 725117087, 724223733, 723248601, 722174227, 721122622, 720107555, 718957841, 717646539, 716265619, 714849770, 713372648, 711781025, 710115194, 708467424, 706850111, 705145597, 703194439, 700989604, 698603153]
2818.7F98603153k605855k954543l418028l916264m533171n474151o759882q568048
2835F60373211j1300743j5245437k0651579k7284503l4029663l9008677l8220018k6189834
2851.3D48442757l839791J7649621K7976215K7207106K0736873J2226046M191339p2539
2867.6E54517627J793921Q501708J5108288J7171561J4133156Q364081K553582j911342
2883.9F20232582m868567o637633p581770q094132q567214r267271j0177850j0910333
2900.2E54127812j1285483j1962533j3831854j7169684k1731556k6871502l1279326
2914.5D19995874l2655626k7980864j6015172k28018J2737542J8852801J9034117J6542375
2930.8D10283029J4522880J4585644J7036707K1492302K5683910K5911748K0549655
$$ y = [698603153, 695997298, 693042755, 689624727, 685708463, 681175292, 675701141, 668941259, 660373211, 649072468, 633827031, 613175452, 585890949, 551861286, 512852609, 474632591, 448442757, 444602966, 462252587, 490228802, 517435908, 538172781, 550398827, 554590166, 554517627, 556311548, 564813256, 579921544, 597093105, 611226261, 619590342, 622143924, 620232582, 615364015, 608726382, 601144612, 593050480, 584483266, 575215995, 565038145, 554127812, 542842329, 530879796, 517047942, 499878258, 478146702, 451275200, 419995874, 387340248, 359359384, 343344212, 343116194, 355853736, 374706537, 393740654, 410283029, 424805909, 439391553, 456428260, 477920562, 503604472, 529516220, 550065875]
2945.1E50065875J1058331L67045p456720q718312l450274N064785J3299525J8731892
2961.4E78962147K0441950J9257605J6340017J2185931P158756J956344k533197n758286
2977.8F48011267p088125m893660J393855Q553445J2376964J2573242J1805236J1601747
2994.1F94333971J1373043J0279238Q386969O216884M322767K907634J763523Q42154
3010.4G40426183M27901N77152Q23498P64251M45962j51396p53343r81212j285851
3028.7G40293145j924276k673388l305196l132821j372635J236916K605557K114654
3045.1G33841956J085519N19097L15786Q7857k54571m55618n26965o50942p11918o31392
3065.5G32618809k83122K74062O61731P33018N96582M13716K80261J25468r2208k18690
$$ y = [550065875, 561124206, 561491251, 554034531, 545316219, 541865945, 546930730, 560230255, 578962147, 599404097, 618661702, 635001719, 647187650, 654346406, 656302750, 653769553, 648011267, 640923142, 636029482, 637423337, 645976782, 658353746, 670926988, 682732224, 694333971, 705707014, 715986252, 724373221, 730590105, 734912872, 737820506, 739584029, 740426183, 740854084, 741431236, 742254734, 743018985, 743464947, 743313551, 742560208, 741578996, 740293145, 738368869, 735695481, 732390285, 729257464, 727884829, 729121745, 731727302, 733841956, 734927475, 735446572, 735762358, 735850215, 735595644, 735140026, 734613061, 733962119, 733250201, 732618809, 732335687, 732609749, 733271480, 734004498, 734601080, 735014796, 735295057, 735420525, 735328317, 735109627]
3085.8G35109627k25067k06292o8903J62721K41578J59561R2924O6102k2293k42412
3106.2G35067546m22299l79025l26396m44591m93288l27646o5863J26957J44959K3067
3126.6G32903421j46210j74046m4048p8857l32534m09424j64032p868j76728l59535
3147G31010139m05371m13835k99514j59978k02179k84553k67923k49445k86997l09288
3167.4G28131056l34323m00006l87490k80857k10762k50578l26634k96354k37823k37166
3187.8G25169063k32935l00587l90648l33667k72989l27349l12031k19345j95980j70886
3208.2G22412646r6142q9646j62244k74181m44412n82576o43373o64055o20246n39362
3228.6G18296409n19276n13077l87072k54393k31147l18348m96566n55695m29332l52859
$$ y = [735109627, 734884560, 734678268, 734609365, 734772086, 735013664, 735173225, 735266149, 735332251, 735309958, 735067546, 734645247, 734266222, 733939826, 733495235, 733001947, 732674301, 732608438, 732735395, 732880354, 732903421, 732757211, 732583165, 732539117, 732460260, 732127726, 731718302, 731554270, 731546402, 731369674, 731010139, 730604768, 730190933, 729891419, 729731441, 729529262, 729244709, 728976786, 728727341, 728440344, 728131056, 727796733, 727396727, 727009237, 726728380, 726517618, 726267040, 725940406, 725644052, 725406229, 725169063, 724936128, 724635541, 724244893, 723911226, 723638237, 723310888, 722998857, 722779512, 722583532, 722412646, 722316504, 722226858, 722064614, 721790433, 721346021, 720763445, 720120072, 719456017, 718835771, 718296409, 717777133, 717264056, 716876984, 716622591, 716391444, 716073096, 715576530, 715020835, 714591503, 714238644]
3249G14238644m46022n78225n73694l98994l05593m01079m61817m71354n64754o90162
3269.4G09346950o32584m35412l43800l77655m74870n35846n28037n47409n91040o25670
3289.8G04254627o52551o64652o29604n95271o68168p80762q34286q01801o71089n76437
3310.2F97380006o27696o99282p03990p19190p99894r24945r84431r49621r09865r26017
3330.6F89135075j032591j067043r98318j066208j185000j178264j125455j144529
3346.9F80337667j214623j250982j242161j168847j162946j286209j367569j388848
3363.2F70255482j415074j443922j428902j362443j315713j340926j398146j410961
3379.5F59139395j392067j412809j499235j595915j635968j569867j435996j350581
$$ y = [714238644, 713792622, 713214397, 712640703, 712241709, 711936116, 711535037, 711073220, 710601866, 710037112, 709346950, 708714366, 708278954, 707935154, 707557499, 707082629, 706546783, 706018746, 705471337, 704880297, 704254627, 703602076, 702937424, 702307820, 701712549, 701044381, 700263619, 699429333, 698627532, 697956443, 697380006, 696752310, 696053028, 695349038, 694629848, 693829954, 692905009, 691920578, 690970957, 690061092, 689135075, 688102484, 687035441, 686037123, 684970915, 683785915, 682607651, 681482196, 680337667, 679123044, 677872062, 676629901, 675461054, 674298108, 673011899, 671644330, 670255482, 668840408, 667396486, 665967584, 664605141, 663289428, 661948502, 660550356, 659139395, 657747328, 656334519, 654835284, 653239369, 651603401, 650033534, 648597538, 647246957]
3395.9F47246957j386166j464188j448393j379549j306772j254380j278520j345336
3412.2F36383653j355708j299202j238347j118600j014769j018405j005053r27628
3428.5F27405941q00132o48022n12600m43876m55379m64499l62575p0393K31087K98142
3448.9F24177694L11733M50253N47290N82039P10190R35018J200556J532436J900613
3467.2F32347822K146065K284050K529622K870321L080666L222287L444492L584385
3483.6F55509710L567934L437817L198505K991915K898097K771318K464056K079129
3499.9F78918481J957834K082705J970530J680791J530051J400352J237333J141429
3516.2F91919506J008987P65681O26803O90281Q59439R62616Q07285N47945M34280
$$ y = [647246957, 645860791, 644396603, 642948210, 641568661, 640261889, 639007509, 637728989, 636383653, 635027945, 633728743, 632490396, 631371796, 630357027, 629338622, 628333569, 627405941, 626605809, 625957787, 625445187, 625001311, 624545932, 624081433, 623718858, 623648465, 623879552, 624177694, 624489427, 624939680, 625486970, 626069009, 626779199, 627714217, 628914773, 630447209, 632347822, 634493887, 636777937, 639307559, 642177880, 645258546, 648480833, 651925325, 655509710, 659077644, 662515461, 665713966, 668705881, 671603978, 674375296, 676839352, 678918481, 680876315, 682959020, 684929550, 686610341, 688140392, 689540744, 690778077, 691919506, 692928493, 693694174, 694320977, 695011258, 695870697, 696833313, 697640598, 698188543, 698622823]
3534.5F98622823M63605M37140J93536L6478L40343O46234M42981L29256M36783K85924
3554.9G02235103J61886O5029l61324p78735m66048L71992L62575k99573n54561m56154
3575.3G00280190j96338P5638J52528K42234J222312K832353K732337J430273J099646
3593.7G09871173J129508P88331N93603L71933j71781k30432K95222L89099J55509
3612.1G13192165k4498j12712N14269R37104k682j172006r53317J012325J513601J41680
3632.4G15045929j02639K4616r8645l20792q83580j440525q62181J027107J467824
3650.8G13857114J8895p4327N28097J29640k46525m67062j056850j029670J0073j37686
3671.2G11531699n64635J093984J325011m8578l07798o44386j016796r5725J236320
$$ y = [698622823, 699086428, 699523568, 699717104, 699753582, 700093925, 700740159, 701183140, 701512396, 701949179, 702235103, 702396989, 702462018, 702100694, 701321959, 700855911, 701227903, 701590478, 701290905, 700736344, 700280190, 700083852, 700159490, 700312018, 700554252, 701776564, 704608917, 707341254, 708771527, 709871173, 711000681, 711789012, 712382615, 712754548, 712582767, 712352335, 712647557, 713036656, 713192165, 713167667, 713054955, 713569224, 714506328, 714503646, 713331640, 712378323, 713390648, 714904249, 715045929, 714943290, 714967906, 714869261, 714548469, 713664889, 712224364, 711362183, 712389290, 713857114, 713876009, 713801682, 714329779, 714459419, 714212894, 713745832, 712688982, 711659312, 711669385, 711531699, 710967064, 712061048, 713386059, 713337481, 713029683, 712385297, 711368501, 711272776, 712509096]
3689.6G12509096Q98778K7895l58045n99504m13656Q8454k16187r77814r26614L15845
3710G10348248J530827O89387n23687o18159l07143l7015L33369L20554n68151j056552
3730.3G10111678m08113P48396J101195l91543j756906o88434Q87931l69072p24614
3748.7G08510518J004875P94709p52390p81000J00255J15753m63546n21302k48849
3767.1G07759023L72648O11603j27196p29263m82619R8646R4414l3200J18434K9505
3787.5G07711995k23518n25713p16388o21557o98090k5630Q64029j6332M2260O86109
3807.8G06477165m79579j395225o67095J29997m15861K15947J028955j16110o82652
3826.2G04095542o00695n06401n18739o54161J51097J008094N76257K99633R8109q41915
$$ y = [712509096, 713407874, 713435769, 713077724, 712478220, 712064564, 712153018, 711936831, 710959017, 710032403, 710348248, 711879075, 712568462, 712044775, 711426616, 711119473, 711082458, 711415827, 711736381, 711168230, 710111678, 709703565, 710451961, 711553156, 711161613, 709404707, 708716273, 709604204, 709235132, 708510518, 709515393, 710310102, 709557712, 708776712, 708876967, 708992720, 708529174, 708007872, 707759023, 708131671, 708743274, 708616078, 707886815, 707404196, 707502842, 707597256, 707564056, 707682490, 707711995, 707488477, 706962764, 706246376, 705624819, 704926729, 704901099, 705765128, 705748796, 705791056, 706477165, 705997586, 704602361, 703935266, 704065263, 703649402, 703865349, 704894304, 704778194, 704095542, 703494847, 702988446, 702469707, 701815546, 701966643, 702974737, 703550994, 703850627, 703948736, 703106821]
3846.6G03106821j835823j399518J605154K676904l37541j398027p94113m2796j7941
3865G01563120m57704J87278O45458J21296l24071o45697k35259o6042k62618K45332
3885.4G00771093o8783l11196M56452N9247r74297q45373r1136N77450J045645O33358
3905.7G01252460k57194m64975l96789m57942k08557J65224J27376l9697n007j04487
3926.1F99610412k97427r0420K43306J35660j70290k85566j29640M6014p7545n6386
3946.5F98928118K12192J29164j59026k01225j47045j28984l7193N722j25110k11180
3966.9F98265433j03771M410l6180j18255j54376j02878j8716k0206m3392j04010j78278
3989.4F97389781j43885j36256k05398j85788
$$ y = [703106821, 701270998, 699871480, 701476634, 704153538, 703815997, 702417970, 701623857, 701581061, 701563120, 701105416, 701292694, 701938152, 702059448, 701735377, 701089680, 700854421, 700788379, 700525761, 700771093, 700702310, 700391114, 700847566, 700906813, 699932516, 699087143, 698996007, 699573457, 700619102, 701252460, 700995266, 700530291, 700133502, 699675560, 699467003, 699632227, 699759603, 699719906, 699714899, 699610412, 699312985, 699222565, 699465871, 699601531, 699431241, 699145675, 699016035, 699062049, 698984504, 698928118, 699140310, 699269474, 699110448, 698909223, 698762178, 698633194, 698596001, 698601723, 698476613, 698265433, 698161662, 698166072, 698129892, 698011637, 697857261, 697754383, 697735667, 697715461, 697672069, 697568059, 697389781, 697245896, 697109640, 696904242, 696718454]
3997.5F96718454
$$ y = [696718454]
##END=$$ End of the data block
