##TITLE=E1G3CD $$ Begin of the data block
##JCAMP-DX=5.00 $$ ACD/SpecManager v 10.08
##SPECTROMETER/DATA SYSTEM=Alpha
##DATE=03 Nov 2014 08:20:06
##DATA TYPE=INFRARED SPECTRUM
##DATA CLASS=XYDATA
##ORIGIN=
##OWNER=
##NPOINTS=1765
##FIRSTX=399.76428223
##LASTX=3997.64306641
##MAXX=3997.64306641
##MINX=399.76428223
##MAXY=0.82966739
##MINY=0.28975090
##XFACTOR=1.0000000000
##YFACTOR=1.000000000000000e-9
##FIRSTY=0.81558806
##DELTAX=2.03961372
##XUNITS=1/CM
##YUNITS=ARBITRARY UNITS
##XYDATA=(X++(Y..Y))
$$ plain form
399.8 815588057 815684021 814099491 811276376 807873726 802150249 790343642 772294641 757572055
416.1 757572055 760599613 780311882 794513404 799728036 801455319 802474201 803350449 803437948 802501798
434.4 802501798 800981164 799799025 799026668 797486663 794157505 789264679 783384204 776200891 766358435
452.8 766358435 754372895 742414415 732280850 727151871 730755985 737426579 736340225 733442783
469.1 733442783 740601301 752710223 759673119 763600290 770096183 778220177 783068478 781324983
485.4 781324983 774074495 767518222 766846180 769468546 770639598 772365212 778072596 785603821 790836513
503.8 790836513 792605698 792189598 791446447 791543007 792135119 792029202 790756583 789449751 789278448
522.1 789278448 789685488 789367735 788008749 786536813 785884857 785724342 784643352 782013059 778701127
$$ packed form
399.8H15588057R5964j584530k823115l402650n723477j1806607j8049001j4722586
416.1G57572055L027558J9712269J4201522N214632J727283J018882Q76248Q7499r36150
434.4H02501798j520634j182139p72357j540005l329158m892826n880475p183313r842456
452.8G66358435j1985540j1958480j0133565n128979L604114O670594j086354k897442
469.1G33442783P158518J2108922O962896L927171O495893Q123994M848301j743495
485.4G81324983p250488o556273o72042K622366J171052J725614N707384P531225N232692
503.8G90836513J769185m16100p43151R6560N92112j05917j272619j306832j71303
522.1G89278448M07040l17753j358986j471936o51956j60515j080990k630293l311932
$$ plain form
540.5 778701127 775618136 772058547 766106665 757468045 748965740 745625257 750545502 759821355
556.8 759821355 766933084 770508647 772505522 773920238 774549067 774236321 773645699 773583114 774055243
575.2 774055243 774541795 774640799 774502337 774743378 775447726 775889337 775391161 773969710 771937072 769167960
595.6 769167960 765225410 759836495 753382206 748455763 750170946 760129452 772511959 781179905
611.9 781179905 785549283 787883818 789866745 791702449 792811632 793158710 793465376 794098139 794263065
630.2 794263065 792862058 789868176 786649883 784944296 784900486 784719646 783242404 781647801 781364024
648.6 781364024 781344831 777364850 770001233 771007717 784305751 796153843 797589958 792957187
664.9 792957187 790206730 796666741 805794716 810809553 812474608 812702775 813306034 814429224 814936280
$$ packed form
540.5G78701127l082991l559589n951882q638620q502305l340483M920245R275853
556.8G59821355P111729L575563J996875J414716O28829l12746n90622o2585M72129
575.2G74055243M86552R9004j38462K41041P04348M41611m98176j421451k032638k769112
595.6G69167960l942550n388915o454289m926443J715183R958506J2382507Q667946
611.9G81179905M369378K334535J982927J835704J109183L47078L06666O32763J64926
630.2G94263065j401007k993882l218293j705587m3810j80840j477242j594603k83777
648.6G81364024j9193l979981p363617J006484J3298034J1848092J436115m632771
664.9G92957187k750457O460011R127975N014837J665055K28167O03259J123190N07056
$$ plain form
683.3 814936280 814299822 813459814 813587606 814542174 814983368 814208090 812845826 811935902 811218262 808932900
703.7 808932900 802948177 791711271 776545227 765903473 768466890 780144453 791048050 798314154
720 798314154 803225636 805953264 806447029 805369020 803523540 800822318 796307862 789484859 780880809
738.3 780880809 770716250 761393666 759923518 765668452 766198456 753962100 730934441 697840512
754.7 697840512 647323549 578896284 531422436 549726248 608608127 646910727 650907397 651644349
771 651644349 675149858 714099288 747214019 767438531 778058350 781352401 778129458 772849321
787.3 772849321 774522901 786174059 800005138 809308589 814382672 817268133 818897009 819845021
803.6 819845021 820731282 821643651 822120845 821740627 820775092 819715381 818186581 815868318 815019310
$$ packed form
683.3H14936280o36458q40008J27792R54568M41194p75278j362264r09924p17640k285362
703.7H08932900n984723j1236906j5166044j0641754K563417J1677563J0903597P266104
720G98314154M911482K727628M93765j078009j845480k701222m514456o823003q604050
738.3G80880809j0164559r322584j470148N744934N30004j2236356k3027659l3093929
754.7F97840512n0516963o8427265m7473848J8303812N8881879L8302600L996670P36952
771F51644349K3505509L8949430L3114731K0224512J0619819L294051l222943n280137
787.3G72849321J673580J1651158J3831079R303451N074083K885461J628876R48012
803.6H19845021Q86261R12369M77194l80218r65535j059711j528800k318263q49008
$$ plain form
822 815019310 817630410 821452975 823673725 824246764 824179411 824101806 824315846 824650466 824269354 821993470
842.4 821993470 817282736 811017573 805867553 804532051 805239558 803046227 799893916 803815782 814066052
860.7 814066052 822372019 826125443 827713847 828734934 829448998 829667389 829276979 828483999 827754319
879.1 827754319 827318370 826940358 826276422 825281024 824105501 822924435 821843207 820828557 819646895
897.4 819646895 817919910 815076113 810072541 801189423 786007941 762942672 738896847 733509004
913.7 733509004 756320119 788683891 809935808 819027007 822568178 824069202 824429512 823850572
930.1 823850572 822903812 822466791 822767437 823085070 822654963 821248889 819129229 817056835 815861464
948.4 815861464 815357089 814732909 813963056 813514352 813192546 812504172 811753392 811439335 811308563 810809791
$$ packed form
822H15019310K611100L822565K220750N73039o7353p7605K14040L34620l81112k275884
842.4H21993470m710734o265163n150020j335502P07507k193331l152311L921866J0250270
860.7H14066052Q305967L753424J588404J021087P14064K18391l90410p92980p29680
879.1H27754319m35949l78012o63936r95398j175523j181066j081228j014650j181662
897.4H19646895j726985k843797n003572q883118j5181482k3065269k4045825n387843
913.7G33509004K2811115L2363772K1251917R091199L541171J501024L60310n78940
930.1H23850572r46760m37021L00646L17633m30107j406074k119660k072394j195371
948.4H15861464n04375o24180p69853m48704l21806o88374p50780l14057j30772m98772
$$ plain form
968.8 810809791 809632897 807868898 806007624 804474771 803025246 800932229 797785282 793906569
985.1 793906569 789941132 786104560 782215536 777629554 771138012 764484823 764070630 772098780 781711698
1003.5 781711698 787059605 789136589 790422499 791139901 790387690 788319886 785799384 782017052 773640215
1021.8 773640215 756800711 732176960 714070201 720895708 744937062 762379050 767413616 766859174
1038.2 766859174 764317214 760261595 754347146 745288134 729551971 703681409 678447485 677233756
1054.5 677233756 701095462 726419151 738750279 739134252 731751263 719169259 703736067 692017496
1070.8 692017496 693660259 708653510 724800944 733646870 736642540 737522602 738065720 738652408
1087.1 738652408 739154518 739424467 739336669 738629103 737099349 735192299 733861208 733148515 732210040
$$ packed form
968.8H10809791j176894j763999j861274j532853j449525k093017l146947l878713
985.1G93906569l965437l836572l889024m585982o491542o653189m14193Q028150R612918
1003.5G81711698N347907K076984J285910P17402p52211k067804k520502l782332q376837
1021.8G73640215j6839504k4623751j8106759O825507K4041354J7441988N034566n54442
1038.2G66859174k541960m055619n914449r059012j5736163k5870562k5233924j213729
1054.5F77233756K3861706K5323689J2331128L83973p382989j2582004j5433192j1718571
1070.8F92017496J642763J4993251J6147434Q845926K995670Q80062N43118N86688
1087.1G38652408N02110K69949q7798p07566j529754j907050j331091p12693r38475
$$ plain form
1105.5 732210040 731300116 731763065 733822525 736305356 737993360 737787426 733999550 723439097 700997233
1123.8 700997233 666618288 638294399 639012754 665746272 696965814 719097316 728752136 726597965
1140.1 726597965 714170694 692274511 664683998 644516349 645878494 664031565 681495488
1154.4 681495488 690445125 695714533 705209911 719642580 732158065 739315331 742959797 744577467
1170.7 744577467 744565785 743457258 742100358 741146088 740610182 740066230 739118636 737302721 733222187
1189.1 733222187 724497616 709827304 692243278 679373443 676966846 683872283 696808636 713787496
1205.4 713787496 730896771 743191838 749587297 752798140 754723668 754678071 752371252 751101196
1221.7 751101196 754812062 762445748 770210028 776623070 781706512 785291731 787429392 788583457
$$ packed form
1105.5G32210040r09924M62949K059460K482831J688004k05934l787876j0560453k2441864
1123.8G00997233l4378945k8323889P18355K6733518L1219542K2131502R654820k154171
1140.1G26597965j2427271k1896183k7590513k0167649J362145J8153071J7463923
1154.4F81495488Q949637N269408R495378J4432669J2515485P157266L644466J617670
1170.7G44577467j1682j108527j356900r54270n35906n43952r47594j815915m080534
1189.1G33222187q724571j4670312j7584026j2869835k406597O905437J2936353J6978860
1205.4G13787496J7109275J2295067O395459L210843J925528m5597k306819j270056
1221.7G51101196L710866P633686P764280O413042N083442L585219K137661J154065
$$ plain form
1238.1 788583457 789330482 789820373 789736092 788505554 785348773 779821634 774187624 772898197 775946736
1256.4 775946736 779890835 784142196 788409114 791173816 792313695 792259991 791069448 788537383 783898234
1274.8 783898234 775425196 761304498 742653668 723851919 706822455 694381595 700700283 729723513
1291.1 729723513 758519709 770841181 772556543 771355152 769067705 765606046 760782778 754670978
1307.4 754670978 747558951 739540935 729843318 716993392 701215029 686089098 674310207 665810466
1323.7 665810466 665795028 682124853 710180104 735549808 750424385 756124496 756170571 753542781
1340 753542781 750596285 748210609 745413542 740223229 730755568 717691720 710560143 722408175
1356.4 722408175 747421503 767198920 776038766 778598607 778403819 776760221 774253309 771102488
$$ packed form
1238.1G88583457P47025M89891q4281j230538l156781n527139n634010j289427L048539
1256.4G75946736L944099M251361M266918K764702J139879n3704j190543k532065m639149
1274.8G83898234q473038j4120698j8650830j8801749j7029464j2440860O318688K9023230
1291.1G29723513K8796196J2321472J715362j201391k287447l461659m823268o111800
1307.4G54670978p112027q018016r697617j2849926j5778363j5125931j1778891q499741
1323.7F65810466j5438J6329825K8055251K5369704J4874577N700111M6075k627790
1340G53542781k946496k385676k797067n190313r467661j3063848p131577J1848032
1356.4G22408175K5013328J9777417Q839846K559841j94788j643598k506912l150821
$$ plain form
1372.7 771102488 767277896 762367845 754157662 739553750 722432911 714666188 719638467 724839032
1389 724839032 720407128 706196487 681434274 644813716 597528636 563393891 571024716 612366021
1405.3 612366021 654395700 684747100 708173335 724422991 733743012 739559352 744184315 746730685
1421.6 746730685 747877538 748865545 749541998 749260962 746816397 740591288 727047145 703510821
1437.9 703510821 673624039 637327313 596790969 560936034 544422328 561519802 603590727
1452.2 603590727 649876177 693467200 727189660 738175333 731846750 708858371 678943098
1466.5 678943098 664754212 677345216 715131044 748291194 759399772 758533537 749275446 730362177
1482.8 730362177 708279669 700666964 722579420 757838011 778025031 784838200 787465572 788395405
$$ packed form
1372.7G71102488l824592m910051q210183j4603912j7120839p766723M972279N200565
1389G24839032m431904j4210641k4762213l6620558m7285080l4134745P630825M1341305
1405.3F12366021M2029679L0351400K3426235J6249656R320021N816340M624963K546370
1421.6G46730685J146853R88007O76453k81036k444565o225109j3544143k3536324
1437.9G03510821k9886782l6296726m0536344l5854935j6513706J7097474M2070925
1452.2F03590727M6285450M3591023L3722460J0985673o328583k2988379k9915273
1466.5F78943098j4188886J2591004L7785828L3160150J1108578q66235r258091j8913269
1482.8G30362177k2082508p612705K1912456L5258591K0187020O813169K627372R29833
$$ plain form
1499.1 788395405 787962019 786522388 784575760 782319725 779145479 774595976 768663883 761047602
1515.4 761047602 751325190 738696933 719348133 692273736 655697107 613061488 587647319
1529.7 587647319 594072580 623489439 649747193 671327412 706291854 744787216 768024623
1544 768024623 780798197 786456585 787910163 787341475 785970569 784198582 781899333 778217256 772830427
1562.4 772830427 764613688 752034843 733056962 710461855 697812736 703548968 725585759 742511034
1578.7 742511034 747719586 748390019 746222496 740889251 732421339 720363915 703735590 681266248
1595 681266248 652082801 616793275 580523133 558536232 565304637 588447452 598994851 592647374
1611.3 592647374 583978534 568827212 533755720 493125796 457278192 422635645 390937388
$$ packed form
1499.1G88395405m33386j439631j946628k256035l174246m549503n932093p616281
1515.4G61047602r722412j2628257j9348800k7074397l6576629m2635619k5414169
1529.7E87647319O425261K9416859K6257754K1580219L4964442L8495362K3237407
1544G68024623J2773574N658388J453578n68688j370906j771987k299249l682077n386829
1562.4G72830427q216739j2578845j8977881k2595107j2649119N736232K2036791J6925275
1578.7G42511034N208552O70433k167523n333245q467912j2057424j6628325k2469342
1595F81266248k9183447l5289526l6270142k1986901O768405K3142815J0547399o347477
1611.3E92647374q668840j5151322l5071492m0629924l5847604l4642547l1698257
$$ plain form
1625.6 390937388 357120633 319794923 292237967 289750904 332236022 404678434 473730028
1639.9 473730028 536014378 588139474 635561109 675886333 698423326 716395140 738206983
1654.1 738206983 749609828 755057573 760476410 766612709 772009492 775237620 778465629 782503545
1670.5 782503545 785110056 786726892 788229823 788739860 788567066 788872957 790626228 791688919 791652799
1688.8 791652799 791697800 791411400 791218340 791147470 791020930 791723669 792378128 793272376 794862986 795929730
1709.2 795929730 796408117 796841025 797710896 799619913 801121294 801372409 801605105 802067161 802121162
1727.6 802121162 801803172 801591754 802756667 804309845 804352343 804310203 804678559 804925740 805044770 805119693
1748 805119693 805430889 805802166 805699408 805592775 805590153 805318415 805168033 804825127 804224968 803915620
$$ packed form
1625.6C90937388l3816755l7325710k7556956k487063M2485118P2442412O9051594
1639.9D73730028O2284350N2125096M7421635M0325224K2536993J7971814K1811843
1654.1G38206983J1402845N447745N418837O136299N396783L228128L228009M037916
1670.5G82503545K606511J616836J502931N10037j72794L05891J753271J062691l6120
1688.8G91652799M5001k86400j93060p0870j26540P02739O54459Q94248J590610J066744
1709.2G95929730M78387M32908Q69871J909017J501381K51115K32696M62056N4001
1727.6H02121162l17990k11418J164913J553178M2498m2140L68356K47181J19030P4923
1748H05119693L11196L71277j02758j06633k622k71738j50382l42906o00159l09348
$$ plain form
1768.4 803915620 804026604 804757178 805418074 805377781 805205941 805154920 804985404 804795742 804593444 804157972
1788.8 804157972 804015994 804546177 804691792 804237902 803883970 803819656 803752899 803574562 803525925 803736985
1809.2 803736985 804008663 803883851 803420126 803135157 803127587 803031743 802790284 802519321 802115798 801948488
1829.6 801948488 801843107 801028013 799742460 798505306 797494352 797079444 797853053 798972905 799237251
1847.9 799237251 799123347 798979342 798674941 798154294 797557950 797096074 796744287 796273112 795697808 795513809
1868.3 795513809 795618355 795343041 794789851 794302702 793999493 793949187 794064403 794102252 793928385 793775916
1888.7 793775916 793769002 793656528 793489039 793266177 792806029 792177856 791492105 790764749 790133357 789850712
1909.1 789850712 789833128 789700150 789337695 789000809 788623989 788069308 787751377 787689924 787504792 787113905
$$ packed form
1768.4H03915620J10984P30574O60896m0293j71840n1021j69516j89662k02298m35472
1788.8H04157972j41978N30183J45615m53890l53932o4314o6757j78337m8637K11060
1809.2H03736985K71678j24812m63725k84969p570r5844k41459k70963m03523j67310
1829.6H01948488j05381q15094j285553j237154j010954m14908P73609J119852K64346
1847.9G99237251j13904j44005l04401n20647n96344m61876l51787m71175n75304j83999
1868.3G95513809J04546k75314n53190m87149l03209n0306J15216L7849j73867j52469
1888.7G93775916o914j12474j67489k22862m60148o28173o85751p27356o31392k82645
1909.1G89850712j7584j32978l62455l36886l76820n54681l17931o1453j85132l90887
$$ plain form
1929.5 787113905 786597431 786101043 785703778 785305202 784774005 784254014 783838928 783345640 782756865 782050133
1949.9 782050133 781124294 780058622 779025197 778031588 776908755 775502741 773908854 772532225 771679103
1968.3 771679103 771280289 771109045 770898938 770440698 769741416 768836319 767668426 766219318 764627993
1986.6 764627993 763049543 761469007 759733200 757665813 755321562 752823889 750076771 746887028
2002.9 746887028 743216515 739247382 735237181 731338263 727576494 723941028 720275462 716162443
2019.2 716162443 711058319 704515100 696278036 686332166 674801528 661700130 646903634 630356491
2035.6 630356491 612172604 592472196 571327686 548886240 525338173 501039147 476747721
2049.8 476747721 453616768 433144569 417215377 408116937 408303738 419220090 439812958 465846509
$$ packed form
1929.5G87113905n16474m96388l97265l98576n31197n19991m15086m93288n88775p06732
1949.9G82050133r25839j065672j033425r93609j122833j406014j593887j376629q53122
1968.3G71679103l98814j71244k10107m58240o99282r05097j167893j449108j591325
1986.6G64627993j578450j580536j735807k067387k344251k497673k747118l189743
2002.9G46887028l670513l969133m010201l898918l761769l635466l665566m113019
2019.2G16162443n104124o543219q237064r945870j1530638j3101398j4796496j6547143
2035.6F30356491j8183887j9700408k1144510k2441446k3548067k4299026k4291426
2049.8D76747721k3130953k0472199j5929192r098440J86801J0916352K0592868K6033551
$$ plain form
2066.2 465846509 491214573 511263251 524045765 529545546 531233847 534353197 539164841 543112338
2082.5 543112338 546399772 550275385 555465043 562615514 572171330 584116042 597928107 612887919
2098.8 612887919 628418684 644122720 659733057 675003767 689649403 703442574 716265380
2113.1 716265380 728094697 738789678 748097122 755904317 762341678 767683864 772152245 775795817
2129.4 775795817 778603435 780734181 782462180 783969760 785283387 786371887 787280142 788094103 788805842
2147.7 788805842 789372265 789798021 790071964 790217161 790322363 790382683 790246964 789778948 788967133 787916958
2168.1 787916958 786876917 786376536 787034690 788870752 791124701 792988122 794127882 794570088 794565618
2186.5 794565618 794463277 794443369 794409990 794213772 793875635 793563664 793420196 793385983 793263912 792993546
$$ packed form
2066.2D65846509K5368064K0048678J2782514N499781J688301L119350M811644L947497
2082.5E43112338L287434L875613N189658P150471R555816J1944712J3812065J4959812
2098.8F12887919J5530765J5704036J5610337J5270710J4645636J3793171J2822806
2113.1G16265380J1829317J0694981R307444P807195O437361N342186M468381L643572
2129.4G75795817K807618K130746J727999J507580J313627J088500R08255Q13961P11739
2147.7G88805842N66423M25756K73943J45197J05202O0320j35719m68016q11815j050175
2168.1G87916958j040041n00381O58154J836062K253949J863421J139760M42206m470
2186.5G94565618j02341j9908l3379j96218l38137l11971j43468l4213j22071k70366
$$ plain form
2206.9 792993546 792732418 792603970 792514741 792283058 791879177 791477442 791226983 791040599 790709019 790196538
2227.3 790196538 789697886 789377332 789195240 789013624 788792193 788637877 788640738 788709998 788632393 788317144
2247.7 788317144 787934184 787671685 787470639 787156165 786679864 786167741 785771430 785459876 785077989 784628749
2268.1 784628749 784304500 784202814 784179926 784065187 783881783 783803761 783930957 784157336 784291625 784254372
2288.5 784254372 784131646 784050584 784010351 783876061 783566892 783153057 782725096 782238543 781554163 780650675
2308.9 780650675 779753745 779130399 778668642 778009713 777117372 776372015 776067019 775941253 775572538 775000572
2329.3 775000572 774547458 774339437 774228036 774014831 773691297 773528457 774050951 775251031 775574028
2347.6 775574028 774204910 772208393 770826459 770145953 769755542 769612193 769834995 770471513 771383226
$$ packed form
2206.9G92993546k61128j28448q9229k31683m03881m01735k50459j86384l31580n12481
2227.3G90196538m98652l20554j82092j81616k21431j54316K861O9260p7605l15249
2247.7G88317144l82960k62499k01046l14474m76301n12123l96311l11554l81887m49240
2268.1G84628749l24249j01686k2888j14739j83404p8022J27196K26379J34289l7253
2288.5G84254372j22726q1062m0233j34290l09169m13835m27961m86553o84380r03488
2308.9G80650675q96930o23346m61757o58929q92341p45357l04996j25766l68715n71966
2329.3G75000572m53114k08021j11401k13205l23534j62840N22494J200080L22997
2347.6G75574028j369118j996517j381934o80506l90411j43349K22802O36518R11713
$$ plain form
2366 771383226 772352874 773298025 774198949 774982214 775558412 775905371 776190281 776618421 777154684 777553320
2386.4 777553320 777657688 777524650 777328849 777178407 777047396 776907563 776788294 776747048 776807249 776896775
2406.8 776896775 776893437 776756227 776559949 776390076 776244700 776052535 775779486 775475502 775247037 775201201
2427.2 775201201 775310218 775411367 775406837 775307298 775152862 774957240 774708271 774448812 774256349 774160028
2447.6 774160028 774111629 774045527 773973703 773950219 773979485 774011433 773999095 773925066 773789406 773627520 773459733
2470 773459733 773253977 773005426 772771180 772588909 772454798 772345126 772200286 771991909 771763921 771549225
2490.4 771549225 771336615 771079361 770749927 770415246 770154297 769957840 769763529 769518435 769215882 768881261
2510.8 768881261 768562913 768349290 768291771 768349349 768457055 768545687 768551171 768457949 768296480 768102229 767880797
$$ packed form
2366G71383226R69648R45151R00924P83265N76198L46959K84910M28140N36263L98636
2386.4G77553320J04368j33038j95801j50442j31011j39833j19269m1246O0201Q9526
2406.8G76896775l338j37210j96278j69873j45376j92165k73049l03984k28465m5836
2427.2G75201201J09017J01149m530r9539j54436j95622k48969k59459j92463r6321
2447.6G74160028m8399o6102p1824k3484K9266L1948j2338p4029j35660j61886j67787
2470G73459733k05756k48551k34246j82271j34111j09672j44840k08377k27988k14696
2490.4G71549225k12610k57254l29434l34681k60949j96457j94311k45094l02553l34621
2510.8G68881261l18348k13623n7519N7578J07706Q8632N484r3222j61469j94251k21432
$$ plain form
2533.2 767880797 767601132 767222166 766786516 766423881 766170263 765930235 765649021 765364468 765137494 765020072
2553.6 765020072 765005410 765016377 764972627 764861047 764729202 764606833 764473438 764314651 764175475 764128089
2574 764128089 764178514 764243066 764232218 764132977 763985276 763788760 763505220 763143182 762753129 762396991 762138426
2596.4 762138426 761964083 761778116 761548281 761395395 761419773 761497378 761435509 761233747 761061490 761029899
2616.8 761029899 761055171 761015594 760922074 760821283 760712802 760589778 760420322 760146141 759772003 759387612
2637.2 759387612 759032667 758665919 758302510 758018672 757837474 757703006 757515013 757162631 756638169 756058276
2657.6 756058276 755527079 755076647 754682958 754316926 754014671 753856838 753859878 753958285 754121900 754384577
2678 754384577 754775047 755223691 755539298 755615652 755548358 755466700 755384922 755228877 754951298 754615128 754367828
$$ packed form
2533.2G67880797k79665l78966m35650l62635k53618k40028k81214k84553k26974j17422
2553.6G65020072j4662J0967m3750j11580j31845j22369j33395j58787j39176m7386
2574G64128089N0425O4552j0848r9241j47701j96516k83540l62038l90053l56138k58565
2596.4G62138426j74343j85967k29835j52886K4378P7605o1869k01762j72257l1591
2616.8G61029899K5272l9577r3520j00791j08481j23024j69456k74181l74138l84391
2637.2G59387612l54945l66748l63409k83838j81198j34468j87993l52382n24462n79893
2657.6G56058276n31197m50432l93689l66032l02255j57833L040R8407J63615K62677
2678G54384577L90470M48644L15607P6354o7294q1658q1778j56045k77579l36170k47300
$$ plain form
2700.5 754367828 754255831 754173756 754042685 753897786 753798664 753696203 753463984 753075898 752644181 752276838
2720.9 752276838 751992762 751708269 751306832 750887096 750680149 750694036 750751615 750665367 750376761 750063002
2741.2 750063002 749890387 749766886 749502599 749066234 748607874 748258710 747989237 747681201 747280061 746879339
2761.6 746879339 746599734 746417224 746223152 745976686 745721757 745467484 745107353 744537771 743808687 743102431
2782 743102431 742584169 742311835 742229998 742187858 742074847 741924763 741805673 741713583 741631985 741571009 741503775
2804.5 741503775 741367102 741126657 740792930 740411639 740039766 739685476 739315331 738916993 738494873 738065302
2824.9 738065302 737670898 737320244 736977339 736629307 736278355 735901773 735409439 734727502 733916461 733070672
2845.3 733070672 732268691 731566727 730943620 730374992 729860783 729364216 728823721 728182018 727416337 726537883
$$ packed form
2700.5G54367828j11997q2075j31071j44899r9122j02461k32219l88086m31717l67343
2720.9G52276838k84076k84493m01437m19736k06947J3887N7579q6248k88606l13759
2741.2G50063002j72615j23501k64287m36365m58360l49164k69473l08036m01140m00722
2761.6G46879339k79605j82510j94072k46466k54929k54273l60131n69582p29084p06256
2782G43102431n18262k72334q1837m2140j13011j50084j19090r2090q1598o0976o7234
2804.5G41503775j36673k40445l33727l81291l71873l54290l70145l98338m22120m29571
2824.9G38065302l94404l50654l42905l48032l50952l76582m92334o81937q11041q45789
2845.3G33070672q01981p01964o23107n68628n14209m96567n40495o41703p65681q78454
$$ plain form
2865.7 726537883 725553095 724491239 723377287 722124934 720695317 719255865 717921257 716642737
2882 716642737 715421796 714358509 713450670 712525487 711548269 710905790 711170316 712451756 714150369
2900.3 714150369 715481579 716010153 715687335 714690566 713350654 712063074 711091518 710468233 710086763
2918.7 710086763 709927320 710093915 710589588 711275220 711971879 712587774 713245273 714029133 714748859 715187073
2939.1 715187073 715354443 715370476 715257347 714951396 714474916 713948488 713415623 712868035 712332368 711815298
2959.5 711815298 711314201 710855544 710478127 710152745 709797561 709438264 709137022 708811224 708376169 707811952
2979.9 707811952 707064748 706211627 705423117 704655647 703766286 702705741 701535463 700506449 699746668
2998.2 699746668 699241757 699240506 699739516 700087070 699749231 698719203 697111487 695051074 692926526
$$ packed form
2865.7G26537883r84788j061856j113952j252353j429617j439452j334608j278520
2882G16642737j220941j063287r07839r25183r77218o42479K64526J281440J698613
2900.3G14150369J331210N28574l22818r96769j339912j287580r71556o23285l81470
2918.7G10086763j59443J66595M95673O85632O96659O15895O57499P83860P19726M38214
2939.1G15187073J67370J6033j13129l05951m76480n26428n32865n47588n35667n17070
2959.5G11815298n01097m58657l77417l25382l55184l59297l01242l25798m35055n64217
2979.9G07811952p47204q53121p88510p67470q89361j060545j170278j029014p59781
2998.2F99746668n04911j251M99010L47554l37839j030028j607716k060413k124548
$$ plain form
3016.6 692926526 691273272 690295696 689861834 689732730 689442337 688680589 687765956 687006950 686003208
3034.9 686003208 684266865 682085633 680118799 678578079 677450240 677130640 678041339 679858148 681699693
3053.3 681699693 682816923 682857215 681824267 680176318 678970516 679133654 680214345 680912137 680688202
3071.7 680688202 679794431 678599894 677637041 677552283 678514242 679988801 681317508 682282388 682934105
3090 682934105 683226228 683195591 683064520 682922244 682673693 682253003 681686819 681044102 680312753 679497123
3110.4 679497123 679033935 679412782 680337250 681107402 681403637 681329012 681118071 680875778 680542052 680087328
3130.8 680087328 679646313 679345667 679157138 678970695 678703785 678440869 678288221 678196609 678094208 677936494
3151.2 677936494 677633107 677152216 676590025 676020503 675490856 675042927 674630165 674191356 673698962 673159420
$$ packed form
3016.6F92926526j653254r77576m33862j29104k90393p61748r14633p59006j003742
3034.9F86003208j736343k181232j966834j540720j127839l19600R10699J816809J841545
3053.3F81699693J117230M0292j032948j647949j205802J63138J080691O97792k23935
3071.7F80688202q93771j194537r62853q4758R61959J474559J328707R64880O51717
3090F82934105K92123l0637j31071j42276k48551m20690n66184o42717p31349q15630
3110.4F79497123m63188L78847R24468P70152K96235p4625k10941k42293l33726m54724
3130.8F80087328m41015l00646j88529j86443k66910k62916j52648r1612j02401j57714
3151.2F77936494l03387m80891n62191n69522n29647m47929m12762m38809m92394n39542
$$ plain form
3171.6 673159420 672613263 672072053 671522856 670916080 670220971 669555247 668986917 668410361 667766035 667063534
3192 667063534 666309237 665548921 664782941 663930595 663031757 662237883 661538482 660789728 659910142 658956826
3212.4 658956826 658047676 657166421 656257749 655365586 654506087 653651357 652787328 651906192 651001990 650078297
3232.8 650078297 649173558 648335099 647536337 646707416 645872116 645091891 644349873 643606246 642869532 642203689
3253.2 642203689 641667187 641234994 640803516 640308797 639806569 639349222 638843656 638203025 637547493 636963546
3273.6 636963546 636354089 635652542 634843588 633945584 633018136 632072151 631116450 630177796 629204273 628103793
3294 628103793 626883626 625630319 624384463 623198152 622078240 620841563 619339228 617620587 615818799
3312.3 615818799 614019454 612230897 610423982 608573020 606720507 604841530 602804601 600615442
$$ packed form
3171.6F73159420n46157n41210n49197o06776o95109o65724n68330n76556o44326p02501
3192F67063534p54297p60316p65980q52346q98838p93874o99401p48754q79586r53316
3212.4F58956826r09150q81255r08672q92163q59499q54730q64029q81136r04202r23693
3232.8F50078297r04739q38459p98762q28921q35300p80225p42018p43627p36714o65843
3253.2F42203689n36502m32193m31478m94719n02228m57347n05566o40631o55532n83947
3273.6F36963546o09457p01547q08954q98004r27448r45985r55701r38654r73523j100480
3294F28103793j220167j253307j245856j186311j119912j236677j502335j718641j801788
3312.3F15818799j799345j788557j806915j850962j852513j878977k036929k189159
$$ plain form
3328.6 600615442 598337948 595996559 593725741 591570079 589280844 586738646 584104240 581428111
3345 581428111 578745365 576166809 573512912 570555985 567458272 564480603 561652601 558808267 555907607
3363.3 555907607 553175390 550600648 547817528 544688463 541566074 538765728 536194205 533703148
3379.6 533703148 531253994 528879285 526679218 524736762 523026764 521286786 519303083 517336309
3395.9 517336309 515742600 514360964 512703836 510739148 508951962 507523715 506241739 504964411
3412.3 504964411 503620744 502241969 501066804 500175595 499347806 498542130 497975588 497677743 497444630
3430.6 497444630 497274429 497252196 497172058 496872753 496632695 496711940 497074366 497656107 498256505 498801708
3451 498801708 499466002 500282288 501227558 502285480 503363431 504492402 505806506 507230163 508442640
$$ packed form
3328.6F00615442k277494k341389k270818k155662k289235k542198k634406k676129
3345E81428111k682746k578556k653897k956927l097713k977669k828002k844334k900660
3363.3E55907607k732217k574742k783120l129065l122389k800346k571523k491057
3379.6E33703148k449154k374709k200067j942456j709998j739978j983703j966774
3395.9E17336309j593709j381636j657128j964688j787186j428247j281976j277328
3412.3E04964411j343667j378775j175165q91209q27789q05676n66542k97845k33113
3430.6D97444630j70201k2233q0138k99305k40058P9245L62426N81741O00398N45203
3451D98801708O64294Q16286R45270J057922J077951J128971J314104J423657J212477
$$ plain form
3469.4 508442640 509349883 510328054 511622131 513071001 514484167 515820324 517145574 518548369 519983947
3487.7 519983947 521359265 522727728 524199367 525770962 527237475 528610647 530232906 531906962
3504 531906962 533175170 534426153 536101580 537947714 539616227 541077375 542476714 543981969 545765698
3522.4 545765698 547596037 549223304 550951660 552818894 554573059 556407988 558418512 560261309
3538.7 560261309 561929345 563781202 566039145 568328202 570103943 571871877 574129045 576338947
3555 576338947 578338623 580487192 582550526 584115922 586190224 589978933 593578756 595574379 597401381
3573.4 597401381 599889576 602670014 605472922 608007193 610090375 612718105 616745710 620224535
3589.7 620224535 622233331 624608457 627808213 630915105 633939624 636805415 638882816 640851080
$$ packed form
3469.4E08442640R07243R78171J294077J448870J413166J336157J325250J402795J435578
3487.7E19983947J375318J368463J471639J571595J466513J373172J622259J674056
3504E31906962J268208J250983J675427J846134J668513J461148J399339J505255J783729
3522.4E45765698J830339J627267J728356J867234J754165J834929K010524J842797
3538.7E60261309J668036J851857K257943K289057J775741J767934K257168K209902
3555E76338947J999676K148569K063334J565396K074302L788709L599823J995623J827002
3573.4E97401381K488195K780438K802908K534271K083182K627730M027605L478825
3589.7F20224535K008796K375126L199756L106892L024519K865791K077401J968264
$$ plain form
3606 640851080 643914878 647272348 650106788 652588546 654518008 657368422 661282063 663425684 663567960
3624.4 663567960 664061189 668034792 672903538 674549580 675516427 676971257 678421497 679804921 680453181
3642.7 680453181 680140495 680782616 684768200 688807905 688936472 688586533 690314114 691700280 691889048
3661.1 691889048 691858172 691300154 690679133 691986978 693592370 693442047 695270061 697703958 697483420
3679.4 697483420 696683884 695743918 694609344 695220709 698126972 699838638 699477851 698717594 698080003
3697.8 698080003 698026657 699124098 699727237 698680043 697584033 698395133 700933218 701776028 700526476
3716.2 700526476 699328423 698974133 699131906 699467659 699777305 699045837 697588503 697345495 699203432
3734.5 699203432 701525629 701319933 698501885 696970344 699223399 699995279 698913991 700787485 702779174
$$ packed form
3606F40851080L063798L357470K834440K481758J929462K850414L913641K143621J42276
3624.4F63567960M93229L973603M868746J646042R66847J454830J450240J383424O48260
3642.7F80453181l12686O42121L985584M039705J28567l49939J727581J386166J88768
3661.1F91889048l0876n58018o21021J307845J605392j50323J828014K433897k20538
3679.4F97483420p99536r39966j134574O11365K906263J711666l60787p60257o37591
3697.8F98080003n3346J097441O03139j047194j096010Q11100K538085Q42810j249552
3716.2G00526476j198053l54290J57773L35753L09646p31468j457334k43008J857937
3734.5F99203432K322197k05696k818048j531541K253055P71880j081288J873494J991689
$$ plain form
3752.9 702779174 701696634 700304151 700633407 701064825 700279534 699729145 699800432 700445473 701277316
3771.2 701277316 700900972 699820340 699497700 700250328 700534701 700097799 700081408 700118661 699833632 699239612
3791.6 699239612 698442280 698145986 697753608 697648823 699223995 699558914 699145854 700043142 699569404
3810 699569404 697450697 696301162 697134495 697333694 697651267 699325860 699107826 697985470 697224677
3828.3 697224677 696463227 696036875 695613325 695849359 697295010 698088765 698024869 697756827 696458638
3846.7 696458638 693877459 691829681 694451690 699271977 698886871 696246624 694649458 694732249 695218801
3865 695218801 694555163 694588602 695791364 696105003 695634842 694417059 693867862 694400370 694420278 694989800
3885.4 694989800 695057750 694089711 694519222 694922805 693468213 692080379 692138553 693094611 694451571
$$ packed form
3752.9G02779174j082540j392483L29256M31418p85291n50389P1287O45041Q31843
3771.2G01277316l76344j080632l22640P52628K84373m36902j6391L7253k85029n94020
3791.6F99239612p97332k96294l92378j04785J575172L34919m13060Q97288m73738
3810F99569404k118707j149535Q33333J99199L17573J674593k18034j122356p60793
3828.3F97224677p61450m26352m23550K36034J445651P93755o3896k68042j298189
3846.7F96458638k581179k047778K622009M820287l85106k640247j597166Q2791M86552
3865F95218801o63638L3439J202762L13639m70161j217783n49197N32508J9908N69522
3885.4F94989800O7950r68039M29511M03583j454592j387834N8174R56058J356960
$$ plain form
3903.8 694451571 695176601 694498241 693492413 692797005 692189157 692128599 692717552 692927122 692580342 692518771
3924.2 692518771 692518950 691975355 691713929 692266822 692637920 692345142 691870153 691646516 691895127 692017257
3944.6 692017257 691758215 691781342 691917658 691713810 691385865 691167414 691054761 691084266 691170275 691121578
3965 691121578 691045284 691031396 690977931 690926015 690963268 690945566 690829396 690792620 690824687 690766454 690622032
3987.4 690622032 690520704 690466821 690396905 690352201 690351546
3997.6 690351546
$$ packed form
3903.8F94451571P25030o78360j005828o95408o07848o0558N88953K09570l46780o1571
3924.2F92518771J79n43595k61426N52893L71098k92778m74989k23637K48611J22130
3944.6F92017257k59042K3127J36316k03848l27945k18451j12653K9505Q6009m8697
3965F91121578p6294j3888n3465n1916L7253j7702j16170l6776L2067n8233j44422
3987.4F90622032j01328n3883o9916m4704o55
3997.6F90351546
##END=$$ End of the data block
