##TITLE=Douglasl - Epoxido $$ Begin of the data block
##JCAMP-DX=5.00 $$ ACD/SpecManager v 10.08
##SPECTROMETER/DATA SYSTEM=Alpha
##DATE=28 Apr 2015 09:23:26
##DATA TYPE=INFRARED SPECTRUM
##DATA CLASS=XYDATA
##ORIGIN=
##OWNER=
##NPOINTS=1765
##FIRSTX=399.76428223
##LASTX=3997.64306641
##MAXX=3997.64306641
##MINX=399.76428223
##MAXY=1.00000000
##MINY=0.49788237
##XFACTOR=1.0000000000
##YFACTOR=0.000000010000000
##FIRSTY=1.00000000
##DELTAX=2.03961372
##XUNITS=1/CM
##YUNITS=ARBITRARY UNITS
##XYDATA=(X++(Y..Y))
399.8A00000000p55221j230329q38798k47461K65062N75054O20776M03798l81363q04323
420.2I7607195L85881J290637P16287m42392n93519J33598J79368n94121o04278L86530
440.6I8465186Q95048J29687o16753j46276N88543K20704o57797n80484K59769K13266
461I8770893o78414q08383K17480Q60065J77145n42223M154P05928K37649o36714m45652
483.4I7861928M38446L90249n39738p49278J17993N01520k95568q91900k89666L93396
503.8I6937382j80876j139975j068937n61870j184886k870786l462297j069474K411091
522.1H7809372L588271K432013J363027R63950M6921j081574j192797p66575j259637
540.5I1902971k164191j711857m24701J24294N72747J587516K260989J941293O94269
$$ plain form
399.8 100000000 99244779 98014450 97175652 96928191 97193253 97768307 98389083 98792881 98411518 97607195
420.2 97607195 97993076 99283713 100000000 99557608 98964089 99097687 99277055 98682934 98078656 98465186
440.6 98465186 99360234 99489921 98873168 98726892 99315435 99536139 98878342 98297858 98557627 98770893
461 98770893 98092479 97284096 97501576 98361641 98538786 97996563 98000717 98706645 98944294 98307580 97861928
483.4 97861928 98300374 98690623 98150885 97401607 97519600 98021120 97725552 96833652 96543986 96937382
503.8 96937382 96756506 95616531 94547594 93985724 92800838 89930052 86467755 85398281 87809372
522.1 87809372 91397643 93829656 95192683 96156633 96203554 95121980 93929183 93162608 91902971
540.5 91902971 89738780 88026923 87602222 87726516 88299263 89886779 92147768 94089061 94783330
558.9I4783330o88088j047987o20991r02658k383459l639388k590096J235843M622799
577.2H8769305M396868K637660J678288P74133l49545n20319K65861M81086l55100
595.6I7778237q57204k20353L78162j78993j044702r29737m34578j269960k783841
613.9I0437031j331246K264303K199405j166814l311461k302969J141775L191977J361263
632.3I2483264j88195J914602L133774J048982n57786j42485L38101l14373j081037
650.6I6634847p32285m0644l63326j325304j516091r14550p14767k019072l897834
669H5110974k081698P28077K372581J913929J80584r69118j790720l323847n656255
687.3G6484507p531035n476945J882028Q541477R178519O342358L649562J740301Q69113
$$ plain form
558.9 94783330 94095242 93047255 92426264 91523606 89140147 85500759 82910663 84146506 88769305
577.2 88769305 93166173 95803833 97482121 98256254 97906709 97386390 97652251 98133337 97778237
595.6 97778237 96921033 96700680 97078842 96899849 95855147 94925410 94490832 93220872 90437031
613.9 90437031 89105785 91370088 93569493 92402679 89091218 86788249 87930024 91122001 92483264
632.3 92483264 92295069 94209671 97343445 98392427 97834641 97692156 98030257 97715884 96634847
650.6 96634847 95902562 95861918 95498592 94173288 92657197 91742647 91027880 89008808 85110974
669 85110974 83029276 83757353 86129934 88043863 88224447 87255329 85464609 82140762 76484507
687.3 76484507 68953472 63476527 65358555 73900032 83078551 89420909 93070471 94810772 95679885
705.7I5679885P05713j32453j596809j407718R14836K519893J745576J99503j99885
724.1I8428541K04832j17612j462001k826881l262466j410443K051234L181655J474756
742.4I6261615k77806j939255m036444n806291n844844j708609N183399Q176530N803477
760.8I5811772K672410O93089m77534o08784j39153k60163j074964j522159j339448
779.1I3755066j743561l588694n225146k803719L444338O434816L483373r0009j383120
797.5I2283344k059006l296119m678208n624449n345005k526826K168018N630135O194055
815.8H2745939M694373K623320J073455J47730q15033k055562k545810k039766k864426
834.2H0964220n339760n566895j443404M804486Q741087P635158M035229J672911O89519
$$ plain form
705.7 95679885 96385598 96253145 94656336 93248618 94163454 96683347 98428923 98628426 98428541
724.1 98428541 98633373 98515761 97053760 94226879 90964413 89553970 91605204 94786859 96261615
742.4 96261615 95983809 94044554 90008110 84201819 78356975 76648366 81831765 90008295 95811772
760.8 95811772 98484182 99177271 98699737 98090953 97951800 97691637 96616673 95094514 93755066
779.1 93755066 92011505 88422811 83197665 80393946 83838284 90273100 93756473 93666464 92283344
797.5 92283344 90224338 86928219 82250011 76625562 71280557 68753731 70921749 76551884 82745939
815.8 82745939 87440312 90063632 91137087 91284817 90469784 88414222 85868412 83828646 80964220
834.2 80964220 75624460 70057565 68614161 73418647 82159734 89794892 93830121 95503032 96192551
852.6I6192551l24047j356876j938253k240748j369452J238477L136551K729649J453143
870.9I7520995J70207j055640j681471j827573k499331l923326m741812l611159r45461
889.3G7405429J867330M085076N171323M645741K957552J156217J82986K65843O01178
907.6I8338675L91126m2134L8498M28719L42249j91956l65037L0714K44129j57672
928I9057311n51039l01129J43469o50n83404r21381j014656j081764p00725K31505
948.4I4277537J067728J167166M14616n06854r29940r18525m37838K63345N26386O29497
968.8I5553118O42627Q5015n59229n44387l6663J38438k25383m07595p2521J51718
989.2I4725138l11190r29385p30890j02723q3023k22093k5046n233l87240r53418j099282
$$ plain form
852.6 96192551 95868504 94511628 92573375 90332627 88963175 90201652 93338203 96067852 97520995
870.9 97520995 97691202 96635562 94954091 93126518 90627187 86703861 81962049 78350890 77405429
889.3 77405429 79272759 83357835 88529158 93174899 96132451 97288668 97471654 97737497 98338675
907.6 98338675 98729801 98687667 98726165 99154884 99497133 99305177 98940140 98970854 99214983 99057311
928 99057311 98506272 98205143 98348612 98347962 97764558 96843177 95828521 94746757 94046032 94277537
948.4 94277537 95345265 96512431 96927047 96420193 95490253 94571728 94133890 94397235 94923621 95553118
968.8 95553118 96195745 96280760 95721531 95177144 95140481 95278919 95053536 94645941 94573420 94725138
989.2 94725138 94413948 93484563 92753673 92650950 92567927 92345834 92320788 92315555 91928315 90974897 89875615
1011.6H9875615o65450m70859j150167k478439l807580l608752j421356q30149l095425
1030G2347438l846961p83968L813619O658583O602192N022121L231090J610994N49764
1048.4I5204872K02322r3454r19909j623821r81885P13444J565587R12220J08951O0242
1068.8I5148569J80203j78212o77299n94902l0780J66780m5485M1479L43847K26313
1089.2I4580513l51256p73376p09480p03740j397467k343482k070045l58093J98156
1107.5H6071730j307887j395041J233316L406095L084868J486314N25450M56947L59106
1125.9I3920898o0910k48748K2710K24191k4844l34829k43508q792j50585n25481o00117
1148.3I1969985m12160m25625o15949o16663m79824n76126r99373j223058j068270
$$ plain form
1011.6 89875615 89210165 88739306 87589139 85110700 81303120 77694368 76273012 75442863 72347438
1030 72347438 68500477 67716509 71530128 78188711 84790903 89813024 93044114 94655108 95204872
1048.4 95204872 95407194 95313740 94393831 92770010 91788125 92501569 94067156 94979376 95088327 95148569
1068.8 95148569 95328772 95150560 94473261 93878359 93847579 94014359 93968874 94010353 94354200 94580513
1089.2 94580513 94229257 93455881 92746401 92042661 90645194 88301712 86231667 85873574 86071730
1107.5 86071730 84763843 83368802 84602118 88008213 91093081 92579395 93104845 93561792 93920898
1125.9 93920898 93859988 93611240 93633950 93858141 93833297 93498468 93254960 93246168 93095583 92570102 91969985
1148.3 91969985 91557825 91132200 90516251 89899588 89419764 88843638 87844265 86621207 85552937
1166.7H5552937j304573k339292l703290m547602l302181J93251L312456N015230N834687
1185H4711623N079901K843035N15633p77441r70667n74416q4412N3829o4367j91153
1205.4I0541565m68909q48675r32789p47156p67791j147640j499456j569832j648587
1223.8H0910730k051907k569998k735561k582949k523470k505213k054990j285201
1240.1F2601441r61745j440143k264452k502889j201003J717203M883564O670773O777656
1258.4G4280405N833238M206890K323681Q57628k6804p96456j732242k539837l008491
1276.8G9398012l258681l291309k841383j430756J138431L790134M889667M230285
1293.1H2624400K734953J037973n55283j603353j812500k139496l578091l835148o85942
$$ plain form
1166.7 85552937 84248364 81909072 78205782 73658180 70355999 70549250 73861706 78876936 84711623
1185 84711623 89791524 92634559 93150192 92372751 91402084 90827668 90743256 90797085 90732718 90541565
1205.4 90541565 90072656 89223981 88291192 87544036 86776245 85628605 84129149 82559317 80910730
1223.8 80910730 78858823 76288825 73553264 70970315 68446845 65941632 63886642 62601441
1240.1 62601441 61639696 60199553 57935101 55432212 54231209 55948412 60831976 67502749 74280405
1258.4 74280405 80113643 84320533 86644214 87501842 87475038 86678582 84946340 82406503 79398012
1276.8 79398012 76139331 72848022 70006639 68575883 69714314 73504448 78394115 82624400
1293.1 82624400 85359353 86397326 85842043 84238690 82426190 80286694 76708603 72873455 72187513
1311.5G2187513K856839K877015O38181N48327L557706N653464M575986K342802J030141
1329.8I6267974O23924L29018j77676n59473l99792M5633J44357o7926j12361J47552
1350.2I6241230K82949N8162j71429j47485j26255k95752l84051k16484n5683j11776
1370.6I5073426l33375m71497m22793m86463p44814q70812p08872n69529p20399j012260
1391H8732612j384824j800239k115828k506507k150505l56544J874704K576816J626682
1409.4H4496367O47372J53708j26743m82190q03959p31695o79636q47351j040369j277894
1429.8G9307610j386178j402879j910710k511751j733846k52384L3718j510804k578557
1448.1F6054219j014715J601386L065788M057897L896331J122004j019519k109409
$$ plain form
1311.5 72187513 75044352 77921367 78559548 79107875 82665581 88319045 92895031 95237833 96267974
1329.8 96267974 96891898 97220916 97043240 96483767 96083975 96129608 96273965 96206039 96093678 96241230
1350.2 96241230 96524179 96582341 96410912 96263427 96137172 95841420 95457369 95240885 95185202 95073426
1370.6 95073426 94740051 94268554 93845761 93359298 92614484 91743672 91034800 90465271 89744872 88732612
1391 88732612 87347788 85547549 83431721 80925214 78774709 78418165 80292869 82869685 84496367
1409.4 84496367 85143739 85297447 85170704 84688514 83884555 83152860 82473224 81625873 80585504 79307610
1429.8 79307610 77921432 76518553 74607843 72096092 70362246 70109862 70143580 68632776 66054219
1448.1 66054219 65039504 66640890 69706678 73764575 77660906 78782910 77763391 75653982
1464.5G5653982o22648K143663L100217K584916J519543Q62652O10334M38475L17145
1482.8H6608279K22432O4838j84917l60829k45732n6439O7478q4108m59916q60661
1503.2H4710425j892203m166192m751438n098259n990857l969866K169889Q129090
1519.5F9140589J0438538P822078M499168L119909J856578R28729M02362L6829k17813
1537.9I8026967m92346n93543n25773n33861m71258m15087l76057l85273l78555l38614
1558.3I3516600j96397j09351k90936n17243q97044j525504j946485k430993j661473
1576.6H3941174R83238R36961j456499k251399J18977K015066M71950k523673l692209
1595G8543586j468724K002251K856671R47792j277399k811504l548938k613127L219
$$ plain form
1464.5 75653982 75031334 77174997 80275214 82860130 84379673 85242325 85852659 86291134 86608279
1482.8 86608279 86830711 86895549 86710632 86349803 86104071 86047632 86115110 86031002 85571086 84710425
1503.2 84710425 82818222 78652030 73900592 68802333 62811476 58841610 61011499 69140589
1519.5 69140589 79579127 87401205 91900373 95020282 96876860 97805589 98207951 98244780 98026967
1537.9 98026967 97534621 96941078 96415305 95881444 95410186 94995099 94619042 94233769 93855214 93516600
1558.3 93516600 93320203 93210852 92919916 92402673 91505629 89980125 88033640 85602647 83941174
1576.6 83941174 84924412 85861373 84404874 82153475 82272452 84287518 84759468 82235795 78543586
1595 78543586 77074862 79077113 81933784 82881576 81604177 78792673 75243735 72630608 72633827
1613.4G2633827L415638N591297L785783J774192R54175K55895j48583j32096j19674
1631.7H8010454l78251q48818q60083o76668q25673j208246k162075k909535k329171
1650.1G5811934k963292n155081m903423n049325n106413k846163J297938M466683
1666.4E5552858O485349O755865M237336K604287K191723J818746J502931J372588
1682.7H2521683J587516J383883R36663O53321O59084J486718K265841J942653J651519
1701.1I5088881J222879R52637Q27599M92590K70266K03001J57625O1434P016N8031
1721.5I9341959P4446J1969j05751j53869j05214N871J36983J88112K34980K24834
1741.9I9854320R4962l4052m5466K8992P1102J3202k8902J4091L1751m9609j26004
$$ plain form
1613.4 72633827 76049465 81640762 85426545 87200737 88154912 88410807 88262224 88130128 88010454
1631.7 88010454 87632203 86783385 85923302 85246634 84420961 83212715 81050640 78141105 75811934
1650.1 75811934 72848642 67693561 62790138 57740813 52634400 49788237 51086175 55552858
1666.4 55552858 62038207 68794072 73031408 75635695 77827418 79646164 81149095 82521683
1682.7 82521683 84109199 85493082 86429745 87083066 87742150 89228868 91494709 93437362 95088881
1701.1 95088881 96311760 97264397 98091996 98584586 98854852 99057853 99215478 99276912 99283928 99341959
1721.5 99341959 99416405 99428374 99322623 99168754 99063540 99069411 99206394 99394506 99629486 99854320
1741.9 99854320 99949282 99915230 99869764 99898756 99969858 99983060 99954158 99968249 100000000 99950391 99824387
1764.3I9824387r7972m1038n2649j56015j30367k2602k7204j24371j39207J145J32459
1786.7I9166566R0808o6519j14185K1601J03295N7030J7976P0304R4175J0753q0728
1809.2I9371076n7197K9856K6488o9850j16110p7391o9171j44106j81198o7521J43630
1831.6I8788506K07919J07056L8939O0046M3893o2335r8633n955O4820M1890k8407
1854I9157739l5942J5104J8716m8793r0551o9302l9172m3869o0756l3974K9909L9727
1878.5I8838836l0369p6830m9341k6452p7230j25706j00351p5334j28084k57635m05771
1900.9I7485733n70857q35836j041258n90521N37521J224947R64832L70532m1401j63591
1921.3I7340101m8584J83457L08258K71368J61755K5272r1362r9528R728J24031J62953
$$ plain form
1764.3 99824387 99726415 99685377 99632728 99476713 99346346 99323744 99296540 99172169 99032962 99034107 99166566
1786.7 99166566 99257374 99190855 99076670 99098271 99201566 99258596 99276572 99346876 99441051 99451804 99371076
1809.2 99371076 99313879 99343735 99370223 99300373 99184263 99106872 99037701 98893595 98712397 98644876 98788506
1831.6 98788506 98996425 99103481 99142420 99202466 99246359 99184024 99085391 99079436 99144256 99186146 99157739
1854 99157739 99121797 99136901 99155617 99106824 99016273 98946971 98907799 98863930 98803174 98769200 98799109 98838836
1878.5 98838836 98808467 98731637 98682296 98655844 98578614 98452908 98352557 98277223 98149139 97891504 97485733
1900.9 97485733 96914876 96079040 95037782 94447261 94984782 96209729 97174561 97545093 97503692 97340101
1921.3 97340101 97291517 97474974 97783232 98054600 98216355 98241627 98150265 98050737 98060465 98184496 98347449
1943.8I8347449J60045J63078J36298M7851l7730n2285k7466m1026r6327j32960j29694
1966.2I8337233j27369j82998k77168l02523j80924K3389J54864J64331J17814K9790
1986.6I7756439q7612j37866n2941Q1796J43647J47027J55824J77604J63931R1988
2007I8439837J8590o020r960m4507r7835j10173p4482n2643n2559j3864L8177L7598
2031.5I8072159o008m5383m2051j4621k3800p8845j21468j23042j29760j79559k10821
2053.9I7096801j20384Q3208K63852L17800K79361K31719J86289J14006M2092J6380
2074.3I8511124K1219Q529l1268n3829k9099O681J5051J4621K9415M3869K8330n997
2098.8I8558646j4531Q517J9062n287l1841k3430P867J5772m345o599K4349M0781J2303
$$ plain form
1943.8 98347449 98507494 98670572 98806870 98854721 98816991 98764706 98737240 98696214 98599887 98466927 98337233
1966.2 98337233 98209864 98026866 97749698 97447175 97266251 97289640 97444504 97608835 97726649 97756439
1986.6 97756439 97668827 97530961 97478020 97559816 97703463 97850490 98006314 98183918 98347849 98439837
2007 98439837 98458427 98452407 98442447 98397940 98300105 98189932 98115450 98062807 98010248 97996384 98034561 98072159
2031.5 98072159 98066151 98020768 97978717 97964096 97940296 97861451 97739983 97616941 97487181 97307622 97096801
2053.9 97096801 96976417 97059625 97323477 97641277 97920638 98152357 98338646 98452652 98494744 98511124
2074.3 98511124 98532343 98540872 98509604 98455775 98426676 98433357 98448408 98463029 98492444 98536313 98564643 98558646
2098.8 98558646 98544115 98552632 98571694 98566407 98534566 98511136 98519003 98534775 98530430 98523831 98548180 98588961 98601264
2125.3I8601264k1702j8537Q82q518l8218m0114n174J3113j8394n9509o4403m5019
2149.8I8295671k4867n01K3210K9641R907k2751k7740J0115M3231L2002p04p742J3375
2176.3I8372847J1325l0017n4854k7675O104j258k5153j7387Q917k527n9146r3776
2200.8I8087400n8651l540O526p909R876M6206M0936m434k1076J2934L4326R465j5831
2227.3I8136228j049K3896O300l9798n1940k4676j6141m6372o4999l2675J1277L648
2251.8I7903699m2051n7477l6889l6949p4780j01209p0792p695L0362K5892J1981P671
2276.2I7551763j4037n7387p2855l7694q619l6424p1579l9691K7126L9369n609k9516
2300.7I7244847O997N3198M1461q780k3812p636k5314p7724r3806l9124P748l1090
$$ plain form
2125.3 98601264 98579562 98561025 98561907 98553389 98515171 98475057 98469883 98482996 98464602 98405093 98340690 98295671
2149.8 98295671 98270804 98270303 98293513 98323154 98333061 98310310 98282570 98292685 98335916 98367918 98367214 98359472 98372847
2176.3 98372847 98384172 98354155 98299301 98271626 98277730 98276472 98251319 98233932 98242849 98240322 98181176 98087400
2200.8 98087400 98028749 98025209 98031735 98023826 98033702 98079908 98120844 98116410 98095334 98108268 98142594 98152059 98136228
2227.3 98136228 98135179 98159075 98165375 98125577 98073637 98048961 98032820 97986448 97921449 97888774 97900051 97903699
2251.8 97903699 97861648 97804171 97767282 97730333 97655553 97554344 97483552 97475857 97506219 97532111 97544092 97551763
2276.2 97551763 97537726 97480339 97407484 97369790 97361171 97324747 97253168 97213477 97240603 97279972 97274363 97244847
2300.7 97244847 97251844 97305042 97346503 97337723 97313911 97306275 97280961 97203237 97109431 97070307 97078055 97046965
2325.2I7046965r9909r8431k3603K5945O211j2255J0849J7780k9970n4586J0670P9000
2349.7I6878666Q4150L7282l689r084j8621m3731m8334k1356j1862m8840q0281n5724
2374.1I6658576r418m023l4583m5288k3156j4108m2147o6262m6188j7202l2282o8778
2398.6I6255141o7067l0642k0385n3823p9334o0475l3837m7046q0026p2860k2656N627
2423.1I5692617j0765j9127R763K9135k885n0771n7000l1203k9308n8627o7204l7271
2447.6I5367354j8275m3565p9399p7939n5772o2293q8978q8215n7685m5681o6745o9684
2472I4613123k3294K7419L0219Q88m029K4766M0686K0408j531Q839K5344P689k3300
2498.5I4747227k4038n692r877l7497m4495j2881J0610j1861m6885m5938k3174k4032
$$ plain form
2325.2 97046965 96947056 96848625 96825022 96850967 96857178 96844923 96855772 96873552 96843582 96788996 96799666 96878666
2349.7 96878666 96962816 97000098 96996409 96987325 96968704 96924973 96876639 96855283 96843421 96794581 96714300 96658576
2374.1 96658576 96649158 96645135 96610552 96565264 96542108 96528000 96485853 96419591 96373403 96356201 96323919 96255141
2398.6 96255141 96188074 96157432 96137047 96083224 96003890 95943415 95909578 95862532 95782506 95709646 95686990 95692617
2423.1 95692617 95681852 95662725 95672488 95701623 95698738 95647967 95590967 95559764 95530456 95471829 95404625 95367354
2447.6 95367354 95349079 95305514 95226115 95148176 95092404 95030111 94941133 94852918 94795233 94749552 94682807 94613123
2472 94613123 94589829 94617248 94647467 94648355 94644326 94669092 94709778 94730186 94728655 94737494 94762838 94770527 94747227
2498.5 94747227 94723189 94717497 94707620 94670123 94625628 94612747 94623357 94611496 94564611 94518673 94495499 94471467
2523I4471467m3017l9172j3423m387k2870l4911r084L0685L3963P826Q094M7326P6157
2549.5I4508654O3813M5800O3109R3287Q9545N5962L7206M3225L2848n782k5254o241
2574I4996172P022j5593m6009m4310j4067P010N972O730K7007M6926L7647J7410K5147
2600.5I5057064M9252M5055Q565j2678J0121M2254M0269K3406M2385Q4549Q6981M5604
2625I5522827J6618K3669L4696K1839K366p99J151j240N543K9653N7966N9915K9510
2651.5I5803714N966J5593L3599K3836j848n340J5616K9045J7792L779Q488J9610J4019
2678I5983869k837k772J7118K6584J1152L64J2851K3502J7565J2154J9300K7787J9390
2704.5I6166027l219j8889j8698j3655j8031k4408q797K0742K8885J3810m298r781
$$ plain form
2523 94471467 94428450 94389278 94375855 94371468 94348598 94313687 94304603 94335288 94369251 94377077 94385171 94432497 94508654
2549.5 94508654 94572467 94618267 94681376 94774663 94864208 94920170 94957376 95000601 95033449 95027667 95002413 94996172
2574 94996172 95003194 94987601 94941592 94897282 94883215 94890225 94896197 94902927 94929934 94976860 95014507 95031917 95057064
2600.5 95057064 95106316 95151371 95159936 95147258 95157379 95199633 95239902 95263308 95305693 95390242 95477223 95522827
2625 95522827 95539445 95563114 95597810 95619649 95622015 95621216 95622367 95621127 95626670 95656323 95714289 95774204 95803714
2651.5 95803714 95809680 95825273 95858872 95882708 95880860 95875520 95891136 95920181 95937973 95941752 95950240 95969850 95983869
2678 95983869 95981032 95978260 95995378 96021962 96033114 96033478 96046329 96069831 96087396 96099550 96118850 96146637 96166027
2704.5 96166027 96162808 96143919 96125221 96111566 96093535 96069127 96060330 96081072 96109957 96123767 96119469 96109688
2729I6109688l797o759n930J3911K7025J9121K927k843L803L290j0795j5580P712L4720
2757.6I6176493K6280r155k9630k4491j2017L916K4796L7467K9511R173o128j0424
2782I6215791m989J692j585j3977j6970q273j3989m0412n9837n7262n2208n7083o4362
2808.6I5826536p3003r0272j22416j64580j93393j89263j85263k57200m46099p63303
2828.9I3341744j239765j738655j603127k07841J641965K367597J818872J007289M87023
2847.3I5875102K18249P7402Q554j0247r00J753k2656m5508m8339n7078q1044j01066
2871.8I5814222j06174j04320j11061j33091j64420j99949k48701l10308l50010l20834
2892.2I3765354k51108k69437m06158n03159m58544l80117l53449k08199J47277M37373
$$ plain form
2729 96109688 96105891 96099132 96093202 96107113 96134138 96153259 96156186 96153343 96157146 96160436 96149641 96134061 96141773 96176493
2757.6 96176493 96202773 96193618 96163988 96139497 96127480 96131396 96156192 96193659 96223170 96232343 96226215 96215791
2782 96215791 96210802 96212494 96210909 96196932 96179962 96171689 96157700 96117288 96057451 96000189 95947981 95890898 95826536
2808.6 95826536 95753533 95663261 95540845 95376265 95182872 94993609 94808346 94551146 94105047 93341744
2828.9 93341744 92101979 90363324 88760197 88552356 90194321 92561918 94380790 95388079 95875102
2847.3 95875102 96093351 96170753 96179307 96169060 96168160 96169913 96147257 96101749 96053410 95996332 95915288 95814222
2871.8 95814222 95708048 95603728 95492667 95359576 95195156 94995207 94746506 94436198 94086188 93765354
2892.2 93765354 93514246 93244809 92838651 92335492 91876948 91496831 91143382 90935183 91082460 91519833
2912.6I1519833N13017N42062N50646M26525K01779l9899k84272n41568q19719j038009
2933I1030395r32264k76506O42085J150298R73213M15021j91474p71612j353931j765609
2953.4H8919616j526398m44716Q78125J680172J758498J367992Q76993N45841M08376
2971.7I4464499L27641K05421P6723n501m3202n9873p8433j26488k15679l37201n03612
2994.2I3704295p65127j152557j427346r44925N12719J828993J842654R88662K95859
3012.5I4883227L3641k3168m9865r9391j87707k77430k48200o1041J19710J15329p1239
3034.9I4133866k75833l03751r7036K11882M25792M11111J79446j32364l81243m76051
3055.3I3695819m40901m20410m84699m64457j90878R3645J02151J86699P52133J310993
$$ plain form
2912.6 91519833 92032850 92574912 93125558 93552083 93753862 93713963 93429691 92888123 92068404 91030395
2933 91030395 90098131 89821625 90463710 91614008 92587221 93002242 92810768 92039156 90685225 88919616
2953.4 88919616 87393218 86948502 87826627 89506799 91265297 92633289 93510282 94056123 94464499
2971.7 94464499 94792140 94997561 95074284 95068783 95025581 94965708 94887275 94760787 94545108 94207907 93704295
2994.2 93704295 92939168 91786611 90359265 89414340 89927059 91756052 93598706 94587368 94883227
3012.5 94883227 94916868 94893700 94843835 94744444 94556737 94279307 94031107 93970066 94089776 94205105 94133866
3034.9 94133866 93858033 93554282 93457246 93669128 94094920 94506031 94685477 94553113 94171870 93695819
3055.3 93695819 93254918 92834508 92349809 91885352 91694474 91788119 91890270 92076969 92829102 94140095
3075.7I4140095J220893P03401K84892Q0156m6378j81782l31408m05252k28357J29264
3096.1I5365524K85381R8080j82402l03668j75536J30791L89576M33641L15321J68747
3116.5I6525455O2668o020n4068p3868n6231j8263Q345J7405K2578K8986K0754j6689
3141I6461052n3555n7173l4934n239J0389k551k6197l7938m1860n0557n7644m8542
3165.5I6055251l1554k0737j5169o575O855Q559j2022l4064l7432l6293m2868m5025
3189.9I5788926l9524l8981n0247o5494o9451n9372n0879n2291n7042n5271n0372n4675
3214.4I5145327o2895o4784n9223n6261o7985q1897q5259q6879r7680j14632j16724
3236.9I4251108r5218o5512l9881k2870k8539n8896q0359p4553o1864o1685o4462n4771
$$ plain form
3075.7 94140095 95360988 96064389 96349281 96429437 96383059 96201277 95869869 95464617 95236260 95365524
3096.1 95365524 95650905 95748985 95566583 95262915 95087379 95218170 95607746 96041387 96356708 96525455
3116.5 96525455 96588123 96582103 96528035 96454167 96397936 96379673 96388018 96405423 96428001 96456987 96477741 96461052
3141 96461052 96407497 96350324 96315390 96310151 96320540 96317989 96291792 96253854 96211994 96161437 96103793 96055251
3165.5 96055251 96023697 96002960 95987791 95981216 95988071 95996630 95984608 95950544 95913112 95876819 95833951 95788926
3189.9 95788926 95749402 95710421 95660174 95594680 95525229 95465857 95414978 95362687 95305645 95250374 95200002 95145327
3214.4 95145327 95082432 95017648 94958425 94902164 94834179 94752282 94667023 94580144 94482464 94367832 94251108
3236.9 94251108 94155890 94090378 94050497 94027627 93999088 93940192 93859833 93785280 93723416 93661731 93597269 93542498
3261.3I3542498l7181k1541j2672j9229m7111p3165q3929q6927p9501o8969o5911p2175
3285.8I2874187p8898p4441p7521j10138j54853j92410k24036k62391l16692l44800
3306.2I1038007k60187n6916J29473J85251J36519O4540j127o3568j08403j29318j40548
3328.6I0793723j57333j75237j79768j76531j82414j97226k07948k07401j97571j96505
3349H8915789k17289k36588k36738k30670k33620k47378k47693k26372k16949k35647
3369.4H6586845k58356k51913k24436k11656k11030k06876k00546j89596j61332j27929
3389.8H4543175j36287j74319j68747j16962r7144j44607j83695j51950j00017q2397
3410.2H3187050r2447j14536j21516j00363q8542q5569n3543p122J1062o437q840J3817
$$ plain form
3261.3 93542498 93505317 93483776 93471104 93451875 93404764 93331599 93247670 93160743 93081242 93012273 92946362 92874187
3285.8 92874187 92795289 92720848 92643327 92533189 92378336 92185926 91961890 91699499 91382807 91038007
3306.2 91038007 90777820 90720904 90850377 91035628 91172147 91236687 91235560 91171992 91063589 90934271 90793723
3328.6 90793723 90636390 90461153 90281385 90104854 89922440 89725214 89517266 89309865 89112294 88915789
3349 88915789 88698500 88461912 88225174 87994504 87760884 87513506 87265813 87039441 86822492 86586845
3369.4 86586845 86328489 86076576 85852140 85640484 85429454 85222578 85022032 84832436 84671104 84543175
3389.8 84543175 84406888 84232569 84063822 83946860 83849716 83705109 83521414 83369464 83269447 83187050
3410.2 83187050 83094603 82980067 82858551 82758188 82669646 82584077 82530534 82523412 82534474 82528037 82519197 82533014
3434.7H2533014l40l9262l3152J3858N4265O8718O4379N9861O7126Q1605J00166J14095
3459.2H3084333J06049J14876J57260J62632J10489O6680P7045J16956J51503J46347
3479.6H4294170J10036J13154J40744J31774J20932J35815J42974J43027J47504J54650
3500H5634780J56557J38700J20521J28216J57374J84011J74725J50925J58394J78599
3520.4H7182802J80554J55819J30927J42557J71411J90329K02513J96552J77986J80632
3540.8H8912082J87665J66786J40822J48654J65301J77604J94919J95658J84375J75262
3561.1I0649128J47259J05697J42765K43199K55626K16872K02167K03669K20388K44177
3581.5I2630947K31170J70446J54960K38329K63774K17212K07817K36994K36982K14339
$$ plain form
3434.7 82533014 82532674 82493412 82460260 82474118 82528383 82597101 82661480 82721341 82788467 82870072 82970238 83084333
3459.2 83084333 83190382 83305258 83462518 83625150 83735639 83802319 83879364 83996320 84147823 84294170
3479.6 84294170 84404206 84517360 84658104 84789878 84910810 85046625 85189599 85332626 85480130 85634780
3500 85634780 85791337 85930037 86050558 86178774 86336148 86520159 86694884 86845809 87004203 87182802
3520.4 87182802 87363356 87519175 87650102 87792659 87964070 88154399 88356912 88553464 88731450 88912082
3540.8 88912082 89099747 89266533 89407355 89556009 89721310 89898914 90093833 90289491 90473866 90649128
3561.1 90649128 90796387 90902084 91044849 91288048 91543674 91760546 91962713 92166382 92386770 92630947
3581.5 92630947 92862117 93032563 93187523 93425852 93689626 93906838 94114655 94351649 94588631 94802970
3601.9I4802970J92898J65880J65909J91999J90657J89960J90372J74075J99348K24983
3622.3I6689051J93262J18065O4701J42724J91706J57988J28108J02169Q9830J00326
3642.7I7977930Q5271J3184k5236Q1175J53119J17057J11318J41114J08778O0112M0376
3665.2I8864198o843p1937k1231J0115o0004K4188J35785J28645R6774O0129J228l5060
3689.6I9125987L1966R6411Q9168O3902L5447L839J4591K7984j0377p1352m7911P2831
3714.1I9432486J06407M5824j9128l5339m405M2570O6715K7329m1854n4896K1571Q3267
3738.6I9670547N0688n4425j02019m53p022o5970M5991J14471M4143j4431K1720L8797
3763.1I9742037r298l2425j7417K7365N6749L4577K778j1772j449p093j0007K7084
$$ plain form
3601.9 94802970 94995868 95161748 95327657 95519656 95710313 95900273 96090645 96264720 96464068 96689051
3622.3 96689051 96882313 97000378 97065079 97207803 97399509 97557497 97685605 97787774 97877604 97977930
3642.7 97977930 98063201 98076385 98051149 98132324 98285443 98402500 98513818 98654932 98763710 98823822 98864198
3665.2 98864198 98857355 98785418 98764187 98774302 98714298 98738486 98874271 99002916 99099690 99159819 99161047 99125987
3689.6 99125987 99157953 99254364 99343532 99407434 99442881 99446720 99461311 99489295 99478918 99407566 99359655 99432486
3714.1 99432486 99538893 99584717 99565589 99530250 99525845 99568415 99635130 99662459 99620605 99565709 99587280 99670547
3738.6 99670547 99721235 99666810 99564791 99564338 99557316 99491346 99537337 99651808 99695951 99681520 99703240 99742037
3763.1 99742037 99732739 99700314 99682897 99710262 99767011 99801588 99804366 99792594 99791145 99784052 99774045 99801129
3787.5I9801129M2915K0767j5533m9836m4030n5289o4248J9574L8380K5940O1071N1188
3812I9832028j9055o3998k7627n1140m2427N4783O2412L4487J2392P456J6022m8339
3836.5I9766994j04547j8233O5946P8184O2627J9657p7897k02924q5515J10573R5176
3858.9I9710041J1897n3578m3011l570j6207O664M7368N8675N7852Q351L498L4458
3883.4I9822438J0055K1619J2916m1384j1414L5215K414n3281o4969k1529N0330P7039
3907.9I9839449M2301J1403J895j3912j4972J1652J8484M494J1367Q821k0957j2797
3932.3I9887228L2628L6770N841j8704j9616N603R096l064J6594L2866J4758p617j1260
3958.9I9981123q750j2707j8633j5259K426J9157J8752J0377O503L791J573m357j3667
$$ plain form
3787.5 99801129 99844044 99864811 99849278 99799442 99755412 99700123 99635875 99655449 99693829 99719769 99780840 99832028
3812 99832028 99812973 99748975 99721348 99670208 99627781 99682564 99744976 99779463 99791855 99799311 99815333 99766994
3836.5 99766994 99662447 99644214 99710160 99788344 99850971 99870628 99792731 99589807 99504292 99614865 99710041
3858.9 99710041 99721938 99668360 99625349 99621779 99605572 99612236 99659604 99718279 99776131 99784482 99787980 99822438
3883.4 99822438 99832493 99854112 99867028 99825644 99814230 99849445 99851859 99798578 99733609 99712080 99762410 99839449
3907.9 99839449 99881750 99893153 99895048 99881136 99866164 99877816 99896300 99900794 99912161 99920982 99900025 99887228
3932.3 99887228 99919856 99956626 99962467 99943763 99924147 99929750 99938846 99935782 99952376 99985242 100000000 99992383 99981123
3958.9 99981123 99972373 99959666 99941033 99925774 99928200 99947357 99966109 99976486 99982989 99986780 99988353 99983996 99970329
3985.4I9970329j5605j5372k2071k7687j3131J3763
3997.6I9890226
$$ plain form
3985.4 99970329 99954724 99939352 99917281 99889594 99876463 99890226
3997.6 99890226
##END=$$ End of the data block
