##TITLE=Doigo-04 $$ Begin of the data block
##JCAMP-DX=5.00 $$ ACD/SpecManager v 10.08
##SPECTROMETER/DATA SYSTEM=Alpha
##DATE=24 Sep 2014 08:19:16
##DATA TYPE=INFRARED SPECTRUM
##DATA CLASS=XYDATA
##ORIGIN=
##OWNER=
##NPOINTS=1765
##FIRSTX=399.76428223
##LASTX=3997.64306641
##MAXX=3997.64306641
##MINX=399.76428223
##MAXY=0.87699807
##MINY=0.12923159
##XFACTOR=1.0000000000
##YFACTOR=1.000000000000000e-9
##FIRSTY=0.74728376
##DELTAX=2.03961372
##XUNITS=1/CM
##YUNITS=ARBITRARY UNITS
##XYDATA=(X++(Y..Y))
399.8G47283757j655102M041195O372452L185033j005113j447975J112401K491176
$$ 747283757 745628655 749669850 756042302 759227335 758222222 756774247 757886648 760377824
416.1G60377824j98722m443824l503620K22444J219332j757145m916906m138887k06172
$$ 760377824 760179102 755735278 752231658 752454102 753673434 751916289 746999383 742860496 742654324
434.4G42654324J734018r36806m247487l642022j8955J406968j448870m637420l931582
$$ 742654324 744388342 743451536 739204049 735562027 735543072 736950040 735501170 730863750 726932168
452.8G26932168k51174J563609j340509m958868m560172j191020Q83400j086831m866600
$$ 726932168 726680994 728244603 726904094 721945226 717385054 716194034 717077434 715990603 711124003
471.2G11124003n679250k328932J68145j862109n766809o694853l888667j600087l778875
$$ 711124003 705444753 703115821 703283966 701421857 695655048 688960195 685071528 683471441 679692566
489.5F79692566q937776j2197971j2374401j4268518k1605908k8953493k0451129O939769
$$ 679692566 670754790 658556819 646182418 631913900 610307992 581354499 560903370 567843139
505.8E67843139K8357625K2759140M325509j897454M227340R061634P357180K000809
$$ 567843139 596200764 618959904 623285413 621387959 625615299 634676933 642034113 644034922
522.1F44034922k315163k437771N29468J925826n99026m067243m206299r36449J538634
$$ 644034922 641719759 639281988 639811456 641737282 641138256 637071013 632864714 631928265 633466899
540.5F33466899J42038l355324m389107j559317J503050R78470k410650m223168j954735
$$ 633466899 633608937 630253613 625864506 624305189 625808239 626786709 624376059 620152891 618198156
558.9F18198156J656294J958668j183569l589809k256691J151025K447009Q7500k872765
$$ 618198156 619854450 621813118 620629549 617039740 614783049 615934074 618381083 618468583 615595818
577.2F15595818k481282O59168K551496P78377k276063k603174J30475K315044J131833
$$ 615595818 613114536 613773704 616325200 617103577 614827514 612224340 612354815 614669859 615801692
595.6F15801692k110898l656626j961172M5300j074016n052984q222044q349776o078720
$$ 615801692 613690794 610034168 608072996 608118296 607044280 601991296 593769252 585419476 579340756
613.9E79340756r81331J2487590L3800066M5443058L5334945J4803886n21183p580399
$$ 579340756 578359425 590847015 624647081 670090139 705425084 720228970 719707787 712127388
630.2G12127388q446992o822050j0541319j7423451o833077J6111493K1216452J1792362
$$ 712127388 703680396 696858346 686317027 668893576 662060499 678171992 699388444 711180806
646.6G11180806N094350J177728p22409Q09551L588736L869474J290857r90927j107037
$$ 711180806 716275156 717452884 716730475 717540026 721128762 724998236 726289093 725298166 724191129
664.9G24191129M91977L357470K557933l46005q83758J097560K443493J019001j527071
$$ 724191129 724683106 728040576 730598509 730252504 729368746 730466306 732909799 733928800 732401729
683.3G32401729k477110j726985k118289o397128j4628113k7187943m3513119m4848800
$$ 732401729 729924619 728197634 726079345 719682217 705054104 677866161 634353042 589504242
699.6E89504242q237183M2568266N9871197M2309344K1640599J0981619N628645K434075
$$ 589504242 581267059 623835325 683706522 726015866 747656465 758638084 764266729 766700804
715.9G66700804J430750K039552K432942J496911J57416j91152N01692J011432N26547
$$ 766700804 768131554 770171106 772604048 774100959 774258375 774067223 774568915 775580347 776106894
734.3G76106894m00066p79808m21822j10328n43833j389205j914323k110719k686620
$$ 776106894 775706828 774927020 774505198 774394870 773851037 772461832 770547509 768436790 765750170
752.6G65750170m240692o897867j0285198j3239384j7535150l0314744n5775642q4564269
$$ 765750170 761509478 754611611 744326413 731087029 713551879 683237135 627461493 542897224
768.9E42897224q9025914m2354435L9112210R7183377R7582877O4733505L5358369
$$ 542897224 453871310 411516875 450629085 547812462 645395339 710128844 745487213
783.2G45487213J8611729R741843N524695M077792L288031J870095K31863m22061J30177
$$ 745487213 764098942 773840785 779365480 783443272 786731303 788601398 788833261 788411200 788541377
801.6G88541377N63919k59042j922547k983153k716661j098573J141727K132535Q18968
$$ 788541377 789105296 788846254 786923707 783940554 781223893 780125320 781267047 783399582 784218550
819.9G84218550r85742j759469k987564o158888r321392q921266o960034j0624230
$$ 784218550 783232808 781473339 778485775 772326887 763005495 754084229 747124195 736499965
836.2G36499965k4151563m6188355o5884054o1768114k9438436J5711307N9507728
$$ 736499965 712348402 666160047 600275993 538507879 509069443 524780750 584288478
850.5E84288478P6111376N6332588K9512048J4826715Q421481M960418K691447J455605
$$ 584288478 660399854 716732442 746244490 761071205 769492686 774453104 777144551 778600156
866.8G78600156J33336k427518n247891o706417p114828p109821m932880Q60989P827044
$$ 778600156 778733492 776305974 771058083 764351666 757236838 750127017 745194137 746055126 753882170
885.2G53882170J2112677J1320591O367743J031935j583397r34244Q70228J106918
$$ 753882170 765994847 777315438 783683181 784715116 783131719 782197475 783067703 784174621
901.5G84174621p55012k523124k115548j58071Q32915m35710k349317k534211p98404
$$ 784174621 783419609 780896485 778780937 778622866 779455781 779020071 776670754 774136543 773338139
919.9G73338139O93739J06096j830995k661169j284778O18815P45655r72629k345502
$$ 773338139 774031878 774137974 772306979 769645810 768361032 768979847 769725502 768752873 766407371
938.2G66407371j701236N8114N83172r79543k954959l321469k249956j224697q53121
$$ 766407371 764706135 764764249 765347421 764367878 761412919 758091450 755841494 754616797 753763676
956.6G53763676j402438k829850l789365k038836J874744K998174N26249q53419k31624
$$ 753763676 752361238 749531388 745742023 743703187 745577931 748576105 749102354 748248935 748017311
974.9G48017311j99079j648486l129304l054797j773656j057982j948357l529608m117072
$$ 748017311 747818232 746169746 743040442 739985645 738211989 737154007 735205650 731676042 727558970
993.3G27558970l384232k709389l344953m981637o146133o237626p044136j0149360
$$ 727558970 724174738 721465349 718120396 713138759 706992626 700755000 693710864 683561504
1009.6F83561504j3380468j4518321j5495121j8419802k2973120k7078033k4841070
$$ 683561504 670181036 655662715 640167594 621747792 598774672 571696639 546855569
1023.9E46855569p626712K3307144M8528552N0348461L4233391J7049968O955684K570033
$$ 546855569 539228857 562536001 611064553 661413014 695646405 712696373 719652057 722222090
1040.2G22222090L59833j522899k973616l442466l193438l191829m048645n312145
$$ 722222090 722581923 721059024 718085408 714642942 711449504 708257675 704209030 698896885
1056.5F98896885o138027o422996o847620q021653r775817j1313200j1933029j1480093
$$ 698896885 692758858 686335862 679488242 671466589 661690772 650377572 638444543 626964450
1072.8F26964450j0170877q181632n514800k314627P89821K789020K936423J422465
$$ 626964450 616793573 608611941 603097141 600782514 601572335 604361355 607297778 608720243
1089.2F08720243r21786l565788o740391j0957420j6291380k2590399l0203462l8914471
$$ 608720243 607798457 604232669 597492278 586534858 570243478 547653079 517449617 478535146
1105.5D78535146m2449326k7583420N884409L2322585K9756666M986494k2549659l9000242
$$ 478535146 436085820 408502400 414386809 446709394 476466060 481452554 458902895 419902653
1121.8D19902653l6289841j1968196K2937924M6734601M9564451M1436821L3428669
$$ 419902653 383612812 371644616 394582540 441317141 490881592 532318413 565747082
1136.1E65747082K6806712J9910038J2945473O692469J450420k878666o758154j0833680
$$ 565747082 592553794 612463832 625409305 632101774 633552194 630673528 623915374 613081694
1152.4F13081694j4902950j7130911j6447842j6497612k3419500l9220273n9415847
$$ 613081694 598178744 581047833 564599991 548102379 524682879 485462606 426046759
1166.7D26046759p3688418o7182898k8340131L7501186J01236820J27697289J09479547
$$ 426046759 352358341 285175443 256835312 294336498 395573318 523270607 632750154
1180.9F32750154P0868015L7313521J6372800M633128j927972n302012o461799o333708
$$ 632750154 703618169 740931690 757304490 761937618 760009646 754707634 748245835 741912127
1197.3G41912127n682111m703403l358185k051830j688123k685070m215360m927933
$$ 741912127 736230016 731526613 728168428 726116598 724428475 721743405 717528045 712600112
1213.6G12600112m480302l952086m606724o553710q967280j1045814j2683808j4426649
$$ 712600112 708119810 704167724 699561000 693007290 684040010 672994196 660310388 645883739
1229.9F45883739j6635954j8645883j8293023j3350964n311191K36869q8334m351318
$$ 645883739 629247785 610601902 592308879 578957915 573646724 573883593 573795259 569443941
1246.2E69443941r370744j3985813j8327534k2478640k6022732k8354407k9204607
$$ 569443941 560073197 546087384 527759850 505281210 479258478 450904071 421699464
1260.5D21699464k8897881k9000133l1131119l5444587m0168196m1787893l7397161
$$ 421699464 392801583 363801450 332670331 297225744 257057548 215269655 177872494
1274.8A77872494k7748600j6166717m725590O010428J4911488K3791760L8947523O0306981
$$ 177872494 150123894 133957177 129231587 135242015 150153503 173945263 212892786 273199767
1291.1B73199767P5195074P0655882M9116761K0990521p026554k6109218l3030957
$$ 273199767 348394841 419050723 468167484 489158005 482131451 456022233 422991276
1305.4D22991276m4730365n9340925l3218681L4105301P9872667Q0217451O2757611
$$ 422991276 378260911 318919986 285701305 319806606 399679273 479896724 542654335
1319.6E42654335M7679008L8797259L3626258K8971911K3338914J6487360R240031
$$ 542654335 590333343 629130602 662756860 691728771 715067685 731555045 740795076
1333.9G40795076L007412j430333k832174K23160N767286R451985R378314O806731
$$ 740795076 743802488 742372155 739539981 739763141 745530427 754982412 764360726 771167457
1350.2G71167457K810180l065705j2023628k5444627m7037124p5890303q6000681n6299448
$$ 771167457 773977637 770911932 758888304 733443677 686406553 610516250 524515569 468216121
1366.6D68216121n245924L6731333N3961962N4320991M4808030L1663299K0205677
$$ 468216121 462970197 499701530 553663492 607984483 652792513 684455812 704661489
1380.8G04661489J2006640N500734l191054j2314558j2344837N90503J8446088K4380386
$$ 704661489 716668129 722168863 718977809 706663251 694318414 694908917 713355005 737735391
1397.1G37735391J7978847R980857N380154L695428K480209J478136R39369Q38101
$$ 737735391 755714238 765695095 771075249 774770677 777250886 778729022 779668391 780506492
1413.5G80506492J017153O32584j351237l339887m491210n734086p479727j1374235
$$ 780506492 781523645 782156229 780804992 777465105 772973895 767239809 759760082 748385847
1429.8G48385847j6444385k1579564l5266161n2613974m6559393j7139614K1463454
$$ 748385847 731941462 710361898 675095737 622481763 575922370 558782756 580246210
1444.1E80246210M1213155L0039370J3912022J5920162K1914542J8519282P427693
$$ 580246210 621459365 651498735 665410757 681330919 703245461 721764743 729192436
1458.3G29192436n40614l031671o654680j1427760j5467525k5937259m3599784k9225171
$$ 729192436 728651822 725620151 718965471 707537711 692070186 666132927 622533143 593307972
1474.7E93307972K4642825N7970047M7839761K1020889L462196l470421p127106r377122
$$ 593307972 617950797 675920844 723760605 744781494 748243690 744773269 737646163 728269041
1491G28269041r045482r546995j3498962j7604888j9320845k0621538k9842020n0401389
$$ 728269041 719223559 709676564 696177602 678572714 659251869 638630331 608788311 558386922
1507.3E58386922n6239545n7129503n1271677o083727O4730734J07249945J10426963
$$ 558386922 502147377 445017874 393746197 387662470 452393204 559643149 670070112
1521.6F70070112P3844790L1240404R165883k046824p273852j0506154r668588p417321
$$ 670070112 743914902 775155306 784321189 782274365 775000513 764494359 754825771 747408450
1537.9G47408450r352029j1917174j0554075q697152o288111m716933m599512n487263
$$ 747408450 738056421 726139247 715585172 706888020 700599909 695882976 691283464 685796201
1554.2F85796201o504774j1095166j7728329j5743077j6738891k0847619k6991188
$$ 685796201 679291427 668196261 650467932 634724855 617985964 597138345 570147157
1568.5E70147157l7251175l4553170p168353K9052914K0515322j4442503l3726305
$$ 570147157 532895982 498342812 491174459 520227373 540742695 526300192 492573887
1582.8D92573887m0616363m3645233m4929415m3318957l8047016k9539227j7791719
$$ 492573887 451957524 408312291 363382876 320063919 282016903 252477676 234685957
1597B34685957l901735J0781751K6027381M1280478N4614932O1336815N5802554L9760172
$$ 234685957 230784222 241565973 267593354 308873832 363488764 424825579 480628133 520388305
1613.4E20388305K0217896j597226j6178966k1288037k5145203k6182204k7784705
$$ 520388305 540606201 539008975 522830009 501541972 476396769 450214565 422429860
1627.6D22429860k9666484k5007039j5761346q8393K1060049L5954982M4772804M7052592
$$ 422429860 392763376 367756337 351994991 351906598 372966647 408921629 453694433 500747025
1643.9E00747025M9400389M6512306L3615708L0306220K6417017P050276l742456r695411
$$ 500747025 550147414 596659720 630275428 660581648 686998665 694048941 690306485 680611074
1660.3F80611074j9016385k8260231l2484532m1317284n3824484n6679666o5412462
$$ 680611074 661594689 633334458 600849926 559532642 505708158 449028492 383616030
1674.5C83616030p2301507n5795491l5560935j9690812m943356R683028K2904277L4780711
$$ 383616030 311314523 255519032 219958097 200267285 195323929 205006957 227911234 262691945
1690.9B62691945L9164185M3620348M5778483M1989834M2931258L4032375K7805746
$$ 262691945 301856130 345476478 391254961 433244795 476176053 510208428 538014174
1705.1E38014174K7681589K4414718K1815896K0413577J9727707J9719541J6755462
$$ 538014174 565695763 590110481 611926377 632339954 652067661 671787202 688542664
1719.4F88542664J2840867J1867344J1392534J0303557R681761R276331R621262Q135677
$$ 688542664 701383531 713250875 724643409 734946966 744628727 753905058 763526320 771661997
1735.7G71661997N644679M848957L848910K858758L312350M733502O008327N788446
$$ 771661997 777306676 782155633 786004543 788863301 792175651 796909153 802917480 808705926
1752H08705926M328787L238559K535701K328157K409458K308309K615929L467143M260659
$$ 808705926 813034713 816273272 818808973 821137130 823546588 825854897 828470826 831937969 836198628
1770.4H36198628M292250K733230R77695J49369k86638l83318J34290J331567K730131
$$ 836198628 840490878 843224108 844201803 844351172 844064534 843681216 843815506 845147073 847877204
1788.8H47877204L854812M100322L164232K122343J221716O23643Q98123J564980J497805
$$ 847877204 851732016 855832338 858996570 861118913 862340629 862964272 863862395 865427375 866925180
1807.1H66925180N97954j31727J62006Q82268P89165j60515p85947l43859N82755J036822
$$ 866925180 867523134 867391407 867553413 868435681 869224846 869064331 868278384 867934525 868517280 869554102
1827.5H69554102N10395l82304m9174J295805J999557J484275O54220J36376K01046
$$ 869554102 870064497 869682193 869633019 870928824 872928381 874412656 875066876 875203252 875404298
1845.9H75404298O99759O58750j47879p07984k91645N71608P65682M5478o02245l15011
$$ 875404298 876104057 876762807 876614928 875906944 875615299 876186907 876952589 876998067 876395822 876080811
1866.3H76080811M11749M30703l22819j076162j203239n36143J31547j52409j169264
$$ 876080811 876492560 876923263 876600444 875524282 874321043 873784900 873916447 873764038 872594774
1884.6H72594774j724124j357019p80523p89404j574874k370119k136648j238346q67903
$$ 872594774 870870650 869513631 868733108 867943704 866368830 863998711 861862063 860623717 859755814
1903H59755814j551747k740681l612757m354537o255924q068562m782617L906548R652674
$$ 859755814 858204067 855463386 851850629 847496092 841240168 833171606 828388989 832295537 841948211
1921.3H41948211R038389N612254K570570R81807P38025J062989R34720Q4698p83622
$$ 841948211 850986600 856598854 859169424 860151231 860889256 861952245 862886965 862971663 862188041
1939.7H62188041q82089k21074L87848J71900n59628q19743k67923M10974L16203n39184
$$ 862188041 861305952 861084878 861472726 861644626 861084998 860265255 859997332 860408306 860724509 860185325
1960.1H60185325j202762r33468j18494K46524j69098p30872p88212m30167l88562
$$ 860185325 858982563 858049095 857930601 858177125 858008027 857277155 856488943 856058776 855670214
1978.5H55670214j108110k054513k244174j381934k22921L68476K43365J5498K32875
$$ 855670214 854562104 852507591 850263417 848881483 848658562 849027038 849270403 849285901 849518776
1996.8H49518776N89013M42207l19898j029968r98438l84807l3379m40002j190662
$$ 849518776 850107789 850549996 850230098 849200130 848201692 847816885 847783506 847343504 846152842
2015.2H46152842j377344m72605Q84592J374662N69523n23329q20875k63811M53651
$$ 846152842 844775498 844302893 845187485 846562147 847131670 846608341 845787466 845523655 845977306
2033.5H45977306P29144N84960N08547O85334P29978L65675j03414j83285J15693L68893
$$ 845977306 846706450 847291410 847799957 848485291 849215269 849580944 849477530 849294245 849409938 849778831
2053.9H49778831K47896j46926l92079k23696J03831J02043k77519o07669n21780j95741
$$ 849778831 850026727 849879801 849487722 849264026 849367857 849469900 849192381 848584712 848062932 847867191
2074.3H47867191q9467l25501n97536n90861l21448j01447j90079m68314o07312n02646
$$ 847867191 847777724 847452223 846854687 846263826 845942378 845840931 845650852 845182538 844575226 844072580
2094.7H44072580l43263l32892n07295o74605o80208o22273p06494r59039j174747
$$ 844072580 843729317 843396425 842889130 842214525 841534317 840912044 840205550 839246511 838071764
2113.1H38071764j218498j127362r97067q52585o90341n53369n42641p62105j143396
$$ 838071764 836853266 835725904 834728837 833876252 833185911 832632542 832089901 831327796 830184400
2131.4H30184400j309991q90314O854Q82685J334310J389265J294911J179993J005113
$$ 830184400 828874409 827984095 827990949 828873634 830207944 831597209 832892120 834072113 835077226
2149.8H35077226P24673M39465K93971K66611K01881O8307l2544m3213L6180J58548
$$ 835077226 835801899 836241364 836535335 836801946 837003827 837072134 837039590 836996377 837032557 837191105
2170.2H37191105J99437J47879J00553L6478j10507l03268m38690m39585l12984k13265
$$ 837191105 837390542 837538421 837638974 837675452 837564945 837261677 836822987 836383402 836070418 835857153
2190.6H35857153k95639m62473m85241l37362k52366l68357n67019o41346m46439j71184
$$ 835857153 835561514 835099041 834613800 834276438 834024072 833655715 833088696 832447350 832000911 831829727
2211H31829727q9228j12534m2737J47284L31819K96056k0564l62754m07219j01685
$$ 831829727 831740499 831627965 831585228 831732512 832064331 832360387 832339823 831977069 831569850 831468165
2231.4H31468165K10643J16527l27647o64472o66023n46098o00338p73787o87718j34588
$$ 831468165 831678808 831795335 831467688 830803216 830137193 829591095 828990757 828216970 827529252 827394664
2251.8H27394664N87225Q89540N64039L7372j44303Q3148K66493N3763l57270n15282
$$ 827394664 827981889 828871429 829435468 829472840 829328537 829411685 829678178 829731941 829374671 828859389
2272.2H28859389k25604J91868K11596j87516n24223m49359j33932o2525m42863r17792
$$ 828859389 828633785 828825653 829037249 828849733 828325510 827876151 827742219 827679694 827236831 826319039
2292.5H26319039r97722o55353l39806m35770p75635q93295o32525l35633l76106p11858
$$ 826319039 825321317 824665964 824326158 823890388 823114753 822221458 821588933 821253300 820877194 820165336
2312.9H20165336j024365j082480q66592m97341l09289m37140n14567k65420O0141
$$ 820165336 819140971 818058491 817191899 816694558 816385269 815948129 815433562 815168142 815228283
2331.3H15228283J7822l02195l27826O2823M09961N17011P49588Q40425J21713r97484
$$ 815228283 815246105 814943910 814616084 814678907 815088868 815605879 816355467 817195892 817317605 816320121
2351.7H16320121j823008k229452k250850j618147n93305J31846L35932M11450P38621
$$ 816320121 814497113 812267661 810016811 808398664 807805359 807937205 808273137 808684587 809423208
2370.1H09423208J193762J288295Q58605K81095m7683j05799j48892l66151o30379
$$ 809423208 810616970 811905265 812763870 813044965 812997282 812891483 812742591 812376440 811746061
2388.4H11746061o71506m42624k86877n51284j045465j207888p31170M5001M99070
$$ 811746061 811074555 810631931 810345054 809793770 808748305 807540417 806809247 806854248 807353318
2406.8H07353318M55200K70486L38435O79374R22382P97689N14567M46379O03020O71685
$$ 807353318 807808518 808079004 808417439 809096813 810019195 810816884 811331451 811777830 812380850 813052535
2427.2H13052535M23133o3777m06920l39568p7605n3585m00424p83265p60376l08752
$$ 813052535 813475668 813411891 813004971 812665403 812587798 812534213 812133789 811350524 810590148 810281396
2447.6H10281396J33872K12073J03832J65522L90172N07056L39330J2576j51515j5735
$$ 810281396 810415268 810627341 810731173 810896695 811286867 811793923 812133253 812145829 811994314 811978579
2467.9H11978579J62363L1709l61442o14643n10097k55346j98364m52042p66397p84576
$$ 811978579 812140942 812172651 811811209 811196566 810686469 810431123 810232759 809780717 809014320 808229744
2488.3H08229744m59313j42992j12950k00570j10209J49250K92361J16348k59101n00500
$$ 808229744 807770431 807627439 807514489 807313919 807203710 807352960 807645321 807761669 807502568 807002068
2508.7H07002068m45366l15905m10676p22110r31621q37743o63817n83947l80277M5180
$$ 807002068 806556702 806240797 805830121 805108011 804176390 803338647 802674830 802090883 801710606 801755786
2529.1H01755786L99888M19437P3374m76897q59678q13544n10692l47615m87983o23405
$$ 801755786 802155674 802575111 802648485 802171588 801311910 800498366 799987674 799640059 799152076 798528671
2549.5G98528671l27527L70800R72092J015902N84364K07126K16007L80159K61664
$$ 798528671 798201144 798571944 799544036 800559938 801144302 801351428 801567435 801947594 802209258
2567.9H02209258j99735o33657p24077o09160p07805j157522j601577j569450r31620
$$ 802209258 802009523 801375866 800651789 800042629 799334824 798177302 796575725 795006275 794074655
2586.2G94074655r4891L09825J80125L457P5698J41442j75417q02993j290381j285315
$$ 794074655 793979764 794289589 794469714 794473171 794548869 794690311 794514894 793711901 792421520 791136205
2606.6G91136205q80360n01812l81291l79383j50383N43296J322151J419484P31349
$$ 791136205 790255845 789754033 789372742 788993359 788842976 789386272 790708423 792127907 792859256
2625G92859256j4543l13580m58718r32455j660526k149760k067983j556814j108289
$$ 792859256 792844713 792531133 792072415 791139960 789479434 787329674 785261691 783704877 782596588
2643.4G82596588r91166r02652m09425L48747P02739K72095n95569j269401j510143
$$ 782596588 781605422 780702770 780293345 780642092 781344831 781616926 781021357 779751956 778241813
2661.7G78241813j635372j965404k339184k303839j648545o80149J90377Q16584J310706
$$ 778241813 776606441 774641037 772301853 769998014 768349469 767669320 767859697 768676281 769986987
2680.1G69986987J855910K338409K366305J779496R31979L46660J54376q404m20034
$$ 769986987 771842897 774181306 776547611 778327107 779259086 779605746 779760122 779751718 779331684
2698.4G79331684q50916q47578k86639M15147P88688P99716P94232J024186J301349
$$ 779331684 778480768 777633190 777346551 777761698 778550386 779350102 780144334 781168520 782469869
2716.8G82469869J277268R01699M87446L71814N32270N77330K19763l25919o29961
$$ 782469869 783747137 784648836 785136282 785508096 786040366 786617696 786837459 786511540 785881579
2735.1G85881579o19829n79297o84679q10802p69317n42223l49641m84646q97228j217008
$$ 785881579 785261750 784682453 783997774 783186972 782417655 781875432 781525791 781041145 780143917 778926909
2755.5G78926909j238108j089394j065612j302778j542390j314044m86791N04494J102030
$$ 778926909 777688801 776599407 775533795 774231017 772688627 771374583 770887792 771392286 772494316
2773.9G72494316J165986J043916J000166Q85486N24402J1087m03822n73277n24342
$$ 772494316 773660302 774704218 775704384 776589870 777114272 777125359 776721537 776148260 775623918
2792.2G75623918m01199l81351m96506o24598o57141o80387q43406j032888j032412
$$ 775623918 775222719 774841368 774344862 773720264 773063123 772382736 771539330 770506442 769474030
2810.6G69474030p90060m37558k44915k98798k68042J03294N30541O04511K99215p2479
$$ 769474030 768683970 768246412 768001497 767702699 767434657 767537951 768068492 768673003 768972218 768899739
2831G68899739k86877m39167p00176j152456j558542j518488j170039j008511j133799
$$ 768899739 768612862 768173695 767473519 766321063 764762521 763244033 762073994 761065483 759931684
2849.3G59931684j222730j075685q46327p79092j064062j727283k485931l026843l261208
$$ 759931684 758708954 757633269 756786942 756007850 754943788 753216505 750730574 747703731 744442523
2867.7G44442523l000796j931012l92675O31034O70075O1870p53760j642287k757788
$$ 744442523 741441727 739510715 739118040 739749074 740419149 740481019 739727259 738084972 735327184
2886.1G35327184m382014o645501r281993j1703252j2910426j0259748q21292J2016714
$$ 735327184 730945170 724299669 715017676 703314424 690403998 680144250 679322958 691339672
2902.4F91339672J9041657J6863763J0866583O118119L165900R63509q49962k285063
$$ 691339672 710381329 727245092 738111675 744229794 747395694 748359203 747509241 745224178
2918.7G45224178l625512m938364n495847m597961l043294k354324k747953l568948
$$ 745224178 741598666 736660302 731164455 726566494 723523200 721168876 718420923 714851975
2935G14851975m581749n129218l408373N38648K888441J022994l011942o220936p365942
$$ 714851975 710270226 705141008 701732635 702271283 705159724 706182718 703170776 696949840 689583898
2953.4F89583898n981327k497971O98686J303792Q78811K792895N497753M344225q44538
$$ 689583898 683602571 681104600 681803286 683107078 683985889 686778784 692276537 696620762 695776224
2971.7F95776224o945371j2528539j7613352k0980894j9176960r586990O299973K2816240
$$ 695776224 688830853 676302314 658688962 637708068 618531108 608944118 615244091 638060331
2988F38060331L1835795K9498756K1010101J3468265Q602440N227149K919078J601398
$$ 638060331 669896126 699394882 720404983 733873248 742475688 747702837 750621915 752223313
3004.4G52223313R50932P57158P40767N36859J01089l60906p73430j166105j410961
$$ 752223313 753174245 753931403 754672170 755209029 755310118 754949212 754175782 753009677 751598716
3022.7G51598716j197994n02467Q3983n5492q51512j761735k479076l210306m226148
$$ 751598716 750400722 749898255 749982238 749926746 749075234 747313499 744834423 741624117 737397969
3041.1G37397969m857183l147959J325428M916191M483342J828254j63258j060009
$$ 737397969 732540786 729392827 730718255 735634446 740117788 741946042 741782784 740722775
3057.4G40722775j468479j805306k269089k721786k777636j933158j51992J599372
$$ 740722775 739254296 737448990 735179901 732458115 729680479 727747321 727595329 729194701
3073.7G29194701K335131J997292J167417M96327J24574k03907m55559n35726n98669
$$ 729194701 731529832 733527124 734694541 735190868 735315442 735111535 734655976 734120250 733521581
3092.1G33521581o64413o68168n78404l58045j50561j59920m15205q52406j283646
$$ 733521581 732857168 732189000 731610596 731252551 731101990 730942070 730526865 729674459 728390813
3110.4G28390813j381815j176834j126229j405299j736880j831829j604557j241505
$$ 728390813 727008998 725832164 724705935 723300636 721563756 719731927 718127370 716885865
3126.7G16885865j017034j012028j165926j359880j538038j860857k466977l009796
$$ 716885865 715868831 714856803 713690877 712330997 710792959 708932102 706465125 703455329
3143G03455329k672076j172900L66985O34373j58608r61781j352966j541137j767934
$$ 703455329 700783253 699610353 699977338 700611711 700453103 699491322 698138356 696597219 694829285
3161.4F94829285k081275k385914k583862k719283k867102l024042l155589l246844
$$ 694829285 692748010 690362096 687778234 685058951 682191849 679167807 676012218 672765374
3177.7F72765374l342151l552616l972530m536927n104423n640030o218671o883502
$$ 672765374 669423223 665870607 661898077 657361150 652256727 646616697 640398026 633514524
3194F33514524p609606q323789q898914r342432r751856j0059416j0228813j0368347
$$ 633514524 625904918 617581129 608682215 599339783 589587927 579528511 569299698 558931351
3210.3E58931351j0562063j0770261j0615170r542465p141769l341436J407444O227911
$$ 558931351 548369288 537599027 526983857 517441392 510299623 506958187 508365631 514593542
3226.7E14593542J0019898J1905015J1666119R770393P160127M733563L000021K237081
$$ 514593542 524613440 536518455 548184574 557954967 565115094 569848657 572848678 575085759
3243E75085759K566576L909469N875051P704973Q625686Q309007P000506N270243L577113
$$ 575085759 577652335 581561804 587436855 595141828 603767514 612076521 619077027 624347270 627924383
3261.3F27924383K114236Q78096j91689j051187j647592k162039k710104l188491l576934
$$ 627924383 630038619 630916715 630725026 629673839 628026247 625864208 623154104 619965613 616388679
3279.7F16388679l893137m196406m594207n028486n351245n655468o141841o773353
$$ 616388679 612495542 608299136 603704929 598676443 593325198 587669730 581527889 574754536
3296E74754536p402778p925331q308709q651078r166538r822130j0200739j0018349
$$ 574754536 567351758 559426427 551117718 542466640 533300102 523477972 513277233 503258884
3312.3E03258884r422988q803606q510440q659661r153485r920568j0937929j1953801
$$ 503258884 493835896 485032290 476521850 467862189 458708704 448788136 437850207 425896406
3328.6D25896406j2669653j3066113j3121604j2633980j1362463q995742n254209l88860
$$ 425896406 413226753 400160640 387039036 374405056 363042593 354046851 348792642 348403782
3345C48403782M749000R201258J2582600J5658647J9243240K2495956K3779332K2734344
$$ 348403782 353152782 362354040 374936640 390595287 409838527 432334483 456113815 478848159
3361.3D78848159K0154506J6952485J3826907J1218607R137392P212878N232214L387690
$$ 478848159 499002665 515955150 529782057 541000664 550138056 557350934 562583148 565970838
3377.6E65970838J882970N84424p27296k043545l208876m195154n131244o150902p297396
$$ 565970838 567853808 568438232 567710936 565667391 562458515 558263361 553132117 546981215 539683819
3395.9E39683819q471906r563983j0690451j1930912j3122648j4148832j4873713j5133023
$$ 539683819 531211913 521647930 510957479 499026567 485903919 471755087 456881374 441748351
3412.3D41748351j4782399j3562650j1291623q024633l852605J016855O036937J0534942
$$ 441748351 426965952 413403302 402111679 394087046 390234441 391251296 397288233 407823175
3428.6D07823175J4005780J6394586J7719716J7838060J6925216J5545696J4047086
$$ 407823175 421828955 438223541 455943257 473781317 490706533 506252229 520299315
3442.9E20299315J2431741J0687590Q600592O274403M398644M019737N684972P980704
$$ 520299315 532731056 543418646 552019238 558293641 562692285 566712022 572396994 580377698
3459.2E80377698Q843303Q190632P184922O174922M987300L903150L321588L113210
$$ 580377698 589221001 597411633 604596555 610771477 615758777 619661927 622983515 626096725
3475.5F26096725L090382L081143K822638K546548K511144K498686K424658K419650
$$ 626096725 629187107 632268250 635090888 637637436 640148580 642647266 645071924 647491574
3491.8F47491574K404034K280891K105475K048313K040148J741410J390755J414954
$$ 647491574 649895608 652176499 654281974 656330287 658370435 660111845 661502600 662917554
3508.1F62917554J591385J686096J640558J440644J321793J458407J718044J667142
$$ 662917554 664508939 666195035 667835593 669276237 670598030 672056437 673774481 675441623
3524.4F75441623J335561J247823J386047J539647J717091J649022J368165J466215
$$ 675441623 676777184 678025007 679411054 680950701 682667792 684316814 685684979 687151194
3540.8F87151194J795709J713872J237273R91404J121819J239479J344025J552224
$$ 687151194 688946903 690660775 691898048 692889452 694011271 695250750 696594775 698146999
3557.1F98146999J750231J831233J850128J925826J863361J518011J313507J459241
$$ 698146999 699897230 701728463 703578591 705504417 707367778 708885789 710199296 711658537
3573.4G11658537J745463J928866K007663K080142K196074K218962J888454J572311
$$ 711658537 713404000 715332866 717340529 719420671 721616745 723835707 725724161 727296472
3589.7G27296472J659512J780808J779676J858413J906276J791000J707971J713097
$$ 727296472 728955984 730736792 732516468 734374881 736281157 738072157 739780128 741493225
3606G41493225J767814J815439J741111J556814J388788J288771J103402R37640J081705
$$ 741493225 743261039 745076478 746817589 748374403 749763191 751051962 752155364 753093004 754174709
3624.4G54174709J308859J178980P74085O60002P37846P09355O42359O66976Q22068
$$ 754174709 755483568 756662548 757436633 758096635 758834481 759543836 760186195 760853171 761675239
3642.7G61675239J121521J314878R67145J56045j42276J12951K70962J60218n2810
$$ 761675239 762796760 764111638 765078783 765234828 765092552 765205503 765476465 765636683 765583873
3661.1G65583873r9778K07543M49300K17795n066J17779k48671q45253p79689m88520
$$ 765583873 765484095 765691638 766140938 766358733 766353667 766471446 766222775 765377522 764597833 764109313
3681.5G64109313K265O85275R81808K63035o16848m92752q464K86579L53635J39653
$$ 764109313 764111578 764796853 765778661 766041696 765424848 764932096 764923632 765210211 765563846 765703499
3701.9G65703499r9897N6505L82841K79546l49462o38247l91424j79648j38760j75237
$$ 765703499 765603602 765660107 766042948 766322494 765973032 765334785 764943361 764763713 764624953 764449716
3722.3G64449716k69890l75092j89185K28345M43161J53243l63588l84271m1008N8651
$$ 764449716 764179826 763804734 763615549 763843894 764287055 764440298 764076710 763692439 763651431 763710082
3742.7G63710082j38998j01448o2227m94599p15435l09765R835j39058l74496k19822
$$ 763710082 763571084 763469636 763407409 762912810 762197375 761887610 761897445 761758387 761383891 761164069
3763.1G61164069K3663L9041j79171m76361m78983j52289J57356Q8572k28583l26276
$$ 761164069 761187732 761226773 761047602 760571241 760092258 759939969 760097325 760185897 759957314 759631038
3783.5G59631038l04520k83242j96874j53422j22070n7459k39m1723k67029l28600
$$ 759631038 759326518 759043276 758846402 758692980 758570910 758513451 758513212 758471489 758204460 757875860
3803.9G57875860l43979n40793l64422P2896K21729M4585o5387k71082o64591n05329
$$ 757875860 757531881 756991088 756626666 756699562 756921291 756965876 756900489 756629407 755964816 755459487
3824.3G55459487j57952m5597N5909J69635K21788O974m81427o80267n36085l69310
$$ 755459487 755301535 755255938 755311847 755481482 755703270 755710244 755228817 754548550 754012465 753643155
3844.6G53643155j34945K68758N37097m9412r18091o23762j94729q2492j03593j61112
$$ 753643155 753508210 753776968 754314065 754264653 753346562 752722800 752528071 752445579 752341986 752180874
3865G52180874p5102q4936k67506k95460j74165K7299L2365j69157j86801k57612l55363
$$ 752180874 752105772 752020836 751753330 751457870 751283705 751311004 751343369 751174212 750987411 750729799 750374436
3887.5G50374436k69591l50357l72111p4745J56343J44899j11520m97818o35564m37737
$$ 750374436 750104845 749754488 749382377 749307632 749463975 749608874 749497354 748999536 748363972 747926235
3907.9G47926235k41279j57595o4194j848n6863j08659q6963j05501j28090m6253L0517
$$ 747926235 747684956 747527361 747463167 747461319 747404456 747295797 747208834 747103333 746975243 746928990 746959507
3930.3G46959507p748j18137j62243p1407j4603j09076j46807q5353j32204k03847
$$ 746959507 746951759 746833622 746671379 746599972 746585369 746476293 746329486 746244133 746111929 745908082
3950.7G45908082j49847j11877j58072j50919p9691l7134l4869r4175j90020k14815
$$ 745908082 745758235 745646358 745488286 745337367 745257676 745220542 745185673 745091498 744901478 744686663
3971.1G44686663j42395q6606j17957j37449q2373n6982j19806j73628k04027k12252
$$ 744686663 744544268 744457662 744339705 744202256 744119883 744062901 743943095 743769467 743565440 743353188
3991.5G43353188j59740j45078j68562
$$ 743353188 743193448 743048370 742879808
3997.6G42879808
$$ 742879808
##END=$$ End of the data block
