##TITLE=Diplex $$ Begin of the data block
##JCAMP-DX=5.00 $$ ACD/SpecManager v 10.08
##SPECTROMETER/DATA SYSTEM=Alpha
##DATE=14 Apr 2015 15:41:22
##DATA TYPE=INFRARED SPECTRUM
##DATA CLASS=XYDATA
##ORIGIN=
##OWNER=
##NPOINTS=1765
##FIRSTX=399.76428223
##LASTX=3997.64306641
##MAXX=3997.64306641
##MINX=399.76428223
##MAXY=0.83389312
##MINY=0.04550220
##XFACTOR=1.0000000000
##YFACTOR=1.000000000000000e-9
##FIRSTY=0.83106321
##DELTAX=2.03961372
##XUNITS=1/CM
##YUNITS=ARBITRARY UNITS
##XYDATA=(X++(Y..Y))
399.8H31063211K041042P88867k9564j4126j04070n17606p64013j344025j966894m01556
$$ 831063211 833104253 833893120 833863556 833849430 833745360 833227754 832463741 831119716 829152822 828751266
420.2H28751266J186311J061321M77075j82748k88009L57J63377M28974J69933j154184
$$ 828751266 829937577 830998898 831475973 831293225 831005216 831005573 831168950 831597924 831767857 830613673
440.6H30613673j597941l85761N16116L78251k36034o03438p94291j036525n83529
$$ 830613673 829015732 828629971 829146087 829524338 829288304 828684866 827890575 826854050 826270521
458.9H26270521L6537J01626p2360m30286p78913r21548m14073M12226N63800J13845
$$ 826270521 826307058 826408684 826336324 825906038 825127125 824205577 823791504 824203730 824767530 824881375
479.3H24881375m18067m67301j38402j2517k29179l42667n4896J04010q6904m87983
$$ 824881375 824463308 823996007 823857605 823845088 823615909 823273242 823218346 823322356 823235452 822747469
499.7H22747469q07285n92113l16024j56760J36912J1504o64771r96113l90827L04043
$$ 822747469 821940184 821348071 821032047 820875287 821012199 821023703 820358932 819362819 818971992 819276035
520.1H19276035J52528n17011p49707m02808k66969l23713n54204q95798p47979k34365
$$ 819276035 819428563 818911552 818161845 817759037 817492068 817168355 816614151 815718353 814970374 814736009
540.5H14736009o2764j62602n0365r001j98066l93331k75731P9632L3736k72989l83616
$$ 814736009 814673245 814510643 814460278 814451277 814253211 813859880 813584149 813663781 813697517 813424528 813040912
562.9H13040912l22997j44065M2379L5822j68681l72469n13673n79119l19838L9458
$$ 813040912 812717915 812573850 812616229 812652051 812483370 812110901 811597228 811018109 810698271 810737729
583.3H10737729N2452j25527m11928n48303k86102j02401k76566m59730l36051k40267
$$ 810737729 810790181 810664654 810252726 809704423 809418321 809315920 809039354 808579624 808243573 808003306
603.7H08003306l20434l40343l17096l03269l63707m10319l38256k73228l11971k99155
$$ 808003306 807682872 807342529 807025433 806722164 806358457 805948138 805609882 805336654 805024683 804725528
624.1H04725528k52903l79979n32270m63605k61605k56657m44591n22435m11391m17650
$$ 804725528 804472625 804092646 803560376 803096771 802835166 802578509 802133918 801611483 801200092 800782442
644.5H00782442n17130m49538l81827m27366n03838n37395m58837l35216l21687n71012
$$ 800782442 800265312 799815774 799433947 799006581 798502743 797965348 797506511 797171295 796849608 796278596
664.9G96278596j520574j553834J18256J23382n52476o88791n90384o89030p88629
$$ 796278596 794758022 793204188 793322444 793445826 792893350 792204559 791614175 790925145 790136516
683.3G90136516o94275o62684p96914r53079j199007j566946j742959j877606k278626
$$ 790136516 789442241 788779557 787982643 787029564 785830557 784263611 782520652 780643046 778364420
701.6G78364420k982676m015267n627990q033752j2155354k2109509m3409586n0986767
$$ 778364420 775381744 771366477 765738487 757704735 745549381 723439872 680030286 629043519
717.9F29043519n749881M7188342M0026963k494991l3285380j7196655L5671771N5601358
$$ 629043519 623293638 670481980 710508943 708013952 674728572 657531917 693203688 748805046
734.3G48805046L1484306R661436K641678P88689J38163k01583k46227j63674j56701
$$ 748805046 780289352 789950788 792592466 793381155 793519318 793317735 793071508 792907834 792751133
752.6G92751133k21967l07381l89040m12881m13597m03941l81648l73066l42190l06249
$$ 792751133 792529166 792221785 791832745 791419864 791006267 790602326 790220678 789847612 789505422 789199173
773G89199173l50236l82781k66850k08140l53336m28856l34024l50714m78685m77433
$$ 789199173 788848937 788466156 788199306 787991166 787637830 787208974 786874950 786524236 786045551 785568118
793.4G85568118m04417l64542l59476m57764n74529n66482m91023l62874k31146k68698
$$ 785568118 785163701 784799159 784439683 783981919 783407390 782840908 782349885 781987011 781755865 781487167
813.8G81487167l23057k29180j85669k44259l23177l86417l78251l97503m58896m49598
$$ 781487167 781164110 780934930 780749261 780505002 780181825 779795408 779417157 779019654 778560758 778111160
834.2G78111160n76139r09865q59022k54869J09553o4313k70188l39091l69012l67821
$$ 778111160 777535021 776625156 775766134 775511265 775620818 775556505 775286317 774947226 774578214 774210393
854.6G74210393m09185m62652n04672n63383o30498q25405j188279j417160j199185
$$ 774210393 773801208 773338556 772833884 772270501 771640003 770814598 769626319 768209159 767009974
873G67009974o94454k35856K5690J38759L82662O85394O48737L33846O7830j07944
$$ 767009974 766315520 766079664 766105354 766244113 766626775 767312169 767960906 768294752 768362582 768254638
893.4G68254638l22938n14686n85676o64711r36627j260936r89020L1650Q79288R29534
$$ 768254638 767931700 767417014 766831338 766166627 765230000 763969064 762980044 763011694 763890982 764820516
913.7G64820516M95136Q7559o1571j12474k33174l02911l12566l78609m31657l86536
$$ 764820516 765315652 765403211 765341640 765229166 764995992 764693081 764380515 764001906 763570249 763183713
934.1G63183713l53038l86179l65138l21448l33547l55006l76999l81827m05550m92335
$$ 763183713 762830675 762444496 762079358 761757910 761424363 761069357 760692358 760310531 759904981 759412646
954.5G59412646n31017n31734n80668o20186o23703o99163q86440q48532l88503R2149
$$ 759412646 758881629 758349895 757769227 757149041 756525338 755826175 754939735 754091203 753702700 753794849
974.9G53794849K51174J39773r5129l54827n81681p44999q14259p69436p27713p23303
$$ 753794849 754046023 754185796 754090667 753735840 753154159 752409160 751594901 750825465 750097752 749374449
995.3G49374449m72188m1067O5505j94371m35531m46439l11017j86383j33097j59741
$$ 749374449 748902261 748861194 748926699 748732328 748296797 747850358 747539341 747352958 747219861 747060120
1015.7G47060120k27451k76864l45945m43339n26727o38187o99877n63085k87772p0512
$$ 747060120 746832669 746555805 746209860 745766521 745239794 744601607 743901730 743338645 743050873 742980361
1036.1G42980361K1160L7491l278o8426j97888m32312m35591j23501n0306k58386l36051
$$ 742980361 743001521 743039012 743035734 742967308 742769420 742337108 741901517 741778016 741727710 741469324 741133273
1058.6G41133273k85447k52485k49803k74361l43561m21047m44591m20213m22895m31955
$$ 741133273 740847826 740595341 740345538 740071177 739727616 739306569 738861978 738441765 738018870 737586915
1079G37586915l19719j27077q4698k07603k41757j20103p2002j99735l18885l33071
$$ 737586915 737267196 737140119 737055421 736847818 736606061 736485958 736413956 736214221 735895336 735562265
1099.4G35562265k94149k49982k22981k18272k57313l17276l10898k02238j16647j23322
$$ 735562265 735268116 735018134 734795153 734576881 734319568 734002292 733691394 733489156 733372509 733249187
1119.8G33249187j23739j01030j20043j49072j50442j58667j87576k25604k54392l06189
$$ 733249187 733125448 733024418 732904375 732755303 732604861 732446194 732258618 732033014 731778622 731472433
1140.1G31472433m12941m93706n01930m98772n22912n30839m73499m11153m22358n08309
$$ 731472433 731059492 730565786 730063856 729565084 729042172 728511333 728037834 727626681 727204323 726696014
1160.5G26696014n93721n26607k48254J20044L38614J75357j20878j9670K75671K44499
$$ 726696014 726102293 725575686 725327432 725447476 725786090 725961447 725840569 725820899 726096570 726341069
1180.9G26341069q703j76787j89364j45078j44481j72496k18213k78055k94149k93911
$$ 726341069 726332366 726155579 725966215 725821137 725676656 725504160 725285947 725007892 724713743 724419832
1201.3G24419832l52323m08947l82364l30389l11911l14712l45230l77775l90052m27604
$$ 724419832 724067509 723658562 723276198 722945809 722633898 722319186 721973956 721596181 721206129 720778525
1221.7G20778525m73619m56869m08948m09484m28676m20630m12643l89517l58760l70085
$$ 720778525 720304906 719848037 719439089 719029605 718600929 718180299 717767656 717378139 717019379 716649294
1242.1G16649294l83258l61085l69608m10080m12464l68417l14712l17812l30746k76268
$$ 716649294 716266036 715904951 715535343 715125263 714712799 714344382 714029670 713711858 713381112 713104844
1262.5G13104844k54095l06129l33965l16143k76923k61545k75850k69711k99693l64363
$$ 713104844 712850749 712544620 712210655 711894512 711617589 711356044 711080194 710810483 710510790 710146427
1282.9G10146427m45902n32270n54979n50866n96404o38783n83470m85599m33743l71635
$$ 710146427 709700525 709168255 708613276 708062410 707466006 706827223 706243753 705758154 705324411 704952776
1303.3G04952776k03788p510J06096R5070R4771J27852N7161Q5473J85311O2048j62720
$$ 704952776 704748988 704741478 704847574 704942644 705037415 705165267 705222428 705307901 705493212 705555260 705392540
1325.8G05392540k81454l72529m89294p04766j159966j661956j451015o40154n24640
$$ 705392540 705111086 704738557 704249263 703544497 702384531 700722575 699271560 698631406 698106766
1344.1F98106766r98855j271784j172304r07064p59899p40290q89957j478493j995921
$$ 698106766 697107911 695836127 694663823 693756759 692996860 692256570 691366613 689888120 687892199
1362.5F87892199j421035q64088j028776j490474l025174l618718J57536M680216N783796
$$ 687892199 686471164 685607076 684578300 683087826 680062652 676443934 676601470 681281686 687065482
1380.8F87065482M115760J788855J79768O7770K69711p25031j580536j067221m20213
$$ 687065482 691181242 692970097 693149865 693217635 693487346 692762315 691181779 690114558 689694345
1399.2F89694345m3273m22120j098454q55386p13528j049995j128197j420259k481103
$$ 689694345 689651072 689228952 688130498 687275112 686561584 685511589 684383392 682963133 680482030
1417.5F80482030k781332j369178j311660k112329k872407m108727m051805l406226
$$ 680482030 677700698 676331520 675019860 672907531 670035124 665926397 661874592 658468366
1433.9F58468366m242182l686786j493752j665413k802491m032612n521298o360054
$$ 658468366 654226184 650539398 649045646 647380233 644577742 640545130 635023832 628663778
1450.2F28663778p556796j0708451k4302781n5043876n9937507k2136628L4700811
$$ 628663778 621106982 610398531 586095750 531051874 471114367 448977739 483678550
1464.5D83678550M9416393J3010919k2188187j9306481M7444821P5476110M2941451
$$ 483678550 533094943 546105862 523917675 504611194 552056015 627532125 670473576
1478.7F70473576J4073193M403412J512289l56793j245559K62082J736283O03557q28266
$$ 670473576 684546769 688950181 690462470 690105677 688860118 689122200 690858483 691462040 690633774
1497.1F90633774J59025J445830Q00729k035678l496349J255155K836466J314759l69608
$$ 690633774 690792799 692238629 693039358 691003680 687507331 688762486 691598952 692913711 692544103
1515.4F92544103q98004p06673r05096L77059J169383R94265J011730j24634r31799
$$ 692544103 691646099 690939426 690034330 690411389 691580772 692575037 693586767 693462133 692530334
1533.8F92530334K84374n37575l441512j413643J973986K269805J286983J96159j16825
$$ 692530334 692814708 692277133 688835621 687421978 689395964 691665769 692952752 693148911 693032086
1552.2F93032086m04656j450062l583252n69225L358424K022564K99871p87973n71549
$$ 693032086 692627430 691177368 687594116 687024891 690383315 692405879 692705750 691917777 691346228
1570.5F91346228P21932k69950j505732M32610J242459L55661j15156j22071j35362
$$ 691346228 692068160 691798210 690292478 690725088 691967547 692323208 692208052 692085981 691950619
1588.9F91950619j50800j91211j76490L994L7432k22087l08752j61767k19763k27034
$$ 691950619 691799819 691608608 691432118 691436112 691473544 691251457 690942705 690780938 690561175 690334141
1609.3F90334141J68205J17838j144648j302182O65962M66228o84261j54853K81870
$$ 690334141 690502346 690620184 689475536 688173354 688839316 689305544 688621283 688466430 688748300
1627.6F88748300L75509M30584j146733k844215k51412J798391J209676j22904j902640
$$ 688748300 689123809 689554393 688407660 685563445 685312033 687110424 688320100 688197196 686294556
1646F86294556q85487J175523j256466k119422K554655K624750N15104q15154j65104
$$ 686294556 685409069 686584592 685328126 683208704 685763359 688388109 688903213 688088059 687922955
1664.3F87922955L48210j076043j326322K93195J22547k7895O21736O437j923382k236008
$$ 687922955 688271165 687195122 685868800 686161995 686284542 686256647 686878383 686884820 684961438 682725430
1684.7F82725430J117765J812041R51410L01957j470268k174437j318097n40674J031280
$$ 682725430 683843195 685655236 686606646 686908603 685438335 683263898 681945801 681405127 682436407
1703.1F82436407P79748L31401P08223K06530q92460k129019k303540L75866J802981
$$ 682436407 683216155 683547556 684255779 684462309 683569849 681440830 679137290 679513156 681316137
1721.5F81316137Q34704J4603l86238q83341j367033k066731j94728J373052M31419
$$ 681316137 682150841 682165444 681779206 680895865 679528832 677462101 677267373 678640425 679071844
1739.8F79071844K09093P01844M56274j46627k44678Q57771J390695M65215q4639j93059
$$ 679071844 679280937 679982781 680439055 680292428 680047750 680905521 682296216 682761431 682676792 682483733
1760.2F82483733l64244L59237L35276o07967j243651j193822L42965J208544M29630
$$ 682483733 682119489 682478726 682814002 682206035 680962384 679768562 680111527 681320071 681749701
1778.6F81749701k53140j12117l1173J3769j82689j227259j309276K79367O46711j65284
$$ 681749701 681496561 681384444 681353271 681367040 681184351 679957092 678647816 678927183 679573894 679408610
1799F79408610m16219K18510M96626K7478n10335m74274N0425J45614j23918r5546
$$ 679408610 678992391 679210901 679707527 679735005 679224670 678750396 678800821 678946435 678822517 678726971
1819.4F78726971n1498m41134n36740k32041l36349K39193Q25048K48253j60873L5525
$$ 678726971 678675473 678234339 677697599 677465558 677129209 677368402 678193450 678441703 678280830 678316355
1839.8F78316355l67403j249612n76019O09398N60462J91868P868j41442k86043k59697
$$ 678316355 677948952 676699340 676123321 676732719 677293181 677485049 677492917 677351475 677065432 676805735
1860.2F76805735j69874k79724p64132j084864j47045P75695M37379j06811k34843
$$ 676805735 676635861 676356137 675592005 674507141 674360096 675135791 675573170 675466359 675231516
1878.5F75231516k77400l37124l43382m82798q66889p04945j81377j58429o3598J74403
$$ 675231516 674954116 674616992 674273610 673790812 672923923 672218978 672037601 671879172 671815574 671989977
1898.9F71989977J43826M7148J2099r6202j70350l874J49667p5936m84228l28660n722
$$ 671989977 672133803 672180951 672193050 672096848 671926498 671922624 672072291 671996355 671512127 671183467 671177745
1921.3F71177745k802J95384K21253l7849j31190j11997r3043p9691k52843n80073
$$ 671177745 671174943 671370327 671591580 671553731 671422541 671310544 671217501 671137810 670884967 670304894
1941.7F70304894l45408J91330J94908n961j11282j79112j59084j25647j57893j42097
$$ 670304894 669959486 670150816 670345724 670339763 670228481 670049369 669890285 669764638 669606745 669464648
1962.1F69464648j72436k92242j50919J07706L8921j26719j01149n5492j17421j72317
$$ 669464648 669292212 668999970 668849051 668956757 668995678 668868959 668767810 668712318 668594897 668422580
1982.5F68422580j72436k12908k68579l38077k76924j8119K3782j31905j94490k34425
$$ 668422580 668250144 668037236 667768657 667430580 667153656 667135537 667159319 667027414 666832924 666598499
2002.9F66598499l24071m02152m52042n38587o53088o95050m98533p3374J81794J92225
$$ 666598499 666274428 665872276 665420234 664881647 664228559 663533509 663034976 662961602 663143396 663335621
2023.3F63335621J97411J74701J12295O9499L0518p749k5332o0916q4519j5736K1339
$$ 663335621 663533032 663707733 663820028 663889527 663920045 663912296 663886964 663826048 663741529 663725793 663747132
2045.8F63747132m1902o2466j0908j8537p3790j00494r8824j00255j42396j16646l6836
$$ 663747132 663705230 663642764 663631856 663613319 663539529 663439035 663340211 663239956 663097560 662980914 662944078
2068.2F62944078m1484p9215r3162j04785j28150j43707j15037r9718j15693j11937
$$ 662944078 662902594 662823379 662730217 662625432 662497282 662353575 662238538 662138820 662023127 661911190
2088.6F61911190j24455j48535j36316r5784o6757q6248j28389j46568j43706j27972
$$ 661911190 661786735 661638200 661501884 661406100 661339343 661253095 661124706 660978138 660834432 660706460
2109F60706460r6976j10150j53660j19865n6506r3579j88470k23577j97708j72377
$$ 660706460 660609484 660499334 660345674 660225809 660169303 660075724 659887254 659663677 659465969 659293592
2129.4F59293592j62482j75774k07603k00928j94907k22027k08497j66774j60515j51575
$$ 659293592 659131110 658955336 658747733 658546805 658351898 658129871 657921374 657754600 657594085 657442510
2149.8F57442510q3685j8298k2948o3002r0659r3400q0526o0618o1989r7990j15395
$$ 657442510 657358825 657340527 657317579 657254577 657163918 657070518 656989992 656929374 656867385 656769395 656654000
2172.2F56654000q9347p9930j04129j22011j38223j55568j44065j11520q6665o6340
$$ 656654000 656564653 656484723 656380594 656258583 656120360 655964792 655820727 655709207 655622542 655556202
2192.6F55556202q9645j46151j42157j15633j08481j01983j10030j05739j10090j61767
$$ 655556202 655466557 655320406 655178249 655062616 654954135 654852152 654742122 654636383 654526293 654364526
2213F54364526j84536j43945j29163j45436j24573q9407o8665p9095j46389k30193
$$ 654364526 654179990 654036045 653906882 653761446 653636873 653547466 653478801 653399706 653253317 653023124
2233.4F53023124k87891l22103l01600k10702j22368q4401n8829o3301j23262j56045
$$ 653023124 652735233 652413130 652111530 651900828 651778460 651694059 651635230 651571929 651448667 651292622
2253.8F51292622j34289j18554j30713j54137j71960k06649k64645k95996k90573k31147
$$ 651292622 651158333 651039779 650909066 650754929 650582969 650376320 650111675 649815679 649525106 649293959
2274.2F49293959j22309o1690p1228j08063j31011j44184j87874k20716k36749k74182
$$ 649293959 649171650 649109960 649038732 648930669 648799658 648655474 648467600 648246884 648010135 647735953
2294.6F47735953k89023k60233k38061k56062l34680m27425m57942m54963m38392m11033
$$ 647735953 647446930 647186697 646948636 646692574 646357894 645930469 645472527 645017564 644579172 644168139
2315F44168139m69149o56068q23855p39992m71890l57807m07934l80754k49088j87695
$$ 644168139 643698990 643042922 642219067 641479075 641007185 640649378 640241444 639860690 639611602 639423907
2335.4F39423907k87414m17471l82185k68817J60694J078248J328886M75347n63919
$$ 639423907 639136493 638719022 638336837 638068020 638228714 639306962 640635848 641111195 640547276
2353.7F40547276q72016o72520m33921k90454k7716L03268M65393N50569N87523N21183
$$ 640547276 639675260 639002740 638568819 638278365 638250649 638553917 639019310 639569879 640157402 640678585
2374.1F40678585N34594O46710O46949N42760M10020K26200K7895p2360o9380q9586
$$ 640678585 641213179 641859889 642506838 643049598 643459618 643685818 643713713 643641353 643571973 643482387
2394.5F43482387j48356j76310j83046j76609j61350j73449k01762k13742k00689j50681
$$ 643482387 643334031 643157721 642974675 642798066 642636716 642463267 642261505 642047763 641847074 641696393
2414.9F41696393r2029q3149n5313M8280Q3983P629m6908p1168r0063o8188n9962j07646
$$ 641696393 641604364 641521215 641465902 641514182 641598165 641605794 641558886 641487718 641397655 641329467 641269505 641161859
2439.4F41161859j49965j40608j01268r8169j35720j35362j15037j33872j39415j29759
$$ 641161859 641011894 640871286 640770018 640671849 640536129 640400767 640285730 640151858 640012443 639882684
2459.8F39882684j77443k59400l16918l57747l75330l00527j61051q9050r5427j16825
$$ 639882684 639705241 639445841 639128923 638771176 638395846 638095319 637934268 637845218 637749791 637632966
2480.2F37632966j21236j14143j45256j66416j35005j66714k51234k66492k35975k02834
$$ 637632966 637511730 637397587 637252331 637085915 636950910 636784196 636532962 636266470 636030495 635827661
2500.6F35827661j44780j39058k18808k55227k34247k29060k62916l30627l67463l48747
$$ 635827661 635682881 635543823 635325015 635069788 634835541 634606481 634343565 634012938 633645475 633296728
2521F33296728l10004k40624j54495j05202o6876l3856m2200o0797j51455l39449m49240
$$ 633296728 632986724 632746100 632591605 632486403 632419527 632385671 632343471 632282674 632131219 631791770 631342530
2543.4F31342530m11212k73645j49548j41263j66536j97053k44677k27093j40608j43885
$$ 631342530 630931318 630657673 630508125 630366862 630200326 630003273 629758596 629531503 629390895 629247010
2563.8F29247010k82049l64364l37720l04877l09646l40820l95715m33326l85940l21090
$$ 629247010 628964961 628600597 628262877 627958000 627648354 627307534 626911819 626478493 626092553 625771463
2584.2F25771463l15487l45886m16458m91083m58717l44872k97487l43144l87848m37438
$$ 625771463 625455976 625110090 624693632 624202549 623743832 623398960 623101473 622758329 622370481 621933043
2604.6F21933043m88460m73857m97222o03139o65307o80328o80268o53028o49572o82473
$$ 621933043 621444583 620970726 620473504 619870365 619205058 618524730 617844462 617191434 616541862 615859389
2625F15859389p08162p03693o27339m39107j94073L1054J81496J71125L0160p6830
$$ 615859389 615151227 614447534 613820195 613381088 613187015 613218069 613399565 613570690 613600850 613524020
2645.4F13524020j20938k06113l07023l57271l48687k81274j90497q9705M8280J60515
$$ 613524020 613403082 613196969 612889946 612532675 612183988 611902714 611712217 611622512 611670792 611831307
2665.8F11831307J63973J73986K70188L17394K40863J08123k39o8188j31964j92642
$$ 611831307 611995280 612169266 612439454 612756848 612997711 613105834 613105595 613037407 612905443 612712801
2686.2F12712801j75119j13487j49906k55465l19720l78966n09799o18398n67555m57287
$$ 612712801 612537682 612424195 612274289 612018824 611699104 611320138 610810339 610191941 609624386 609167099
2706.6F09167099m47869m91023m94302m90546n20408n53250n63980n50627n24581n17189
$$ 609167099 608719230 608228207 607733905 607243359 606722951 606169701 605605721 605055094 604530513 604013324
2727F04013324n45979n95093n84900n01692m54784m34160l66568l17514l13223l10898
$$ 604013324 603467345 602872252 602287352 601785660 601330876 600896716 600530148 600212634 599899411 599588513
2747.4E99588513l57508m91619o42360p37607q09848r00865r72450r87768r84550j003146
$$ 599588513 599231005 598739386 598097026 597359419 596549571 595648706 594676256 593688488 592703938 591700792
2767.8E91700792j084745j236021j353085j456022j604557j719058j806200j948893
$$ 591700792 590616047 589380026 588026941 586570919 584966362 583247304 581441104 579492211
2784.1E79492211k156078k342344k475858k566099k570688k562583k606988k665281
$$ 579492211 577336133 574993789 572517931 569951832 567381144 564818561 562211573 559546292
2800.4E59546292k783239k965748l140927l344714l623546l996253m474401n006492
$$ 559546292 556763053 553797305 550656378 547311664 543688118 539691865 535217464 530210972
2816.7E30210972n596876o308258p206440q414626j0009080j2053222j4785081j8548280
$$ 530210972 524614096 518305838 511099398 502684772 492675692 480622470 465837389 447289109
2833D47289109k3740440l0853898m0876984n4504365o8526089p3315397n8044687k2554413
$$ 447289109 423548669 392694771 351817787 297313422 228787333 155471936 97427249 74872836
2849.3G4872836J9283429N1151186O6115171O6847533N8546126M5431942L1384468
$$ 74872836 94156265 145307451 211422622 278270155 336816281 382248223 413632691
2863.6D13632691J9286990J0011613K937109k940148q263767j3034493j6755462j8994033
$$ 413632691 432919681 442931294 445868403 442928255 434664488 421629995 404874533 385880500
2879.9C85880500j9771457j9499719j8689692j7710060j6713708j5691221j4649928
$$ 385880500 366109043 346609324 327919632 310209572 293495864 277804643 263154715
2894.2B63154715j3718143j3060897j2931571j3855710j6306371k0206243k4862259
$$ 263154715 249436572 236375675 223444104 209588394 193282023 173075780 148213521
2908.5A48213521k8792195k9602260k5037206j5334782l944874N979829J4380630K2263236
$$ 148213521 119421326 89819066 64781860 49447078 45502204 51482033 65862663 88125899
2924.8H8125899K9863894L7048862M3401599M8077389N0149307M9298406M5884221
$$ 88125899 117989793 155038655 198440254 246517643 296666950 345965356 391849577
2939.1C91849577M0269733L2759100K4261862J6606927J1775255J0086775R726167
$$ 391849577 432119310 464878410 489140272 505747199 517522454 527609229 537335396
2953.4E37335396Q816361P347465O699443P565498R097874J0065019R940088Q890569
$$ 537335396 546151757 553499222 560198665 567764163 576862037 586927056 596867144 605757713
2969.7F05757713P413268N978883M745006L699422K861262K187311J625538J211822
$$ 605757713 613170981 619149864 623894870 627594292 630455554 632642865 634268403 635480225
2986F35480225R31025P12931N21600L33726J79410J06872M6968n3465q7917k7657L457
$$ 635480225 636411250 637124181 637645781 637979507 638158917 638265789 638312757 638259292 638171375 638143718 638147175
3008.4F38147175j00195k47836k92957k73228k40981k59817l10600k39730r9182n7339
$$ 638147175 638046980 637799144 637506187 637232959 636991978 636732161 636421561 636181831 636082649 636025310
3028.8F36025310o2824K9505J56641J99854J90496K13981K68936K55645J81198J21295
$$ 636025310 635962486 635991991 636148632 636348486 636538982 636752963 637021899 637277544 637458742 637580037
3049.2F37580037N5254l0756o3539l4332p1764j39296r6321l8565p0512j25706j43886
$$ 637580037 637635291 637604535 637540996 637506664 637434900 637295604 637199283 637160718 637090206 636964500 636820614
3071.7F36820614j27732j15931j27972j33037q8871l4630j6987N6803K15292L34203
$$ 636820614 636692882 636576951 636448979 636315942 636227071 636192441 636175454 636232257 636447549 636781752
3092.1F36781752L75152M06742M08888L16679K29657K13206J46389M8518K1160k7478
$$ 636781752 637156904 637563646 637972534 638289213 638518870 638732076 638878465 638926983 638948143 638920665
3112.4F38920665j09613r8169n8413q2850j31369j64151j48296j02341r2328j15871
$$ 638920665 638811052 638712883 638654470 638571620 638440251 638276100 638127804 638025463 637933135 637817264
3132.8F37817264j24395r3997o7711j31428k11537j97589j54734j44005j39594j53601
$$ 637817264 637692869 637598872 637531161 637399733 637188196 636990607 636835873 636691868 636552274 636398673
3153.2F36398673j94073j69158p0810m4346j28686j98841j73509j02759r6321j50263
$$ 636398673 636204600 636035442 635964632 635920286 635791600 635592759 635419250 635316491 635220170 635069907
3173.6F35069907j86563k04980j75595j30356j36018j66237j89066j48594p9036q9705
$$ 635069907 634883344 634678364 634502769 634372413 634236395 634070158 633881092 633732498 633653462 633563757
3194F33563757j54615j49488p5221n8889j17124j55687j31309q5473j10745j57476
$$ 633563757 633409142 633259654 633184433 633125544 633008420 632852733 632721424 632635951 632525206 632367730
3214.4F32367730j10745q3328j10209j02758j01864j16825j12832r2983r2924j14441
$$ 632367730 632256985 632173657 632063448 631960690 631858826 631742001 631629169 631536186 631443262 631328821
3234.8F31328821j16765q9467r5725j60813j74344j20282p9215r5307j53125j33097
$$ 631328821 631212056 631122589 631026864 630866051 630691707 630571425 630492210 630396903 630243778 630110681
3255.2F30110681r1731j35601j25766o4134j10984j63079j22189j32918j74821j58608
$$ 630110681 630018950 629883349 629757583 629693449 629582465 629419386 629297197 629164279 628989458 628830850
3275.6F28830850j24335q1062o2287r4295j37627j21832n7578m2737o9797r1493r3400
$$ 628830850 628706515 628625453 628563166 628468871 628331244 628209412 628151834 628109097 628039300 627947807 627854407
3298F27854407p4446r0957j18911r8288r4831j53542j77264j06156o8605j35362j98662
$$ 627854407 627779961 627689004 627570093 627471805 627376974 627223432 627046168 626940012 626871407 626736045 626537383
3320.5F26537383j90497j54495j13249p3552r2208j32502j28567p4625o437m1545j45614
$$ 626537383 626346886 626192391 626079142 626005590 625913382 625780880 625652313 625577688 625571251 625529706 625384092
3342.9F25384092j67250j20342r4891j30951j59621j01567l5882n2750j01268r9957
$$ 625384092 625216842 625096500 625001609 624870658 624711037 624609470 624573588 624520838 624419570 624319613
3363.3F24319613q3327j03951j19865p7843k0385o2943j31786n3346L8028q94k444
$$ 624319613 624236286 624132335 624012470 623934627 623914242 623851299 623719513 623666167 623704195 623703301 623700857
3385.7F23700857M0114m1306j29700r9897o7532N901O3836r4831k26259j21713K1220
$$ 623700857 623740971 623699665 623569965 623470068 623402536 623408437 623472273 623377442 623151183 623029470 623050690
3408.2F23050690O2048L0756q8870k29359k35379j24275J4066M5836l3676p4208r5845
$$ 623050690 623112738 623143494 623054624 622825265 622589886 622465611 622479677 622525513 622491837 622417629 622321784
3430.6F22321784r9122j4007Q345j07170j76906j39475j58012j82331M8876K67625
$$ 622321784 622222662 622208655 622217000 622109830 621932924 621793449 621635437 621453106 621501982 621769607
3451F21769607J41680r2566j70111j15693n6803m530J6630N662l1054q4460m9889K39
$$ 621769607 621911287 621818721 621648610 621532917 621476114 621471584 621488214 621493876 621462822 621378362 621328473 621328712
3475.5F21328712j8597j19329j56343l6239n0724j62124l0637J48535L1113j08480
$$ 621328712 621310115 621190786 621034443 620998204 620947480 620785356 620754719 620903254 620934367 620825887
3495.9F20825887r2447k26200m02271j67728J63674L5167r4116J10388J88351N0187
$$ 620825887 620733440 620507240 620104969 619937241 620100915 620136082 620041966 620152354 620340705 620390892
3516.3F20390892o4731j86681l35515l32951k17557m4108K17140K49982M768j08540
$$ 620390892 620326161 620139480 619803965 619471014 619253457 619209349 619426489 619676471 619681239 619572699
3536.7F19572699j9789q8453l87847n48065k40564J82867J20759j8061J36555N9425
$$ 619572699 619552910 619464457 619076610 618528545 618287981 618470848 618591607 618573546 618710101 618769526
3557.1F18769526k19404k78175l92377r59158r49085L88443R88663L76582j09256j23322
$$ 618769526 618550122 618271947 617879570 616920412 615971327 616359770 617348433 617725015 617615759 617492437
3577.5F17492437j13785j09136k52604r48072j246989q7082M16636m25160q84115o76632
$$ 617492437 617378652 617269516 617016912 616068840 614821851 614734769 615151405 614726245 613842130 613165498
3597.9F13165498o25491l63231J28627m7088m81546j76012J60753K70725L06606j40369
$$ 613165498 612540007 612176776 612305403 612258315 611776769 611600757 611761510 612032235 612338841 612198472
3618.3F12198472J48714J136958J032412l28004j833439o01947J174211Q48949K46227
$$ 612198472 612347186 613484144 614516556 614188552 612355113 611753166 612927377 613776326 614022553
3636.6F14022553l6180k12133j46329m09425j536667k110660J03354J977444J207292
$$ 614022553 613986373 613774240 613627911 613218486 611681819 609571159 609674513 611651957 612859249
3655F12859249K26975O09696P20381K73645l0219o89030j623809r55522k02358r23693
$$ 612859249 613086224 613695920 614416301 614689946 614659727 613970697 612346888 611391366 611189008 610265315
3675.4F10265315K14517J645207J288533O42538o4194j240671j588821Q0109J139104
$$ 610265315 610479832 612125039 613413572 614056110 613991916 612751245 611162424 611242533 612381637
3693.7F12381637Q48055L14653k98321n95034Q1003L89278m08232j242042p35998P95603
$$ 612381637 613229692 613544345 613246024 612650990 612731993 613121271 612713039 611470997 610734999 611530602
3714.1F11530602J103818K85626m51863n27620j90854J48415M19319n9486j296818
$$ 611530602 612634420 612920046 612468183 611940563 611749709 611898124 612317443 612257957 610961139
3732.5F10961139j679122k46287J247824J210391m14431j781404l99351J01447q08239
$$ 610961139 609282017 609035730 610283554 611493945 611079514 609298110 608898759 609000206 608191967
3750.8F08191967L80516J436353O14047j83165K61545N59688k3962l23891l12984M8101
$$ 608191967 608572483 610008836 610622883 610439718 610701263 611260951 611236989 610913098 610600114 610648215
3771.2F10648215O54399M84646l07143p57873j85728K55763J24097J69337J60694J0014
$$ 610648215 611302614 611787260 611480117 610722244 610536516 610792279 610916376 611085713 611246407 611256421
3791.6F11256421l49343q78692p40230p56621r93073J66535M45426P0393O80029O31452
$$ 611256421 610907078 610028386 609288156 608531535 607538462 607704997 608150423 608220816 608900845 609532297
3812F09532297n53966j400411o93262m86314j61171J011729P99179K58327o4612m76539
$$ 609532297 608978331 607577920 606884658 606398344 606237173 607248902 608048081 608306408 608241796 607765257
3832.4F07765257m99725p12931q27253P8917P68780Q20220P41839L24965q81911k526700
$$ 607765257 607265532 606552601 605725348 605804265 606573045 607393265 608135104 608460069 607578158 605051458
3852.8F05051458j124859J633167J552403J89662r04679o13093J05917m47690o17743
$$ 605051458 603926599 605559766 607112169 607301831 606397152 605784059 605889976 605442286 604824543
3871.2F04824543L07798P72119O21319l13699o24598K1160n8412J56283K49624l19779
$$ 604824543 605132341 605904460 606525779 606212080 605587482 605608642 605550230 605706513 605956137 605636358
3891.6F05636358O0082N70357j62065j131416j046061k25902P33018J162708P16984
$$ 605636358 605696440 606266797 606104732 604973316 603927255 603701353 604434371 605597079 606314063
3909.9F06314063J54257j75119n37514n24938K8371K59698M3571N3048O3360k49326
$$ 606314063 606468320 606293201 605755687 605230749 605259120 605518818 605562389 605615437 605678797 605429471
3930.3F05429471k05160L52025N89848K56896k13504l76880j05083K4378j77264o4015
$$ 605429471 605224311 605576336 606166184 606423080 606209576 605832696 605727613 605751991 605574727 605510712
3950.7F05510712K50995K35200N3227o0857j43289j03712R000m1723j44601j71423
$$ 605510712 605761707 605996907 606050134 605989277 605845988 605742276 605751276 605709553 605564952 605393529
3971.1F05393529j64628q3268l1173n4002n543M8518L1352Q166j0550l0339n8949n5909
$$ 605393529 605228901 605145633 605114460 605060458 605054915 605103433 605134785 605142951 605132401 605102062 605043113 604987204
3995.6F04987204k8610
$$ 604987204 604958594
3997.6F04958594
$$ 604958594
##END=$$ End of the data block
