##TITLE=Diogo 3 $$ Begin of the data block
##JCAMP-DX=5.00 $$ ACD/SpecManager v 10.08
##SPECTROMETER/DATA SYSTEM=Alpha
##DATE=16 Sep 2014 08:23:38
##DATA TYPE=INFRARED SPECTRUM
##DATA CLASS=XYDATA
##ORIGIN=
##OWNER=
##NPOINTS=1765
##FIRSTX=399.76428223
##LASTX=3997.64306641
##MAXX=3997.64306641
##MINX=399.76428223
##MAXY=0.76979643
##MINY=0.15130402
##XFACTOR=1.0000000000
##YFACTOR=1.000000000000000e-9
##FIRSTY=0.62067217
##DELTAX=2.03961372
##XUNITS=1/CM
##YUNITS=ARBITRARY UNITS
##XYDATA=(X++(Y..Y))
399.8F20672166n97119K389550M755199O182909P044018O830215M923344K500712K021432
418.1F56722426M012943M874229L051996Q21174Q45432K196550K116025M54008k73525
436.5F74821258J089871K141952R56297n45263K56478J678825J085222m87686m61816
454.8F80535138J055479J452326m5776q02338L08275J140118j73032j822949j348555
473.2F80298686O1274m97401k869010m270554m032612n172133r412408j4867186j9851864
491.5F19386792k4279356k6281595j8895090N96166K0676672K8275192K7106405K5232911
507.9F51818097K0500540J3222099O242335R83536r50158l42130l58165j709163k246082
526.2F87160909j187444q77857l013849n877078p602453r934664j6189694k5465131
$$ plain form
399.8 620672166 620075047 622464597 627219796 633402705 640446723 647276938 652200282 654700994 656722426
418.1 656722426 660735369 665609598 668661594 669482768 670328200 672524750 674640775 675094783 674821258
436.5 674821258 675911129 678053081 679009378 678464115 678720593 680399418 681484640 680996954 680535138
454.8 680535138 681590617 683042943 682997167 682194829 682503104 683643222 683470190 681647241 680298686
473.2 680298686 680359960 679862559 676993549 672722995 668690383 663518250 654105842 639238656 619386792
491.5 619386792 595107436 568825841 549930751 550526917 571203589 599478781 626585186 651818097
507.9 651818097 672318637 685540736 691783071 692766607 691816449 691474319 691116154 689406991 687160909
526.2 687160909 685973465 685095608 682081759 676204681 668602228 658667564 642477870 617012739
542.5F17012739l3180415l6182642l4103334k6617587j1163861J0540784K8638452
556.8E14944136L5204411L2397270K6374578K0697475J5361607R925604N954206M836499
573.1F65695786N043209L760994J416742P08104J755893J749098j44184j622736j192093
591.5F77170813n95391k054870m523277n678654n522013o186008q043468r806991j2132823
609.8F22627318j8300116k7440727l1688988k6284397q044183L3331335P9360425Q1343949
626.2G04904616M3040216R719372o871641k0554960k5871515o965041J4433384J4129996
642.5G25964427N240738J092792o0916j564443k576470j399518M50433N02527q19207
660.8G26830363q40604Q98361K475202J107037r80258m053J413644R20534r05574j573324
$$ plain form
542.5 617012739 583832324 547649682 513546348 486928761 475764900 486305684 514944136
556.8 514944136 550148547 582545817 608920395 629617870 644979477 654905081 660859287 665695786
573.1 665695786 670738995 674499989 675916731 676624835 678380728 680129826 679985642 678362906 677170813
591.5 677170813 676575422 674520552 669997275 664318621 658796608 652610600 644567132 634760141 622627318
609.8 622627318 604327202 576886475 545197487 518913090 510868907 544200242 623560667 704904616
626.2 704904616 747944832 757664204 750792563 730237603 704366088 697401047 711834431 725964427
642.5 725964427 731205165 732297957 732237041 730672598 728096128 726696610 727147043 727649570 726830363
660.8 726830363 725989759 726888120 729363322 730470359 729490101 729486048 730899692 731820226 730914652 729341328
681.2G29341328q56340j242816m152537p907450j1583745j7251790k4208963k4055004
697.5F38082683o008506K4010182L9260208K9119551J2439430M367888K640784J307905
713.9G45220125n15223q68380K91824O54638o28471j631618r34064J20282m65333j937092
734.3G39306688k129614j002610o89864j949310k966881k506673k088786l385901n471587
752.6G17115462o668687p849813j1495947j7758608k6865602m4089675p0370853q4890753
768.9D47125524n3925842K0126045P6655477P2062105L7169457J6689360J5591204
783.2F31493330J8374801J5940487J0218322O117821M898965M296542K563297O91772
799.5F94595337K89321N82039l25620k369821m132330n398632n921125m370272j120865
$$ plain form
681.2 729341328 728484988 727242172 723089635 715182185 703598440 686346650 662137687 638082683
697.5 638082683 632074177 656084359 695344567 724464118 736903548 741271436 743912220 745220125
713.9 745220125 744704902 743836522 744128346 744782984 744154513 742522895 741588831 741709113 741243780 739306688
734.3 739306688 737177074 736174464 735484600 733535290 730568409 728061736 725972950 722587049 717115462
752.6 717115462 710446775 702596962 691101015 673342407 646476805 602387130 532016277 447125524
768.9 447125524 393199682 413325727 489981204 562043309 599212766 615902126 631493330
783.2 631493330 649868131 665808618 676026940 682144761 687043726 691340268 693903565 694595337
799.5 694595337 694884658 695466697 695141077 692771256 688638926 683240294 677319169 672948897 671828032
817.9F71828032J501679K063692J503229K26378k566635o733001j2698173k2045136
834.2F33080065l5551786n0337017n3092956l0409336L290295K4395228L6406397M7252536
850.5E75033426M8577309L7513494K3963988J4601171Q010149K580464p60674k012492
866.8G07506835l128290n112052o621301o503165n921006o540358p997453q616150
883.2F57067060p876098o883561o116033m517794j506269J662374L208935L012777
899.5F38051391K454459K144039J288116n00500k153337k574921k304435k584755l311694
917.8F30508363l202140j826048k13861Q60095J960754L861606N997419P027328O875456
936.2F51848972O812811P369697P507741O410897M811645L581583K780318K726078
$$ plain form
817.9 671828032 673329711 675393403 676896632 677123010 674556375 667823374 655125201 633080065
834.2 633080065 597528279 547191262 494098306 463688970 466979265 491374493 527780890 575033426
850.5 575033426 623610735 661124229 685088217 699689388 707699537 710280001 709519327 707506835
866.8 707506835 704378545 699266493 692645192 686142027 680221021 673680663 665683210 657067060
883.2 657067060 649190962 642307401 636191368 631673574 630167305 631829679 635038614 638051391
899.5 638051391 640505850 642649889 643938005 643437505 641284168 638709247 636404812 633820057 630508363
917.8 630508363 627306223 625480175 625266314 626126409 628087163 631948769 637946188 644973516 651848972
936.2 651848972 658661783 666031480 673539221 679950118 684761763 688343346 691123664 693849742
952.5F93849742K850354J169622k650499o060243n626500p52449O316066J1678636
968.8G00774729J0934711N816221K168179J446068J572251R82523P3612K086N76556
987.2G24346936M92811m14670q10086j48058M74095p570j041948j445413j398146k029240
1007.6G18018711k880156k081573L83019K148986J672327K01881l39806M0174J0788
1025.9G17174351p65860j258671q67009m02749p98583j512468j450956q53717r04798
1044.3G08359540j797677k421259k128780j787424k440572l697455m499138m762589
1060.6F84824646n153478n765557n849659m859686l257573j764476l95298J121104
1076.9F58900023K367675K526820J627743O82056M11629L23594k84433j139164j569867
$$ plain form
952.5 693849742 696700096 697869718 695219219 689158976 683532476 682780027 689096093 700774729
968.8 700774729 711709440 717525661 719693840 721139908 722712159 723694682 723768294 723770380 724346936
987.2 724346936 724839747 724425077 723614991 723466933 723941028 723933458 722891510 721446097 720047951 718018711
1007.6 718018711 715138555 713056982 713440001 715588987 717261314 717463195 717123389 717163563 717174351
1025.9 717174351 716408491 715149820 714282811 713880062 713081479 711569011 710118055 709264338 708359540
1044.3 708359540 706561863 704140604 702011824 700224400 697783828 694086373 689587235 684824646
1060.6 684824646 679671168 673905611 668055952 663196266 659938693 658174217 657778919 658900023
1076.9 658900023 661267698 663794518 665422261 666104317 666515946 666839540 666555107 665415943 663846076
1095.3F63846076j687527k244294l380596m376591m724383m923225n660355o549835
1111.6F30299270o757319o852090q013785j0160983j3410985j9285381k6185393k3663462
1127.9E15969872j951217K7125835L7428379K4642825R023130K200961l27646l172636
1144.2F10939503o477237r543717j2174725j4298916j5704275j6833424j9405603k4882079
1160.5D91619527l3467650m4599712n6172729o4196139o3101575m4967368n087242
1174.8A80027112M9652800J00843013J27036929J19393617Q8710725N3170562K5023818
1189.1G43858576P121682l367245r373009j1742354j0887444q329868n976558m475057
1205.4F96828723l542960l526151m983723p188976q675873r029329q953273r012938
$$ plain form
1095.3 663846076 662158549 659914255 656533659 652157068 647432685 642509460 636849105 630299270
1111.6 630299270 623541951 616689861 608676076 598515093 585104108 565818727 539633334 515969872
1127.9 515969872 514018655 541144490 578572869 603215694 612238824 614439785 614112139 610939503
1144.2 610939503 604462266 594918549 582743824 568444908 552740633 535907209 516501606 491619527
1160.5 491619527 458151877 413552165 357379436 293183297 230081722 185114354 180027112
1174.8 180027112 229679912 330522925 457559854 576953471 665664196 718834758 743858576
1189.1 743858576 750980258 747613013 738240004 726497650 715610206 707280338 701303780 696828723
1205.4 696828723 693285763 689759612 684775889 677586913 668911040 659881711 650928438 641915500
1221.7F41915500q860588q080065p117570o697237o650448o253958n533755n250275
1238.1E87471604n701542o324172o733119p282436q449435r956181j1121333j1891663
1254.4E20011723j2810886j4151245j5607238j6888022j8303812k0222843k2300481
1268.6C99727196k3853660k4109602k2832483k1380365k1507949k3099541k4622023
1282.9B38321573k4559841k1322787j3535812j948729R825855J8726349K7703687L9397240
1299.2B72607535M2127341K1840006j2302667l3910215l0208766j3683826O09607P960796
1315.6B55039811P478118M007042J956880M57167M537195K1338284M5214921O0852707
1331.9D00882125N8883607M1937232J7640233m675805j0893166L412425K5195003L8738310
$$ plain form
1221.7 641915500 633054912 624974847 617857277 611160040 604509592 598255634 592721879 587471604
1238.1 587471604 581770062 575445890 568712771 561430335 552980900 543024719 531903386 520011723
1254.4 520011723 507200837 493049592 477442354 460554332 442250520 422027677 399727196
1268.6 399727196 375873536 351763934 328931451 307551086 286043137 262943596 238321573
1282.9 238321573 213761732 192438945 178903133 176954404 186780259 205506608 233210295 272607535
1299.2 272607535 314734876 336574882 324272215 290362000 260153234 246469408 247079015 255039811
1315.6 255039811 262517929 266524971 268481851 268939018 273476213 294814497 340029418 400882125
1331.9 400882125 459765732 501702964 519343197 514667392 503774226 507186651 532381654 571119964
1348.2E71119964L8631618K9900909J9800245J1433125M608214j191139n599142p518589
1364.5F61185205p954538q873939r880245j0750294j1878311j2487412j3295770j4442920
1380.8E71621776j4876545j5040338j6470611j7801464j7335981j7819076j8820823
1395.1D53456938j7068982j3916284j0143429o747514n640298o220788q077711j0997563
1411.4C74644369j4100820j6716242j9986570k1138608j0059357J2192190L8748145
1425.7C43583107N7690769O0331196M1351557R594381k8593153o3533247o2215924
1440C58208686k9320329K1898627O7084521Q5292190P4356974N3227245L7624359L0660391
1456.3F99032664K4290741J2483120N748868L413439K174556J116097k89679k016008
$$ plain form
1348.2 571119964 609751582 639652491 659452736 670885861 675494075 674302936 668703794 661185205
1364.5 661185205 653230667 644356728 634476483 623726189 611847878 599360466 586064696 571621776
1380.8 571621776 556745231 541704893 525234282 507432818 490096837 472277761 453456938
1395.1 453456938 436387956 422471672 412328243 405580729 399940431 393719643 385641932 374644369
1411.4 374644369 360543549 343827307 323840737 302702129 292642772 304834962 343583107
1425.7 343583107 401273876 461605072 502956629 512551010 483957857 420424610 358208686
1440 358208686 328888357 350786984 417871505 503163695 577520669 630747914 668372273 699032664
1456.3 699032664 723323405 735806525 741555393 744968832 747143388 748259485 747969806 745953798
1472.6G45953798k699673k546191l149092m532814n046726l822505k449095k613306
1488.9G19094396l885568m577934n635202p887840r393216r447336r366572j2423157
1505.2F56477571j9116760j8620193j7074406j8926382k0438910j9161641j2157679
1519.5E30981600k077400O913602J1747241J3864398J3647497J1523068P049024J232922
1535.8E94881952k834618o261349p547915o894708p360279p989824q891404r429812
1552.2E37672043r804130j0140240j3682723j7009526j3070882j4182389j8506556
1566.4D41275597k5005758l3868671l0568361o355226L5892993M3822706J4377147
1580.7D39570427q400410k1380276l0555636l6807119l9932460m1089147m0646464
$$ plain form
1472.6 745953798 743254125 740707934 737558842 733026028 727979302 724156797 721707702 719094396
1488.9 719094396 715208828 710630894 704995692 697107852 687714636 678267300 668900728 656477571
1505.2 656477571 637360811 618740618 601666212 582739830 562300920 543139279 530981600
1519.5 530981600 528904200 535817802 547565043 561429441 575076938 586600006 593649030 594881952
1535.8 594881952 592047334 585785985 578238070 571343362 563983083 555993259 547101855 537672043
1552.2 537672043 527867913 517727673 504044950 487035424 473964542 459782153 441275597
1566.4 441275597 416269839 382401168 351832807 345477581 381370574 425193280 439570427
1580.7 439570427 431170017 409789741 379234105 342426986 302494526 261405379 220758915
1595B20758915l5868913k4869025q716956J0023341K6752219L9067045M6928584M4953287
1611.3C19028497K8710156J930744k8069109l8268983l3432991k3694127n012215J1378080
1627.6B32570052J6974762J1694595L000737P5429J3073862L1368762M1565746L7666202
1643.9C87990147K2674590N79775j6017229l6316186n9767961m2320997k5851682j9120186
1660.3B11850271j1772991m870593p24837J123055K240778K538397K895937L479436
1676.6B06759453M105151N058005Q871153J7393887K2214681K4956763L0023426L0731767
1692.9C50114286L3761263L5890013L2822221L4043998K7682036K3172498K3948133
1707.2E61434448K1681249J9331634J7722428J7002284J8222511J6859830J2770414
$$ plain form
1595 220758915 184890002 160020977 151304021 161327362 188079581 227146626 274075210 319028497
1611.3 319028497 347738653 349669397 321600288 283331305 249898314 226204187 221191972 232570052
1627.6 232570052 249544814 261239409 264240146 264315575 277389437 308758199 350323945 387990147
1643.9 387990147 410664737 411244512 395227283 358911097 299143136 256822139 230970457 211850271
1660.3 211850271 200077280 195206687 194481850 195604905 197845683 200384080 203280017 206759453
1676.6 206759453 210864604 215922609 224793762 242187649 264402330 289359093 319382519 350114286
1692.9 350114286 383875549 419765562 452587783 486631781 514313817 537486315 561434448
1707.2 561434448 583115697 602447331 620169759 637172043 655394554 672254384 685024798
1721.5F85024798J0803997J0076940R032250Q013129O510735N884707N304217L362954
1737.8G44013727J515031k64824j493335j686573j082062Q2254J978338L464997M323184
1756.1G50850737M286587L194630K258122J558841O30498m02391j155556j436293j057207
1774.5G58727968p67231n92470o4135O41406R90629R74715Q54194R27150J358509J314819
1794.9G64365554P28667L75747O02305Q08656N23925J51038J54555M12643M29333J88946
1815.3G68741369J42157M40300M60386Q285l14593j57237R1672J91569J0431j45674
1835.7G69468665R7275K30491j93536p12216n28336k37822n45144j005173j051128
1854G65523076o49571k71857k33531l15011j54555K0266p4923k45988k18928o9857
$$ plain form
1721.5 685024798 695828795 705905735 714937985 722951114 729461849 735346556 740650773 744013727
1737.8 744013727 745528758 745263934 743770599 742084026 741001964 741084218 743062556 746527553 750850737
1756.1 750850737 755137324 758331954 760590076 762148917 762779415 762377024 761221468 759785175 758727968
1774.5 758727968 757960737 757368267 757304132 757945538 758936167 759910882 760765076 761692226 763050735 764365554
1794.9 764365554 765094221 765469968 766072273 766880929 767404854 767555892 767710447 768123090 768552423 768741369
1815.3 768741369 768883526 769323826 769784212 769792497 769477904 769320667 769412339 769603908 769614339 769468665
1835.7 769468665 769565940 769796431 769602895 768890679 768362343 768124521 767579377 766574204 765523076
1854 765523076 764873505 764601648 764368117 764053106 763898551 763918817 763843894 763597906 763378978 763309121
1874.4G63309121q583k19524m72724l70801p4446r6083m94778o83963n40435n68986
1894.8G59778798r88543j641989k164841k387881k791524l600836l360271q98600J596153
1913.2G43540466J899421J375198J800239K596975K652109J729905N73814J66535N17309
1931.5G56851971Q35836P83563P57158Q73088Q13544M57049N5193k4020J59383J61588
1951.9G61724353n7936j09970M4107N6624k40028n51521n16475k67326k80321n38528
1972.3G59262979m91202l4630K79128P4864k88487l20792j54197k66254o71148q31843
1992.7G56558418n44965l37481n79000r16600r19461p23064q23796j300991j710176
2011.1G48702884j758278j478970q28266J24872Q82327J074970O60420n2274m80294
$$ plain form
1874.4 763309121 763300538 763081014 762608290 762237489 762163043 762066960 761572182 760888219 760347784 759778798
1894.8 759778798 758790255 757148266 754983425 752595544 749804020 746203184 742842913 741944313 743540466
1913.2 743540466 745439887 746815085 748615324 751212299 753864408 755594313 756168127 756334662 756851971
1931.5 756851971 757687807 758471370 759228528 760101616 760915160 761372209 761427402 761403382 761562765 761724353
1951.9 761724353 761666417 761556447 761600554 761657178 761417150 760865629 760349154 760081828 759801507 759262979
1972.3 759262979 758771777 758737147 759016275 759091139 758802652 758481860 758327663 758061409 757390261 756558418
1992.7 756558418 756013453 755675972 755096972 754180372 753260911 752537847 751714051 750413060 748702884
2011.1 748702884 746944606 745465636 744637370 744762242 745644569 746719539 747379959 747327685 746847391
2029.4G46847391m01378l24785o84202j122594j127124q29160p85470j090884j264572
2047.8G39217222r97365o00934m12583k53380J78099P27058R74476Q72135P76768R06646
2068.2G41388142R37998N14865j38044m97937n09620n06461n95688n40972j91510J21474
2088.6G39982247N6386j93417j87874O0380J17838j85191m84765m92513m38869o30140
2109G37604082r50814j062870r65535r52661j156092j315951j171053r13143q85427
2127.3G28230536j000106r30369o60479m82977n33223n29349k96592p1884j11639l18229
2147.7G23295689l97087k88546k13265l17931m34637l34084j11997p4745k54154l64721
2168.1G20504522k70426k21848m10378o38545o77526n87285n91278p54535q72731p86304
$$ plain form
2029.4 746847391 746446013 746121228 745437026 744314432 743187308 742358148 741572678 740481794 739217222
2047.8 739217222 738219857 737618923 737206340 736952960 737131059 737858117 738832593 739704728 740481496 741388142
2068.2 741388142 742326140 742841005 742702961 742205024 741695404 741188943 740593255 740052283 739860773 739982247
2088.6 739982247 740038633 739845216 739657342 739717722 739835560 739650369 739165604 738673091 738234222 737604082
2109 737604082 736653268 735590398 734624863 733672202 732516110 731200159 730029106 729115963 728230536
2127.3 728230536 727230430 726300061 725639582 725156605 724623382 724094033 723797441 723725557 723613918 723295689
2147.7 723295689 722898602 722610056 722396791 722078860 721644223 721310139 721198142 721123397 720869243 720504522
2168.1 720504522 720234096 720012248 719601870 718963325 718285799 717698514 717107236 716352701 715479970 714693666
2188.5G14693666o66440p31230q98659r26733q44240r22859j182198j318932j163900
2206.9G06038475q79288o73473n14388k62737n484K0445k73228o43968p72357p07925
2227.3G01326072o92665p26045o38604m43995l63469n10335o92308o95169o04808o56009
2247.7F95302665q33928r09686q18372p08461o70612o42478n77927n17428n80549p74622
2268.1F88268602q74102p95424p63655q83937j010239j001418q79347p96139q12948
2286.4F80451393p92324o61552o02007p35700r42946j027405r35853p97689p16805
2304.8F73239112o33061m76241l61383m35352n79119n19991l14653k70903m55082n83767
2325.2F68609560n20826m92036o68049r19044j011789r54866r81152j246035j705170
$$ plain form
2188.5 714693666 714027226 713295996 712397337 711470604 710626364 709703505 708521307 707202375 706038475
2206.9 706038475 705159187 704485714 703971326 703708589 703703105 703723550 703450322 702806354 702033997 701326072
2227.3 701326072 700633407 699907362 699268758 698824763 698461294 697950959 697258651 696563482 695958674 695302665
2247.7 695302665 694468737 693559051 692740679 692032218 691361606 690719128 690141201 689623773 689043224 688268602
2268.1 688268602 687394500 686599076 685835421 684951484 683941245 682939827 682060480 681264341 680451393
2286.4 680451393 679659069 678997517 678395510 677659810 676716864 675689459 674753606 673955917 673239112
2304.8 673239112 672606051 672129810 671768427 671333075 670753956 670233965 669919312 669648409 669193327 668609560
2325.2 668609560 668088734 667596698 666928649 666009605 664997816 664042950 663061798 661815763 660110593
2343.5F60110593k118886j787722q93771k70486j81198m10498q17120j426637j963854
2361.9F50240421k158701k144218k189159k248287k167106j938105j714706j623690
2378.2F34056449j573503j448631j310587j282513j335383j360118j336158j338005
2394.5F23071551j408040j470268j426578j325666j284063j277745j215935j093745
2410.8F12569511r85265r51588r74357r78708r80735j060724j212419j373350j459301
2429.2F02593064j496851j624584j832903j984179k050817k090037k131164k092302
2445.5E87290227j901626j669586j497030j349569j142501q66413o35565n39243n17130
2463.9E77171564n03480n47350p08878r67026j244723j497686j750708k021372k169013
$$ plain form
2343.5 660110593 657991707 656203985 655310214 655039728 654858530 654448032 653630912 652204275 650240421
2361.9 650240421 648081720 645937502 643748343 641500056 639332950 637394845 635680139 634056449
2378.2 634056449 632482946 631034315 629723728 628441215 627105832 625745714 624409556 623071551
2394.5 623071551 621663511 620193243 618766665 617440999 616156936 614879191 613663256 612569511
2410.8 612569511 611584246 610632658 609658301 608679593 607698858 606638134 605425715 604052365 602593064
2429.2 602593064 601096213 599471629 597638726 595654547 593603730 591513693 589382529 587290227
2445.5 587290227 585388601 583719015 582221985 580872416 579729915 578863502 578227937 577688694 577171564
2463.9 577171564 576668084 576120734 575411856 574444830 573200107 571702421 569951713 567930341 565761328
2482.2E65761328k011299j626730j285792j140296j142025j231671j431048j723408
2498.5E54169059j987994k124071k174199k252340k383709k451539k382874k293408
2514.9E36118925k308846k385378k402901k388180k458930k601206k719104k788067
2531.2E16066313k845347k928913l019035k976179k691924k272308j822621j243383
2547.5D96266603n24431J49220O62446J108855J729340K620756L592909M399180M920602
2565.8E14925480N122065M959405M351973L350139K190292J030982j36257j310110
2582.2E34483969k336263k964199l054202k615630j598180p569J766264L151536L851771
2600.5E30677497L867209L335536K425670J271308P9870r23335j676381k236426k637982
$$ plain form
2482.2 565761328 563750029 562123299 560837507 559697211 558555186 557323515 555892467 554169059
2498.5 554169059 552181065 550056994 547882795 545630455 543246746 540795207 538412333 536118925
2514.9 536118925 533810079 531424701 529021800 526633620 524174690 521573484 518854380 516066313
2531.2 516066313 513220966 510292053 507273018 504296839 501604915 499332607 497509986 496266603
2547.5 496266603 495742172 495891392 496553838 497662693 499392033 502012789 505605698 510004878 514925480
2565.8 514925480 520047545 525006950 529358923 532709062 534899354 535930336 535794079 534483969
2582.2 534483969 532147706 529183507 526129305 523513675 521915495 521907926 523674190 526825726 530677497
2600.5 530677497 534544706 537880242 540305912 541577220 541657090 540733755 539057374 536820948 534182966
2618.9E34182966k840102k780497k461672j989007j462340r32634n53370n16951q16703
2637.2E19829690j249492j606822j836419j972675k038539k000987j830459j651048
2653.5E05643249j582146j570165j479626j269430j063406r12428o93351l80874r4920
2671.9D96596903J10417L79265R15318J751036K779782L886997M978001N892992O357074
2690.3E23647785O222606N695104N006850M201114L335178K484560J700342J073003
2706.6E53366542O21021K46107m8518k16603l53277n43594p63059r16839q79168p01845
2727E49810767n13613l04461j39534j52648l72409o94394r41515j068175j208484j496912
2747.4E42918622j886129k197623k361059k494455k664625k738238k601921k358556
$$ plain form
2618.9 534182966 531342864 528562367 526100695 524111688 522649348 521716714 521163344 520646393 519829690
2637.2 519829690 518580198 516973376 515136957 513164282 511125743 509124756 507294297 505643249
2653.5 505643249 504061103 502490938 501011312 499741882 498678476 497766048 497072697 496691823 496596903
2671.9 496596903 496707320 497086585 498001903 499752939 502532721 506419718 511397719 517290711 523647785
2690.3 523647785 529870391 535565495 540572345 544773459 548108637 550593197 552293539 553366542
2706.6 553366542 553987563 554233670 554185152 553968549 553615272 553071678 552308619 551391780 550512612 549810767
2727 549810767 549297154 548992693 548853159 548700511 548328102 547633708 546692193 545624018 544415534 542918622
2747.4 542918622 541032493 538834870 536473811 533979356 531314731 528576493 525974572 523616016
2763.7E23616016k147555j974047j818239j751066j862466k110898k360404k496779
2780E07094562k525866k547324k549708k452433k310484k238959k244085k219230k118797
2798.4D85887676k011418j913428j822949j763969j709104j677483j745969j852364
2814.7D71390992j835495j662552j383096r43333k89887M19050R42290J228243J419962
2833D69286174J637876J885146K087503K127528J944542J533807Q91626J42455n04554
2851.4D81032103r56148j246929j403004j429230j332938j093328q24601o53744n13196
2869.7D71578985l53485k27153j24097K2441K01076L59506M46647M06504L08335K87085
2890.1D72905844K83391J63108o9976l41386n82248q22126j162053j521617j661598
$$ plain form
2763.7 523616016 521468461 519494414 517676175 515925109 514062643 511951745 509591341 507094562
2780 507094562 504568696 502021372 499471664 497019231 494708747 492469788 490225703 488006473 485887676
2798.4 485887676 483876258 481962830 480139881 478375912 476666808 474989325 473243356 471390992
2814.7 471390992 469555497 467892945 466509849 465566516 465276629 465695679 466637969 467866212 469286174
2833 469286174 470924050 472809196 474896699 477024227 478968769 480502576 481394202 481536657 481032103
2851.4 481032103 480075955 478829026 477426022 475996792 474663854 473570526 472745925 472092181 471578985
2869.7 471578985 471225500 470998347 470874250 470896691 471097767 471457273 471903920 472310424 472618759 472905844
2890.1 472905844 473189235 473352343 473282367 472940981 472358733 471536607 470374554 468852937 467191339
2908.5D67191339j501680j173556q41409n40405k46495J7702K20061K65062J66565
2926.8D63557184o9410o11901j304895j820028k158999k373159k396375k287984k224386
2945.2D48310047k256929k221108k043366j984835k055705j964211j777560j660674
2961.5D32345659j558900j385868j155645r39846p32362n53608m49478l39896k53171
2979.9D24976885l09646l25441j41651O8397K07364K27392N3257j51485l05981l89457
3000.3D23909634k30640N9903K99215N16504O25551M94450J93060j12653k24620q7023
3020.7D25443381P7128N3466p6473j24335j60784k79218m49598n86867n42283m11898
3041.1D22942519m43578p39932j200765j228809k24501J289546K491296L423124M103154
$$ plain form
2908.5 467191339 465689659 464516103 463674694 463134289 462887794 462905496 463125557 463390619 463557184
2926.8 463557184 463487774 462875873 461570978 459750950 457591951 455218792 452822417 450534433 448310047
2945.2 448310047 446053118 443832010 441788644 439803809 437748104 435783893 434006333 432345659
2961.5 432345659 430786759 429400891 428245246 427305400 426573038 426019430 425569952 425230056 424976885
2979.9 424976885 424667239 424341798 424200147 424268544 424475908 424703300 424756557 424605072 424299091 423909634
3000.3 423909634 423678994 423738897 424038112 424554616 425180167 425674617 425867677 425755024 425530404 425443381
3020.7 425443381 425520509 425573975 425497502 425373167 425212383 424933165 424483567 423896700 423354417 422942519
3041.1 422942519 422498941 421759009 420558244 419329435 419104934 420394480 422885776 426308900 430412054
3059.4D30412054M184514L765494L244132K731859K153099J580656J186430J052409
3075.7D50310647J039386R18150P26313O21855N93960N77808M96298L19361J90318
3094.1D55794096J84536K03341J29938k3514j30683j80483k97695m73142m80473k96742
3114.5D54429179j39594m9322N7697K08080L84152N12033N71847O54638P71135Q61049
3134.9D58260894Q82894Q57979Q40515Q46892R31472J188814J538694J727283J666934
3153.2D68742371J489907J360685J355946J409799J413911J369059J354754J412273
3169.6D79908705J486808J510173J494437J481653J497715J477570J378774J243770
3185.9D91479605J080871Q73715O05374L03567N096k95848n78165q07970r41754r25660
$$ plain form
3059.4 430412054 434596568 438362062 441606194 444338053 446491152 448071808 449258238 450310647
3075.7 450310647 451350033 452268183 452994496 453616351 454210311 454788119 455284417 455603778 455794096
3094.1 455794096 455978632 456181973 456311911 456288397 456157714 455977231 455679536 455206394 454725921 454429179
3114.5 454429179 454289585 454240263 454297960 454506040 454890192 455402225 455974072 456628710 457399845 458260894
3134.9 458260894 459143788 460001767 460842282 461689174 462620646 463809460 465348154 467075437 468742371
3153.2 468742371 470232278 471592963 472948909 474358708 475772619 477141678 478496432 479908705
3169.6 479908705 481395513 482905686 484400123 485881776 487379491 488857061 490235835 491479605
3185.9 491479605 492560476 493434191 494039565 494343132 494348228 494052380 493474215 492666245 491724491 490798831
3206.3D90798831p97898o29067m28826k49654k88456p15554j470655k337516l002911
3224.6D80878294l048093k106130j42932K450258M936725O553530P064671O779194
3240.9E03365517O079435N291402M648269M265129M229188M483938M838884N037606
3257.3E42239368M863203M405975L877461L296971K672613K116144J769304J575410
3273.6E66816449J318157R95636P38680N88179M61280K57254J2696j68741k84314m38631
3294E70296645o60777q55803r84550j142383j368701j595080j792192k006054k356768
3312.3E57534337k878249l408491l869415m363536m948080n501032n906641o262601
3328.6E20396292o711423p256806p821083q373261q930951r646624j0632128j1817753
$$ plain form
3206.3 490798831 490000933 489371866 488943040 488693386 488404930 487689376 486218721 483881205 480878294
3224.6 480878294 477830201 475724071 475581139 478031397 482968122 489521652 496586323 503365517
3240.9 503365517 509444952 514736354 519384623 523649752 527878940 532362878 537201762 542239368
3257.3 542239368 547102571 551508546 555386007 558682978 561355591 563471735 565241039 566816449
3273.6 566816449 568134606 569130242 569868922 570457101 570918381 571175635 571188331 571019590 570735276 570296645
3294 570296645 569635868 568780065 567795515 566653132 565284431 563689351 561897159 559891105 557534337
3312.3 557534337 554656088 551247597 547378182 543014646 538066566 532565534 526658893 520396292
3328.6 520396292 513684869 506428063 498606980 490233719 481302768 471656144 461024016 449206263
3345D49206263j3243407j4983207j7046064j9433946k1843493k3335665k2526175j7863393
3361.3B98930913q328885N170912J9062459K8207601K8864681K0833522P536203m985362
3377.6C95292044j0018170m172623R033888K1994323L0071765L3031791L1459511K6121318
3393.9E32813847J9195318J3048411Q508265N346834L170669J679063N57423l91066
3410.2E83928764j171887j795173k311647k771139l189325l562629l938377m378796
3426.5E60809791m841387n287111n588233n667806n703390n741954n775630o075204
3442.9E16129076o947040q647084j1519552j6134768k2540063k8249860k8470337j9361377
3459.2C74258995k207667J5130133K3185313J9323527R502978K102136J491875O431311
$$ plain form
3345 449206263 435962856 420979649 403933585 384499639 362656146 339320481 316794306 298930913
3361.3 298930913 290602028 295772940 314835399 343043000 371907681 392741203 400277406 395292044
3377.6 395292044 385273874 381101251 390135139 412129462 442201227 475233018 506692529 532813847
3393.9 532813847 552009165 565057576 573565841 578912675 582083344 583762407 584319830 583928764
3410.2 583928764 582756877 580961704 578650057 575878918 572689593 569126964 565188587 560809791
3426.5 560809791 555968404 550681293 545093060 539425254 533721864 527979910 522204280 516129076
3442.9 516129076 509182036 500534952 489015400 472880632 450340569 422090709 393620372 374258995
3459.2 374258995 372051328 387181461 410366774 429690301 439193279 441295415 442787290 449218601
3475.5D49218601J3084143J8362314K0917326K0564139J8251479J5246629J2202144
3489.8E67846775R622634P742524O410539N363822M520833L929854L447532L009498
3506.1F11894011K761484K675056K603710K426088K159774J950383J836360J827776
3522.4F30134642J756907J551985J496852J614988J703977J742184J652480J468539
3538.7F43122554J460135J550078J503647J336276J269817J329482J364589J376569
3555F54313147J388013J420737J430690J276851J137078J417279J815796J782596J573384
3573.4F67555571J511752J587391J711309J797497J706958J463294J507759J917661
3589.7F80759192J957535J732826J778901J938462J880467J796246J730680J489640
$$ plain form
3475.5 449218601 462302744 480665058 501582384 522146523 540398002 555644631 567846775
3489.8 567846775 577469409 585211933 591622472 596986294 601507127 605436981 608884513 611894011
3506.1 611894011 614655495 617330551 619934261 622360349 624520123 626470506 628306866 630134642
3522.4 630134642 631891549 633443534 634940386 636555374 638259351 640001535 641654015 643122554
3538.7 643122554 644582689 646132767 647636414 648972690 650242507 651571989 652936578 654313147
3555 654313147 655701160 657121897 658552587 659829438 660966516 662383795 664199591 665982187 667555571
3573.4 667555571 669067323 670654714 672366023 674163520 675870478 677333772 678841531 680759192
3589.7 680759192 682716727 684449553 686228454 688166916 690047383 691843629 693574309 695063949
3606F95063949J406431J588166J640915J646817J627982J608729J789332J766622J380861
3624.4G09519804Q81373P28131J157105J268506J121819J036882Q34346O41465N82695
3642.7G17772126M16756P9870J07348P04289Q81314N34475M29928N50568L74138J20461
3663.1G21971273n2630m28021p34091m06623k95520o47485k88010K42949L38018L57329
3683.5G20057189K59638M7028J20K52664L89695K45809P1466j28984l08037j88410
3703.9G20698178r0957l15308n95093m31001M8220J25408p2241k40981l56019m06861
3724.3G18363345k99931j05262k25544n76853n81563j33634J69039j13666p97868j008331
3744.7G14689732l48747k96235n74291n3227L17395K1279k48790j41442n5611j54913
$$ plain form
3606 695063949 696470380 698058546 699699461 701346278 702974260 704582989 706372321 708138943 709519804
3624.4 709519804 710401177 711129308 712286413 713554919 714676738 715713620 716547966 717189431 717772126
3642.7 717772126 718188882 718268752 718376100 719080389 719961703 720496178 720926106 721476674 721850812 721971273
3663.1 721971273 721918643 721490622 720756531 720349908 720054388 719406903 719118893 719361842 719699860 720057189
3683.5 720057189 720316827 720363855 720363975 720616639 721006334 721252143 721323609 721194625 720886588 720698178
3703.9 720698178 720607221 720291913 719696820 719265819 719314039 719439447 719367206 719126225 718770206 718363345
3724.3 718363345 718063414 717958152 717732608 717155755 716574192 716440558 716609597 716495931 715698063 714689732
3744.7 714689732 714340985 714044750 713470459 713417232 713734627 713755906 713507116 713365674 713310063 713155150
3765.1G13155150k29299k60889j35780L1651p7606l43859m19080k48432j65522k01643
3785.5G11104691j98364k02298k31684l55720n62966o50346p33137n62489j11044k40922
3805.9G07255721l25382L4750l4571n55694q30412o14762o13272m49777m768k981j42336
3828.3G03716516k94566l83675l02136m13298m99308j48774J07944P6056l457j48237
3848.7G01707065o21080j214564n38349M98831L75926j31189l98040k37286j60396
3867.1F99280918m10080l53217q1122J8656n0843l24130l22461j62065j92583j09732
3887.5F97293341k02179l66628j30594m5299m28438p01189n42045k02000J30593J82510
3907.9F94988072l0875j65463k36749l81113l97205j93238n2989j07646j93298k45690
$$ plain form
3765.1 713155150 712925851 712664962 712529182 712560833 712483227 712139368 711720288 711471856 711306334 711104691
3785.5 711104691 710906327 710704029 710472345 710116625 709553659 708903313 708170176 707607687 707496643 707255721
3805.9 707255721 706930339 706965089 706930518 706374824 705544412 704929650 704316378 703866601 703861833 703858852 703716516
3828.3 703716516 703421950 703038275 702736139 702322841 701823533 701674759 701782703 701858759 701855302 701707065
3848.7 701707065 701085985 699871421 699333072 699831903 700207829 700076640 699678600 699441314 699280918
3867.1 699280918 698870838 698517621 698436499 698455155 698404312 698080182 697757721 697595656 697403073 697293341
3887.5 697293341 697091162 696724534 696593940 696548641 696120203 695419014 694876969 694674969 694805562 694988072
3907.9 694988072 694957197 694791734 694554985 694173872 693776667 693583429 693530440 693422794 693229496 692983806
3928.3F92983806k76804j97947p5281p1942j14084j34825j82093k08675k01762j58310
3948.7F91362083q8036r4771j53602j86026k08437k07722j66953j55389j85430j60396
3969.1F89755321r3580j19090j87337j96278k13147k28822j95265j80542k41458l19779
3989.5F87780023k91527k17497k06769k10762
3997.6F86853468
$$ plain form
3928.3 692983806 692707002 692509055 692433774 692361832 692247748 692112923 691930830 691722155 691520393 691362083
3948.7 691362083 691274047 691179276 691025674 690839648 690631211 690423489 690256536 690101147 689915717 689755321
3969.1 689755321 689661741 689542651 689355314 689159036 688945889 688717067 688521802 688341260 688099802 687780023
3989.5 687780023 687488496 687270999 687064230 686853468
3997.6 686853468
##END=$$ End of the data block
