##TITLE=Diogo 02 $$ Begin of the data block
##JCAMP-DX=5.00 $$ ACD/SpecManager v 10.08
##SPECTROMETER/DATA SYSTEM=Alpha
##DATE=09 Sep 2014 08:39:12
##DATA TYPE=INFRARED SPECTRUM
##DATA CLASS=XYDATA
##ORIGIN=
##OWNER=
##NPOINTS=1765
##FIRSTX=399.76428223
##LASTX=3997.64306641
##MAXX=3997.64306641
##MINX=399.76428223
##MAXY=0.80676734
##MINY=0.05227321
##XFACTOR=1.0000000000
##YFACTOR=1.000000000000000e-9
##FIRSTY=0.78692788
##DELTAX=2.03961372
##XUNITS=1/CM
##YUNITS=ARBITRARY UNITS
##XYDATA=(X++(Y..Y))
399.8G86927879J1023640N755783J346588P66873R46581j786351l008604j836419m584253
418.1G95551717q679330n668521n506635j7686367l7102818m1526735r143472L4593284
434.4G04831123M6740294K9779017J1896550M741610L987729J825929p94470L84628
450.8H03392410J526177n42402j368046L40998m00364k177715p94530L82900j418054
469.1G98941374j796723J6451q39293k580344j340986n86450k898395l856659k772987
487.5G82285988m551232q575379j2347103k0636439l7735283n6948126n3345143l600955
503.8E84546328N3345620O5650404M4087290K0757974P244110K617121J46687k284527
520.1G76111007j656831q25226l314197n428076n471885p945001j3236940j8600047
$$ y = [786927879, 797951519, 803707302, 805053890, 805820763, 806767344, 804980993, 801972389, 800135970, 795551717, 786872387, 781203866, 775697231, 758010864, 720908046, 679381311, 670237839, 704831123, 751571417, 781350434, 793246984, 797988594, 801976323, 803802252, 803007782, 803392410, 804918587, 804376185, 803008139, 803349137, 802948773, 800771058, 799976528, 800359428, 798941374, 797144651, 797161102, 796321809, 793741465, 792400479, 791814029, 788915634, 785058975, 782285988, 777734756, 769159377, 756812274, 736175835, 698440552, 641492426, 588147283, 584546328, 637891948, 703542352, 747629642, 768387616, 775631726, 778248847, 778395534, 776111007, 774454176, 773628950, 770314753, 764886677, 759414792, 751469791, 738232851, 719632804]
536.4G19632804k6591003l9855778n2011192n1914334l1763136N691349M3061435O0452998
552.7F26703143N3935707L6942124K2984862J3487339N938352J814603j63734m821121
569.1G56821275j1886478j4410078n698741R098351J5686095J1853397N335092J008571
585.4G67807484l2664o07788k979100m892170n454243p876217j2701511j7861605k4224818
603.7F91177368k9392719j8904746J3875783M2719722M1800677K3913324J0125876
618G75315285K493620j308620j529932j396716m120409p772923o130457J268506M868567
636.4G61686921K339721n85079k543807k208114n3227n7638j900732k308727k178490
654.7G52190828l309488m221857m240870n326569p529140j1522770j5371620j3464332
$$ y = [719632804, 693041801, 653186023, 601174831, 549260497, 517497361, 523188710, 566250145, 626703143, 680638850, 717580974, 740565836, 754053175, 759991527, 761806130, 761642396, 756821275, 744934797, 730524719, 724825978, 733924329, 749610424, 761463821, 766798913, 767807484, 767774820, 767167032, 764187932, 759295762, 753841519, 745965302, 733263791, 715402186, 691177368, 661784649, 642879903, 656755686, 699475408, 741276085, 765189409, 775315285, 777808905, 776500285, 774970353, 773573637, 769453228, 761680305, 755549848, 756818354, 761686921, 764026642, 763441563, 760897756, 758689642, 758636415, 758578777, 756678045, 754369318, 752190828, 748881340, 744659483, 740418613, 735092044, 727562904, 716040134, 700668514, 687204182]
671F87204182j6558051k8322756l9461375k6253044J2773573L4159482K0330667J57893
687.3F44030571q903444j2100160j7334700k8420388l9285481l5471559j3432175J1704594
703.7E00787258K6158571K9508949K7868807K5525510K2576571J8469512J4784456
717.9F65679634J2925803J1368573R407341Q557261Q470833P404089O211340O271839
734.3G36296713O258190N197167M480958M328371L100693J384556P71821J32441j893699
752.6G60057211m303575p626533j3714731k4333835n0038993r3938351j03370338k2058726
768.9D40672129Q3388478J08195186O9259822L2451034J3980925N460560J409650j62184
785.3G54655600j725555n513191j1276960j7581344k0712555j1846542J0212600K8192759
$$ y = [687204182, 670646131, 642323375, 602862000, 576608956, 589382529, 623542011, 643872678, 644030571, 635127127, 623026967, 605692267, 577271879, 537986398, 502514839, 489082664, 500787258, 526945829, 556454778, 584323585, 609849095, 632425666, 650895178, 665679634, 678605437, 689974010, 699381351, 707938612, 716409445, 723813534, 730024874, 736296713, 742554903, 747752070, 752233028, 756561399, 759662092, 761046648, 761818469, 761950910, 760057211, 755753636, 748127103, 734412372, 710078537, 660039544, 566101193, 462730855, 440672129, 524060607, 632255793, 701515615, 733966649, 747947574, 753408134, 754817784, 754655600, 752930045, 747416854, 736139894, 718558550, 697845995, 685999453, 696212053, 724404812]
801.6G24404812K7692854J5917123N229950k636075p663787n608559J443446L940284
817.9G62720048L94702l380000o055117r414971j3515115j8056035k1773278j8397689
834.2F72522545l120423J5078962K0805419J2621999J60336j0487735j9220531k9075444
850.5F59285128l6686897k3892343J2082517L3935785J8114329j4610529m1452885
864.8F06775105m4648349m454255N5671751P7659905N3994834K4416388Q894801L264546
881.1G81574726J019538p71046j888871k181113k722502l475666l551900l473103m007161
899.5G60522902m574060m797519n517542o793678p781505q657217j0192812j2010515
915.8G00198054j3487935j5145123j7199814j8804371j9533754j9651055j8690646
$$ y = [724404812, 752097666, 768014789, 773244739, 770608664, 762944877, 757336318, 758779764, 762720048, 763114750, 759734750, 753679633, 744264662, 730749547, 712693512, 690920234, 672522545, 669402122, 684481084, 705286503, 717908502, 718068838, 707581103, 688360572, 659285128, 622598231, 598705888, 610788405, 644724190, 662838519, 648227990, 606775105, 562126756, 557672501, 613344252, 691004157, 744998991, 769415379, 778310180, 781574726, 782594264, 781823218, 779934347, 777753234, 775030732, 771555066, 768003166, 764530063, 760522902, 755948842, 751151323, 745633781, 738840103, 731058598, 722401381, 712208569, 700198054, 686710119, 671564996, 654365182, 635560811, 616027057, 596376002, 577685356]
930.1E77685356j5868485j1531830o763637k014398K715408O855250R921014J2181044
946.4E73179722J3714492J3563156J0545492N722881M453420R298802J1887252N765736
962.7F48130953j95026M491985J5127539K0447553J7978072J1573612M164339l494740
979G18224287j1927068j6136646o160260J1648715J7427921R916842J893997k511382
995.3G22376406n034745o833493q727312j1016608j3466358j6156852j8770099j9348204
1011.6F23022735j5633225q565605q96335R551525K3901463L2377779K7479888J5751063
1028G06989288N767048p95007n338907q817315j1217416j1205196o701231J912415
1044.3F70593679J0360718J4285803J3480126J0496378P350743M818440L063857J887083
$$ y = [577685356, 561816871, 550285041, 543521404, 541507006, 544222414, 551077664, 560998678, 573179722, 586894214, 600457370, 611002862, 616725743, 621179163, 630477965, 642365217, 648130953, 647935927, 652427912, 667555451, 688003004, 705981076, 717554688, 721719027, 718224287, 706297219, 690160573, 684000313, 695649028, 713076949, 722993791, 724887788, 722376406, 717341661, 710508168, 701780856, 690764248, 677297890, 661141038, 642370939, 623022735, 607389510, 598823905, 597927570, 607479095, 631380558, 663758337, 691238225, 706989288, 712756336, 711961329, 706622422, 697805107, 686587691, 675382495, 668681264, 670593679, 680954397, 695240200, 708720326, 719216704, 726567447, 731385887, 734449744, 736336827]
1060.6G36336827R62377K91347n8412l36707p54118j048565j188099j467347j861632
1079G30875671k081513k167643k332449k388417k241493k202749k505541l001272l732384
1097.3G08222210n034446p130087j0143578j4059245j6969383j4691889o463230J369417
1113.6F35099769K836763N4777o40273K764165L378094p749200k3209751j6237795
1129.9E96296549J7316580M0167391L2624364J5288114M956603P22290j276970k530814
1146.3G03564107l382682m083932m541039m494071m407227n055905o443619q335770
1162.6F62819862j1110127j5404939k1768272l0576289l9642513m3685615l7804574
1176.9D62827533j9885301O090641L3323824N7785780O7363500N0524593K1631002
$$ y = [736336827, 737299204, 737590551, 737532139, 737195432, 736441314, 735392749, 734204650, 732737303, 730875671, 728794158, 726626515, 724294066, 721905649, 719664156, 717461407, 714955866, 711954594, 708222210, 703187764, 696057677, 685914099, 671854854, 654885471, 640193582, 633730352, 635099769, 637936532, 637991309, 637351036, 640115201, 643493295, 635744095, 612534344, 596296549, 613613129, 653780520, 686404884, 701692998, 706649601, 707371891, 706094921, 703564107, 700181425, 696097493, 691556454, 687062383, 682655156, 677599251, 671155632, 662819862, 651709735, 636304796, 614536524, 583960235, 544317722, 500632107, 462827533, 442942232, 449032873, 482356697, 540142477, 607505977, 658030570, 679661572]
1191.1F79661572K137303n547464p868170q007527p128060o357073o112159o119489
1207.5F34658933o151855o210268o252825o079972n631506n242706n415439o285012
1223.8E87389350p345140p739186p473767p484853q094788q707523r316624j0591447
1240.1E20636022j2521684j4468253j6188800j8037677k0432681k3806035k8384716
1254.4C86796176l3619642l7931919l8244694k9535786p590472K5463506N6068093
1268.6C21405262O5382033M8415363K0004958l956258j9920975l0183107l6413878
1282.9C64733398l9557070m0171712l7853942l1708329k1914423j0511801J68622J0661334
1299.2A93846077K2462874L1077132K6104346M725605k0747304l3916428k4591253
$$ y = [679661572, 681798875, 676251411, 668383241, 660375714, 653247654, 646890581, 640778422, 634658933, 628507078, 622296810, 616043985, 609964013, 604332507, 599089801, 593674362, 587389350, 580044210, 572305024, 564831257, 557346404, 549251616, 540544093, 531227469, 520636022, 508114338, 493646085, 477457285, 459419608, 438986927, 415180892, 386796176, 353176534, 315244615, 276999921, 247464135, 239873663, 265337169, 321405262, 386787295, 435202658, 455207616, 451251358, 431330383, 401147276, 364733398, 325176328, 285004616, 247150674, 215442345, 193527922, 183016121, 183184743, 193846077, 216308951, 247386083, 273490429, 278216034, 257468730, 223552302, 198961049]
1313.5A98961049M943312L2732591L8312330L1628848L4252464M5258880N0559252
1327.8D36648726M4388742L1496495J9823432J4459490J5858949K0088911K0642340
1342.1F03407085J5855670Q552253Q88646o088615j2314260j8058300k4081230l0915618
1358.4E37245631l8080066m0251196k8463632q367210O066561J1276453J2291015J3468474
1374.7D65186030J3354420J0785997O134659J68920n557209j1229843j5381426j5709251
1391D47752297j5286177j6328782j7761618j9376457j8861055j4850468p251292N142778
1407.3C43179226J6703635K0463765J3507724J5616j5879690l0738920l2615096k5693983
1423.7B88942277j4857620K900392K4793834M2555839M9780845N5383593N3652495
$$ y = [198961049, 203904361, 236636952, 274949282, 306578130, 340830594, 386089474, 436648726, 481037468, 512533963, 532357395, 546816885, 562675834, 582764745, 603407085, 619262755, 627815008, 628703654, 622615039, 610300779, 592242479, 568161249, 537245631, 499165565, 458914369, 430450737, 422083527, 428150088, 439426541, 451717556, 465186030, 478540450, 489326447, 495461106, 495630026, 490072817, 478842974, 463461548, 447752297, 432466120, 416137338, 398375720, 378999263, 360138208, 345287740, 338036448, 343179226, 359882861, 380346626, 393854350, 393869966, 377990276, 347251356, 314636260, 288942277, 274084657, 276985049, 301778883, 344334722, 394115567, 449499160, 503151655]
1437.9E03151655L8233996K7842342K2502661J7773330J4322937J0916054Q318663
1452.2F43061638O618559N459428L220737L03626j788437l906191n235433n084992
1468.5F42648935n451500p406771r003103j0205269j1289775j1139870q883476o139219
1484.9E73129952o156325j0306240j6007900j8503725k2060633k8811693l1108976
1499.1D40174460k7924120k5278568l0753136m3479681l6792845k3784935j8774971
1513.4B33386204j9834593k3440823j9861222j0427802J362875J2242645K1255135
1527.7A94682419K6510716L2270968M1285306M0387601L8127809M9741090N1835268
1542D74841177M0520668L4452618K9928803K6630044K2284925J7294705J2825966J0028064
$$ y = [503151655, 541385651, 569227993, 591730654, 609503984, 623826921, 634742975, 643061638, 649680197, 655139625, 658360362, 658663988, 656875551, 652969360, 647733927, 642648935, 637197435, 629790664, 620787561, 610582292, 599292517, 588152647, 579269171, 573129952, 566973627, 556667387, 540659487, 522155762, 500095129, 471283436, 440174460, 412250340, 386971772, 356218636, 312738955, 275946110, 252161175, 233386204, 213551611, 190110788, 170249566, 159821764, 161184639, 173427284, 194682419, 221193135, 253464103, 294749409, 335137010, 373264819, 423005909, 474841177, 515361845, 549814463, 579743266, 606373310, 628658235, 645952940, 658778906, 668806970]
1558.3F68806970O315589J732290r0480k81692l87072j254857l708422r241521j9276440
1576.6F42614365k5850952l0708134m0868879n3355425o4775139o4274282l9739549
1590.9C23042005J385212L2287061L6623270K2144139J420438k1562606m0169150l6802769
1607.2C18367600K845347N6740970P8621566O6990286M0283740J1786401l401637j0895073
1623.5E61339200j4863849j7588496j9999802j9956142k1162868k6460737k4730622
1637.8D16576684j8854768j6955137j6993940k0622849k3048043j8808455k3154884
1652.1B78138608l5527692l0636683k7599021l0367539l2010264k8157592j9803748
1666.4G4036069j3941906p820957L95939Q023925J3061442J3615913J2926810J4693968
$$ y = [668806970, 675122559, 676854849, 676764369, 676482677, 676095605, 674840748, 671132326, 661890805, 642614365, 616763413, 586055279, 545186400, 491830975, 427055836, 362781554, 323042005, 324427217, 356714278, 393337548, 415481687, 416902125, 395339519, 355170369, 318367600, 321212947, 377953917, 456575483, 523565769, 563849509, 575635910, 572234273, 561339200, 546475351, 528886855, 508887053, 488930911, 467768043, 441307306, 416576684, 397721916, 380766779, 363772839, 343149990, 320101947, 301293492, 278138608, 242610916, 211974233, 184375212, 154007673, 121997409, 93839817, 74036069, 60094163, 52273206, 52669145, 60693070, 73754512, 87370425, 100297235, 114991203]
1682.7A14991203J9254401J8887878J7191171J8041552J6247555J5100807J5635297
1697B35349864K1620810L6573738M1142463M2588562M3880761L6208004K9454559K6270419
1713.3E13089180K5641561K7413010K5189757J9611896J7584800J6591788J4353454
1727.6F59475446J1900127R431302Q630932P168352M736901M620075N583286N704463
1743.9G17250884N318939M812897M359424L464460K430737K057910J581669Q13663
1760.2G42090583M58896N74470O55770P61151Q85308Q99494P61985O01113L97802j63675
1780.6G47922897o68943p12394m79639k54691J25528O92487R22143Q06213P39574O00338
1801G49693513J02281j47879K32757P52806R89378J330793J974344K414703K355397
$$ y = [114991203, 134245604, 153133482, 170324653, 188366205, 204613760, 219714567, 235349864, 256970674, 293544412, 334686875, 377275437, 421156198, 457364202, 486818761, 513089180, 538730741, 566143751, 591333508, 610945404, 628530204, 645121992, 659475446, 671375573, 680806875, 689437807, 696606159, 701343060, 705963135, 711546421, 717250884, 722569823, 727382720, 731742144, 735206604, 737637341, 739695251, 741276920, 742090583, 742549479, 743123949, 743779719, 744540870, 745426178, 746325672, 747087657, 747688770, 748086572, 747922897, 747253954, 746541560, 746061921, 745807230, 745932758, 746625245, 747547388, 748353601, 749093175, 749693513, 749795794, 749647915, 749880672, 750633478, 751622856, 752953649, 754927993, 757342696, 759698093]
1819.4G59698093K031624J572073Q70943K71201L1292p6592j47461n067J94073J59919
1839.8G64600098Q3923K00451L34501K40207K57373M40478L98815J38342N3406P3671
1860.2G66821265r4354k16484j21355j70231m58538m98116l68238m82023p30931p53999
1880.5G62926996o94931q19206q65698o57678m46558l09884j8478L54469N15342N20527
1900.9G60504901N03004K53677k61485o04153n50508l88205k28048K39194R49561J378954
1921.3G61796892J502156J473784J148820N23627q5890n23091q56757q18491j68740
1939.7G63992310N81085P94769O35147M82261J26958n77033j330972j902699k048194
1958.1G60753632j242578L58820J561582J711964J334727R93311O17207J83999M5121
$$ y = [759698093, 761729717, 763301790, 764172733, 764443934, 764475226, 764398634, 764251173, 764246106, 764440179, 764600098, 764684021, 764884472, 765218973, 765459180, 765716553, 766157031, 766555846, 766694188, 766747594, 766821265, 766726911, 766510427, 766389072, 766218841, 765760303, 765262187, 764893949, 764411926, 763680995, 762926996, 762232065, 761412859, 760547161, 759889483, 759442925, 759133041, 759114563, 759469032, 759984374, 760504901, 761007905, 761261582, 761000097, 760395944, 759845436, 759457231, 759229183, 759468377, 760417938, 761796892, 763299048, 764772832, 765921652, 766445279, 766359389, 765836298, 764979541, 764161050, 763992310, 764573395, 765368164, 766003311, 766485572, 766612530, 766035497, 764704525, 762801826, 760753632, 759511054, 759869874, 761431456, 763143420, 764478147, 765471458, 766088665, 766272664, 766317785]
1976.4G66317785J26600K444j45972K8014K00928P0035r239J12832M4763j62482p7606
1998.8G66508102J20700J4365j43588p9155r2864l15607l77893k69353l68834n48303
2019.2G64447570m53234l29614m86373n98610m87566n50628q37028q72790o74367o45101
2039.6G58512259o72222n22196m82857o77049p12455n80608o32585p62820o81102o38008
2060G52150357q82983j068056j018882j075268j285672j274943j071930r96828q83043
2078.4G42592752m43995P75J68621L61324O77645P26402M41134J93774k7895m39703
2098.8G44250834p72059p35462o05285n45561k77341J18494K33233J89245L29733M13120
2119.2G42598951J88231k8908l2127j35064l85344m11272k91348l66389m69625l54886
$$ y = [766317785, 766444385, 766446829, 766300857, 766328871, 766529799, 766599834, 766590595, 766703427, 766748190, 766585708, 766508102, 766628802, 766643167, 766499579, 766420424, 766327560, 766011953, 765634060, 765364707, 764995873, 764447570, 763994336, 763664722, 763178349, 762579739, 762092173, 761541545, 760704517, 759831727, 759157360, 758512259, 757840037, 757317841, 756834984, 756157935, 755445480, 754864872, 754232287, 753469467, 752788365, 752150357, 751267374, 750199318, 749180436, 748105168, 746819496, 745544553, 744472623, 743475795, 742592752, 742148757, 742149532, 742318153, 742679477, 743357122, 744083524, 744524658, 744718432, 744690537, 744250834, 743478775, 742743313, 742138028, 741592467, 741315126, 741433620, 741666853, 741856098, 742185831, 742598951, 742787182, 742758274, 742726147, 742591083, 742205739, 741794467, 741503119, 741136730, 740667105, 740312219]
2139.6G40312219l27230n62429o79434n82218o38604q12530q04186p76351r64343j075209
2160G33089685q72671o79314o00398l27825L6239Q0347m4346J1206M8757j02043j68562
2182.4G30471075r1613j77502l97742m68672m54604n43952n65648m05073l74318n50568
2202.8G26441383n79357m46379m74215n63144m68374m29451o43730p81119o95705o97732
2223.2G20662177q04186p48039o32405p17997q47280q27134q34644r26614q49962n91934
2243.6G12881982m21345l20971j06633M3393j10329l50654m72843o59287q93712q80123
2264G08709478o67035n89669o71148o98507p19547q15094q28624p48813p96675r69172
2284.4G01205194j041949j042306j150131j278818j264095j183629j089454q63314
$$ y = [740312219, 739984989, 739422560, 738743126, 738160908, 737522304, 736709774, 735905588, 735129237, 734164894, 733089685, 732217014, 731537700, 730937302, 730609477, 730645716, 730726063, 730681717, 730692923, 730741680, 730639637, 730471075, 730379462, 730201960, 729804218, 729335546, 728880942, 728336990, 727771342, 727366269, 726991951, 726441383, 725862026, 725415647, 724941432, 724378288, 723909914, 723480463, 722836733, 722055614, 721359909, 720662177, 719857991, 719109952, 718477547, 717759550, 716912270, 716085136, 715250492, 714323878, 713473916, 712881982, 712460637, 712139666, 712033033, 712076426, 711966097, 711615443, 711142600, 710483313, 709589601, 708709478, 708042443, 707452774, 706781626, 706083119, 705363572, 704548478, 703719854, 702971041, 702174366, 701205194, 700163245, 699120939, 697970808, 696691990, 695427895, 694244266, 693154812, 692291498]
2300.7F92291498o14285n94557o53088n43058m81844o57677q60811j014828j243353
2319.1F85627997j447916j450896j348555j391530j476288j262784r42409q54731p56264
2337.4F74696624n60581n11349m14729L9697K20597m95196j569807k186418k143323
2355.8F67075515j871288j493931j104951q48412o50168m72247m45068n55694n77152
2374.1F59056604m55141l94046m97163o32167p56681r73343j172126j211881j229704
2392.5F51734352j302481j260638j115322j102030j186908j182854j196384j340270
2408.8F42047465j414478j348078j326800j332938j207531j056552j034558j043200
2425.1F32283330r84490r79722j113474j219749j244784j340747j488149j552462j583159
$$ y = [692291498, 691677213, 691082656, 690429568, 689886510, 689404666, 688746989, 687886178, 686871350, 685627997, 684180081, 682729185, 681380630, 679989100, 678512812, 677250028, 676307619, 675452888, 674696624, 674136043, 673624694, 673209965, 673249662, 673470259, 672975063, 671405256, 669218838, 667075515, 665204227, 663710296, 662605345, 661756933, 661106765, 660634518, 660189450, 659633756, 659056604, 658601463, 658207417, 657710254, 657078087, 656321406, 655348063, 654175937, 652964056, 651734352, 650431871, 649171233, 648055911, 646953881, 645766973, 644584119, 643387735, 642047465, 640632987, 639284909, 637958109, 636625171, 635417640, 634361088, 633326530, 632283330, 631298840, 630319118, 629205644, 627985895, 626741111, 625400364, 623912215, 622359753, 620776594]
2443.5F20776594j658440j699150j708149j850188k106190k229571k188683k148986
2459.8F05187237k076089j870930j705528j703560j648366j459837j355291j369476
2476.1E91998160j370192j457333j719713j950920j982212j923919j877010j748621
2492.4E77968240j546502j424671j370668j323819j428604j738429k042890k224922
2508.7E64867735k384245k573610k721250k809584k920389l037513l073036l081501
2525.1E42266607l108978l070354k977312k947807k925992k804995k671778k583981
2541.4E19175410k381623j977443j482308q78096m5418R30666J841188K626657L308654
2559.7E21117687L832340M179478M443169M664898M750728M639030M368484L970802
$$ y = [620776594, 619118154, 617419004, 615710855, 613860667, 611754477, 609524906, 607336223, 605187237, 603111148, 601240218, 599534690, 597831130, 596182764, 594722927, 593367636, 591998160, 590627968, 589170635, 587450922, 585500002, 583517790, 581593871, 579716861, 577968240, 576421738, 574997067, 573626399, 572302580, 570873976, 569135547, 567092657, 564867735, 562483490, 559909880, 557188630, 554379046, 551458657, 548421144, 545348108, 542266607, 539157629, 536087275, 533109963, 530162156, 527236164, 524431169, 521759391, 519175410, 516793787, 514816344, 513334036, 512455940, 512410522, 513341188, 515182376, 517809033, 521117687, 524950027, 529129505, 533572674, 538237572, 542988300, 547627330, 551995814, 555966616]
2576E55966616L386736K589404J669824O76453l45289j231790j854896k182901k128184
2594.4E56545973j638711q60095N7280J001299J728356K000749J826703J417101Q70108
2612.8E62948763J77384m81189r59694j337588j596391j626432j523197j450240j413047
2631.1E52738369j370550j379132j494527j604438j610815j593948j567661j436353
2647.4E40680945j255334j182198j209974j241744j271665j313031j295507j175999
2663.7E30735493r96828p17163k43009M04180J133263J932621K779185L527701M099191
2682.1E42654634M524111M782021M795552M602372M319728L973782L560424L135979
2698.4E76348603K726257K212047J463354N78761k75672j100421j814424k178491k152025
$$ y = [555966616, 559353352, 561942756, 563612580, 564289033, 563943744, 562711954, 560857058, 558674157, 556545973, 554907262, 554047167, 554104447, 555105746, 556834102, 558834851, 560661554, 562078655, 562948763, 563126147, 562644958, 561685264, 560347676, 558751285, 557124853, 555601656, 554151416, 552738369, 551367819, 549988687, 548494160, 546889722, 545278907, 543684959, 542117298, 540680945, 539425611, 538243413, 537033439, 535791695, 534520030, 533206999, 531911492, 530735493, 529738665, 529021502, 528778493, 529182673, 530315936, 532248557, 535027742, 538555443, 542654634, 547178745, 551960766, 556756318, 561358690, 565678418, 569652200, 573212624, 576348603, 579074860, 581286907, 582750261, 583329022, 583053350, 581952929, 580138505, 577960014, 575807989]
2716.8E75807989j884997j393855o94394L3915O54340J178264J648546J982510K056360
2735.1E79388678J849175J363158N92887k98321j109779j820803k406537k798379l015458
2753.5E71744621l105581l023922k735138k357424k051472j844526j739204j810014
2769.8E53077340k040624k330840k636850k931535l102422l055692k844393k597153
2786.1E31537831k361477k111673j882017j721322j606763j505136j437306j372397
2802.4E17539740j289189j274467j338362j390398j398325j361549j248240j073540
2818.8E07165670q77618o46711l45826m172K88069M53472N30481O32763P66874R27746
2839.1E08890748J127362J259804J262784J234353J281678J368463J449943J560628
$$ y = [575807989, 573922992, 572529137, 571834743, 571868658, 572522998, 573701262, 575349808, 577332318, 579388678, 581237853, 582601011, 583193898, 582895577, 581785798, 579964995, 577558458, 574760079, 571744621, 568639040, 565615118, 562879980, 560522556, 558471084, 556626558, 554887354, 553077340, 551036716, 548705876, 546069026, 543137491, 540035069, 536979377, 534134984, 531537831, 529176354, 527064681, 525182664, 523461342, 521854579, 520349443, 518912137, 517539740, 516250551, 514976084, 513637722, 512247324, 510848999, 509487450, 508239210, 507165670, 506288052, 505641341, 505295515, 505291343, 505579412, 506032884, 506563365, 507196128, 507963002, 508890748, 510018110, 511277914, 512540698, 513775051, 515056729, 516425192, 517875135, 519435763]
2855.5E19435763J601875J461685J185417Q00610L16381j58429m58896n53608o00755
2873.8E23030043o72698o62625n53668m44591l45886k30610j04070P2420L25918N97298
2894.2E21011531P90358Q85010R63747J086831J164794J070321Q04126M26769n7280
2912.6E28146207o15894j105965j456976j698255j859665j956582j832187j265466
2928.9E16355217m24505K39253N08249M76301L73065L40760L28124K61545J03950q4102
2949.3E18477857j81556k62260l84629m47213m45068m63725n73039o91950p49528q32260
2969.7E13446629q91149q28803p22229n76615l13580l2366J25826J27852K5272r6858
2990.1E10263979k15709l10838l08812j77800M4286L50654P24971J032472J115978
$$ y = [519435763, 521037638, 522499323, 523684740, 524485350, 524801731, 524643302, 524184406, 523630798, 523030043, 522357345, 521694720, 521141052, 520696461, 520350575, 520119965, 520015895, 520088315, 520414233, 521011531, 521801889, 522686899, 523650646, 524737477, 525902271, 526972592, 527776718, 528203487, 528146207, 527530313, 526424348, 524967372, 523269117, 521409452, 519452870, 517620683, 516355217, 515930712, 516169965, 516678214, 517154515, 517527580, 517868340, 518196464, 518458009, 518561959, 518477857, 518296301, 518034041, 517649412, 517202199, 516757131, 516293406, 515720367, 515028417, 514278889, 513446629, 512555480, 511726677, 511004448, 510427833, 510114253, 510081887, 510207713, 510335565, 510360837, 510263979, 510048270, 509737432, 509428620, 509250820, 509295106, 509645760, 510370731, 511403203, 512519181]
3008.4E12519181R72330O87719K83539j80006n74946r05335j199305j359880j334548
3026.8E08908749j132071p13110m0293P96437J513243J847982J798749J403630P35700
3045.1E15119016L30210R80616K639949M062056M329861L769099K995968K293050J659632
3063.5E38179457Q63195j95921j338303k285480k444566j187145J021146K622724K615988
3081.9E37851095J483619L84510J69754R48250K041400K575159K220630J220406m9174
3100.2E48845649j219809j807273j459539l65972R46462K128601K967417L257156L091335
3118.6E56384027K799690K605140K598166K747179K880334K814412K619446K563000
3134.9E78011394K696037K757788K574205K336442K157212J875579J551926J259506
$$ y = [512519181, 513491511, 514179230, 514462769, 514282763, 513707817, 512802482, 511603177, 510243297, 508908749, 507776678, 507063568, 507023275, 507819712, 509332955, 511180937, 512979686, 514383316, 515119016, 515449226, 516429842, 519069791, 523131847, 527461708, 531230807, 534226775, 536519825, 538179457, 539042652, 538846731, 537508428, 535222948, 532778382, 531591237, 532612383, 535235107, 537851095, 539334714, 539719224, 539888978, 540837228, 542878628, 545453787, 547674417, 548894823, 548845649, 547625840, 545818567, 544359028, 543993056, 544939518, 547068119, 550035536, 553292692, 556384027, 559183717, 561788857, 564387023, 567134202, 570014536, 572828948, 575448394, 578011394, 580707431, 583465219, 586039424, 588375866, 590533078, 592408657, 593960583, 595220089]
3151.2E95220089P90060K62975j8060k31206n84245j010060j495660k083778k798677
3169.6E88051438l625393m460811n133212n274415m436493k735853r29296K65420O33835
3187.9E62355220L57747j58786l84331n4240P29501J659512K284110K262354J654208
3206.3E70705295Q39591J71303k13444l13997k65122l76284q35001j513064k194464
3224.6E66004813k807558l390550l918708m386544m930675n540907o063819o547034
3240.9E28419018p093907p659375q210004q747786r143978r296745r195626q814156
3257.3D60257441q200735p502198o931007o657392o681889o865531p034809p015318
3273.6D03368562o762653o494761o561070p221103q459926r923577j1120230j1740446
$$ y = [595220089, 596010149, 596273124, 596255064, 596023858, 595439613, 594429553, 592933893, 590850115, 588051438, 584426045, 579965234, 574832022, 569557607, 565121114, 562385261, 561455965, 561721385, 562355220, 562712967, 562554181, 562169850, 562115610, 562845111, 564504623, 566788733, 569051087, 570705295, 571544886, 571716189, 571502745, 571188748, 570923626, 570547342, 569712341, 568199277, 566004813, 563197255, 559806705, 555887997, 551501453, 546570778, 541029871, 534966052, 528419018, 521325111, 513665736, 505455732, 496707946, 487563968, 478267223, 469071597, 460257441, 452056706, 444554508, 437623501, 430966109, 424284220, 417418689, 410383880, 403368562, 396605909, 390111148, 383550078, 376328975, 367869049, 357945472, 346825242, 335084796]
3289.9C35084796j1823714j1648744j1434734j1081904j0168970q280873n304873j529843
3306.2B63811141K651900O919802J0878384J4201462J6751945J8517941J9472987J9623667
3322.5C72829229J9159734J8335253J7237037J5968532J4764815J3725758J2776226
3336.8D84796584J1820376J0795176R686887Q516252P258415O009162N018830M253924
3353.1E48155606L465593K658665J965165J413286R52184N27501J86145l576p4983
3371.5E59245586j71601l62516n34653o17445o45578o89089p88212q84175r38118r17554
3391.9E52696645q53061q84951j031577j108289j009941r31442r86337j048983j045704
3410.2E43796360j031100j020909r41455q54135q43942p91490o27577m71771l82602
$$ y = [335084796, 323261082, 311612338, 300177604, 289095700, 278926730, 270645857, 265340984, 263811141, 266463041, 273382843, 284261227, 298462689, 315214634, 333732575, 353205562, 372829229, 391988963, 410324216, 427561253, 443529785, 458294600, 472020358, 484796584, 496616960, 507412136, 517099023, 525615275, 532873690, 538882852, 543901682, 548155606, 551621199, 554279864, 556245029, 557658315, 558610499, 559138000, 559324145, 559320569, 559245586, 559073985, 558711469, 558176816, 557559371, 556913793, 556224704, 555436492, 554552317, 553614199, 552696645, 551843584, 550958633, 549927056, 548818767, 547808826, 546877384, 545891047, 544842064, 543796360, 542765260, 541744351, 540802896, 539948761, 539104819, 538313329, 537685752, 537213981, 536831379]
3428.6E36831379l33130k41220j12296o7949k9027J18494K72333L86596N02586N53608
3449E37881374N52416O35863P88390Q83579R45747R87470J033128J151979J201629
3467.3E46061575J042545Q54075R06229J082957J169980J122415J016378J032412J127660
3485.7E55416226J122296J063347J069665J136601J210690J215100J225650J255155
3502E64714730J164794J080632J147151J262546J389086J447558J359761J279950J312077
3520.4E76158285J385570J299143J136899J108586J079500J067638J284838J537442
3536.7E86057901J639188J872658K165258K134920J804351J572967J579761J625836
3553F00452840J682222J787842J864552J852274J804709J832486J940548J947165J890063
$$ y = [536831379, 536498249, 536257029, 536144733, 536076784, 536047757, 536166251, 536438584, 536825180, 537327766, 537881374, 538433790, 539069653, 539858043, 540741622, 541687369, 542674839, 543707967, 544859946, 546061575, 547104120, 547958195, 548864424, 549947381, 551117361, 552239776, 553256154, 554288566, 555416226, 556538522, 557601869, 558671534, 559808135, 561018825, 562233925, 563459575, 564714730, 565879524, 566960156, 568107307, 569369853, 570758939, 572206497, 573566258, 574846208, 576158285, 577543855, 578842998, 579979897, 581088483, 582167983, 583235621, 584520459, 586057901, 587697089, 589569747, 591735005, 593869925, 595674276, 597247243, 598827004, 600452840, 602135062, 603922904, 605787456, 607639730, 609444439, 611276925, 613217473, 615164638, 617054701]
3571.3F17054701J944125K066671K176345K256155K295196K339780K356649K306223
3587.7F34795845K274334K258539K308250K390921K405107K396464K406001K352953
3604F53588414K232909K234161K264500K160072K067387J997292J959742J936852J751364
3622.3F72192693J557410J438021J488030J681924J562893J365722J262307J173079
3638.7F83722079J092613J011967R73523R37283R22799R08971P22706N40137O30141
3657F91462219P62045N79715L05355K24947J86027M8041O3300j0729l92854m17709
3677.4F92810357r1434J65939M01199N61118O32406N41687L46899K51114J88053P4386
3697.8F95881724q7499k12908j55985j1862M4525J9014N3882J45853L4392j49608j87158
$$ y = [617054701, 618998826, 621065497, 623241842, 625497997, 627793193, 630132973, 632489622, 634795845, 637070179, 639328718, 641636968, 644027889, 646432996, 648829460, 651235461, 653588414, 655821323, 658055484, 660319984, 662480056, 664547443, 666544735, 668504477, 670441329, 672192693, 673750103, 675188124, 676676154, 678358078, 679920971, 681286693, 682549000, 683722079, 684814692, 685826659, 686800182, 687737465, 688660264, 689569235, 690291941, 690832078, 691462219, 692224264, 692803979, 693109334, 693334281, 693520308, 693568349, 693631649, 693620920, 693228066, 692810357, 692718923, 692884862, 693286061, 693847179, 694479585, 695021272, 695368171, 695619285, 695807338, 695881724, 695794225, 695581317, 695425332, 695413470, 695457995, 695477009, 695530891, 695676744, 695711136, 695561528, 695374370]
3720.2F95374370j49370j67787j82628r9957o3122o2585o3359j61946j66416j14739
3740.6F94142461l02971n12898k94089j96457k96294j07527P0631j6927j74821j29282
3761F92181826l219n1141j47760j69456j35481j47522j84774j30117q9347j62244k90394
3783.5F90670371l24130k22504j47581j27852j57118k34544k58506l42488l68595j56224
3803.9F88330829k14934l09766j15096m4942j97828l14355k19464l17335l78966j92523
3824.3F86025620k08140k14338j58727j60516j80483l72052m86850j97351n2333j77145
3844.6F83817685k21372j64986k72870p13885n69403N9247L8624k03311l10779k12908
3865F81246042r6023k72155l80754k68102k16901j65105k31087k43426r7870j17004
$$ y = [695374370, 695225000, 695057213, 694874585, 694774628, 694711506, 694648921, 694585562, 694423616, 694257200, 694142461, 693839490, 693326592, 693032503, 692836046, 692539752, 692432225, 692502856, 692485929, 692311108, 692181826, 692178607, 692127466, 691979706, 691810250, 691674769, 691527247, 691342473, 691212356, 691123009, 690960765, 690670371, 690346241, 690123737, 689976156, 689848304, 689691186, 689456642, 689198136, 688855648, 688487053, 688330829, 688115895, 687806129, 687691033, 687646091, 687448263, 687133908, 686914444, 686597109, 686218143, 686025620, 685817480, 685603142, 685444415, 685283899, 685103416, 684731364, 684244514, 684047163, 683994830, 683817685, 683596313, 683431327, 683158457, 682444572, 681875169, 681934416, 681973040, 681769729, 681458950, 681246042, 681150019, 680877864, 680497110, 680229008, 680012107, 679847002, 679615915, 679372489, 679274619, 679157615]
3885.4F79157615j66893k47300l84688k44379o140n6207k71380l91543m06623l30984
3905.8F76651478k13862j89960k04503j76609j96874k64883k46108k04384k31445k53677
3926.2F74469173k45392k26558j91390k03133k85923l01540k56002k38478j69695p7247
3946.6F72273815n8532j23978k15888k49922k13563j42515j12832j81496k46525k13563
3967F70515001j52171j14858j00255j16348j51813k08021k38358k14339k43306l06964
3987.4F68668568k69532j85013j96695k84374l02613
3997.6F67430341
$$ y = [679157615, 678990722, 678743422, 678358734, 678114355, 678108215, 678052008, 677780628, 677389085, 676982462, 676651478, 676437616, 676247656, 676043153, 675866544, 675669670, 675404787, 675158679, 674954295, 674722850, 674469173, 674223781, 673997223, 673805833, 673602700, 673316777, 673015237, 672759235, 672520757, 672351062, 672273815, 672215283, 672091305, 671875417, 671625495, 671411932, 671269417, 671156585, 670975089, 670728564, 670515001, 670362830, 670247972, 670147717, 670031369, 669879556, 669671535, 669433177, 669218838, 668975532, 668668568, 668399036, 668214023, 668017328, 667732954, 667430341]
##END=$$ End of the data block
