##TITLE=Diogo 01 $$ Begin of the data block
##JCAMP-DX=5.00 $$ ACD/SpecManager v 10.08
##SPECTROMETER/DATA SYSTEM=Alpha
##DATE=04 Sep 2014 08:34:00
##DATA TYPE=INFRARED SPECTRUM
##DATA CLASS=XYDATA
##ORIGIN=
##OWNER=
##NPOINTS=1765
##FIRSTX=399.76428223
##LASTX=3997.64306641
##MAXX=3997.64306641
##MINX=399.76428223
##MAXY=0.86862093
##MINY=0.37049064
##XFACTOR=1.0000000000
##YFACTOR=1.000000000000000e-9
##FIRSTY=0.84212744
##DELTAX=2.03961372
##XUNITS=1/CM
##YUNITS=ARBITRARY UNITS
##XYDATA=(X++(Y..Y))
399.8H42127442O265641K528727J614511K23994k291203q16524K443254J430810j116812
418.1H52409840K95877J340628p40588r54032P98941K08735j476407n41687R19819
436.5H52261126j29402j085698l994O8665j065374k75790Q15034m08233j452684l10123
456.9H48413527N03838o13391r70424R478l84808j340330n72383K13802o87540j094877
477.3H43476892k14100m57883j710654j651883j184582k361298l761649m224897o004095
495.6H21905851j1167049k0992160l8315534m6855629k8341830j4744580j9947886
509.9F41541183M333675N4639101O9920361M4718027J8614888P054329L186107J280129
526.2H45287800l39568q55028n50926m24922j60753P94708J583040J342416O05047
$$ plain form
399.8 842127442 848393083 850921810 852536321 852760315 850469112 849652588 852095842 853526652 852409840
418.1 852409840 852705717 854046345 853305757 852351725 853150666 853359401 851882994 851341307 852261126
436.5 852261126 852131724 851046026 851042032 851110697 850045323 849769533 850584567 850176334 848723650 848413527
456.9 848413527 848917365 848303974 847333550 847343028 846958220 845617890 845045507 845259309 844571769 843476892
477.3 843476892 843262792 842804909 841094255 839442372 838257790 835896492 832134843 827909946 821905851
495.6 821905851 810738802 789746642 751431108 704575479 676233649 661489069 641541183
509.9 641541183 645874858 700513959 770434320 815152347 833767235 840821564 844007671 845287800
526.2 845287800 844948232 844093204 843542278 843117356 842956603 843751311 845334351 846676767 847281814
544.6H47281814K31623J40846j31309k72751j69277j93298l99589l37124l2246l0101
565H46088588l64601m53711j0848J59204k02179k97069q9527k55525n51283m81248
585.4H43541801m52042j081884j896798k051175k173841l577947p592678j5811921
601.7H08903515k3505985j4519334J1109113K5424540J7628670M009784o452859j2192130
618H10405314n062163J1179328J7680585J1452318M506707J472354P80105N33224j67430
636.4H52780342p31945j059353k256751k959609l24309L231942L351510J312673M30644
654.7H53775144M29451J8299k45512J91450O7592j523316j651287Q17597P43210n57065
675.1H52065563p05838k17140n10871r19700m43518j63615q06391j172543p69794p84635
$$ plain form
544.6 847281814 847513437 847654283 847522974 847250223 847080946 846887648 846488059 846150935 846118689 846088588
565 846088588 845723987 845270276 845259428 845418632 845216453 844919384 844829857 844574332 844023049 843541801
585.4 843541801 843089759 842007875 840111077 838059902 835886061 832308114 824715436 808903515
601.7 808903515 785397530 770878196 781987309 807411849 825040519 829050303 822597444 810405314
618 810405314 805343151 816522479 834203064 845655382 850162089 851634443 852414548 852947772 852780342
636.4 852780342 852048397 850989044 848732293 845772684 845448375 848680317 852031827 853344500 853775144
654.7 853775144 854204595 854222894 853977382 854168832 854236424 852713108 851061821 851879418 852622628 852065563
675.1 852065563 851359725 851142585 850631714 849712014 849268496 849104881 848298490 847125947 846356153 845571518
695.5H45571518j497984j791000j885772k763987k662956n02289N29230q82566k100289
713.9H32013905j946330k040505l026188l344655k874434l270864m279793m494190
730.2H06736946m527569n718231p272482q118748r241522j1203050j2455523j2036622
746.5G36163199j0985851r486318o369889j949847K064288N522847R240985J2026549
762.8G36225963J2097954R006143L076911J212716J1399627K2253990J9971490J1329234
779.1H26574028N634963L582478K912461J588703K52783K64048N43118j93238r62854
797.5H40196490j318931k960146o370544r611070j2712539j8647253k9958606m8045993
813.8G10571408o8911850p4011505m6796322l1709L9560735N7697952N6398749M8427463
$$ plain form
695.5 845571518 844073534 842282534 840396762 837632775 834969819 834467530 834996760 834114194 832013905
713.9 832013905 830067575 828027070 825000882 821656227 818781793 815510929 811231136 806736946
730.2 806736946 802209377 796491146 789218664 781099916 771858394 760655344 748199821 736163199
746.5 736163199 725177348 715691030 709321141 707371294 709435582 714958429 724199414 736225963
762.8 736225963 748323917 757330060 760406971 761619687 773019314 795273304 815244794 826574028
779.1 826574028 832208991 835791469 838703930 840292633 840545416 840809464 841352582 841159344 840196490
797.5 840196490 838877559 835917413 829546869 819935799 807223260 788576007 758617401 710571408
813.8 710571408 641659558 567648053 520851731 520820022 560380757 618078709 674477458 722904921
830.1G22904921M0981590L0898750J8815518J0923445Q452713O984234M363537J125932
846.4H45450640k507925m367233j566112L853560O738603O180227M590451K755404
862.8H61127615J079321O83367R84967N55456k0445L22402O76930K33531J45137Q23379
883.2H66611660Q93354J76549K7716M04835J49250m28021k52664K19524k3365l80814
903.5H67398024m3214K65241j42455l94106o974J4126o17265q61705n97953p38144
923.9H64275575j052559q35120q20876k447187o231308j0162652p128775L921926J0238886
942.3H49757910O688475J353324j706839l324389m255116m881680n243123n783558
958.6H32605004n141318l030419q05497M172087R180545P652164L111482O53624n73098
$$ plain form
830.1 722904921 763886511 794785261 813600779 824524224 832976937 839961171 844324708 845450640
846.4 845450640 842942715 838575482 837009370 840862930 847601533 853781760 858372211 861127615
862.8 861127615 862206936 862890303 863875270 864430726 864410281 864732683 865409613 865643144 865788281 866611660
883.2 866611660 867505014 867681563 867709279 868114114 868263364 867835343 867582679 867802203 867778838 867398024
903.5 867398024 867354810 867620051 867477596 867083490 867076516 867090642 866473377 865611672 865013719 864275575
923.9 864275575 863223016 862387896 861567020 859119833 852888525 842725873 835597098 839519024 849757910
942.3 849757910 856446385 857799709 856092870 852768481 848513365 843631685 838388562 832605004
958.6 832605004 827463686 824433267 823627770 827799857 836980402 844632566 847744048 848397672 847824574
977H47824574j929403l049970m082500o368876r605169r970486l718913N189598Q684933
995.3H22973788N875766J362085k507448n248070p196784j0244786j5215814j8061579
1011.6G71737158j1308551N228818J6699374J1107921L411711P721304J0783136N427420
1028H20808291o14225o123066j2951374j9968749k2543668j3140977P025004K2919357
1044.3G75410593K4298548J6939044J0033489O048381L473520J750589J210093J122892
1060.6H40287149N43773J9670J51813J72674l39865n05507p2480o8843n06759m10497
1081H39271128k7478k56359o17504l50774q3983n02824r42469q25942r49502j632452
1101.4H33081841j978874k155304l780961p417083j0382354p092654J709342O077945
$$ plain form
977 847824574 845895171 842845201 838762701 832393825 822788656 812818170 809099257 814288855 822973788
995.3 822973788 828849554 830211639 827704191 822456121 815259337 805014551 789798737 771737158
1011.6 771737158 760428607 765657425 782356799 793464720 796876431 804597735 815380871 820808291
1028 820808291 820194066 814071000 801119626 781150877 758607209 745466232 752491236 775410593
1044.3 775410593 799709141 816648185 826681674 832730055 836203575 837954164 839164257 840287149
1060.6 840287149 840830922 840850592 841002405 841175079 840835214 840329707 840257227 840188384 839681625 839271128
1081 839271128 839243650 838987291 838369787 838019013 837935030 837432206 836489737 835663795 834714293 833081841
1101.4 833081841 831102967 828947663 825166702 817749619 807367265 800274611 801983953 808061898
1117.7H08061898L015280o74844m29392L677428P400393O506920L067315J047909O34551
1136.1H32307458K23875l52800l05831n0545l31044n85854k31386j7702m57823p21991
1156.5H29476357m63486m76659q81254q59022m98057n81026r69469j174272j984894
1174.8H21588218m937053q858382o617546L681063R884060O619751K141178K06709
1191.1H23707998p23779r54509q90494j334011k038062k619922l974557o100476n147278
1209.5G99924910K82347L655196K211570P18951M49539o17743k445400l973662m317403
1227.9G95888305k602876J98782J266360j52290k195596l320694l537774l605545l729820
1246.2G78208852l616691l749430n165100q108556j2535215j9157231k7675092l0903756
$$ plain form
1117.7 808061898 811077178 810402334 809972942 813650370 821050763 827557683 830624998 831672907 832307458
1136.1 832307458 832531333 832178533 831872702 831822157 831491113 830905259 830673873 830656171 830198348 829476357
1156.5 829476357 829012871 828536212 827654958 826795936 826297879 825716853 824747384 823573112 821588218
1174.8 821588218 816651165 807792783 801175237 804856300 814740360 821360111 823501289 823707998
1191.1 823707998 822984219 822029710 821139216 819805205 817767143 815147221 811172664 805072188 799924910
1209.5 799924910 800207257 803862453 806074023 806792974 807242513 806624770 804179370 800205708 795888305
1227.9 795888305 793285429 793484211 794750571 794598281 792402685 789081991 785544217 781938672 778208852
1246.2 778208852 774592161 770842731 765677631 757569075 745033860 725876629 698201537 667297781
1262.5F67297781j3759733K3746491N0626576M4996857K3304105P223070j29640l050387
1278.8H00255120m345417n200923n782842o199241o921291p619620p317066o636083
1295.2G50232637p574737j0034382j0922909o283999M67062k417862j6038120k9423952
1311.5F68003738l8806021m5923591m6933412l7176610j5864074K0962894O4742506
1325.8E69005430Q4937036P0715070M2906642K0553350P422328N16474l353178o117940
1342.1G86585212q197487r208500r378850j0067881j1272251j2221515j3992846j9772232
1358.4F92473650l1332314m0910542k7004659J1884510M4393719M5954644K4250865
1372.7G19709873l923595k3952603j3306081J8274188K9746592J5670955J020133o782472
$$ plain form
1262.5 667297781 653538048 677284539 727911115 772907972 796212077 803435147 803305507 800255120
1278.8 800255120 795909703 790708780 784925938 778726697 771805406 764185786 756868720 750232637
1295.2 750232637 742657900 732623518 721700609 715416610 715883672 713465810 697427690 668003738
1311.5 668003738 629197717 583274126 536340714 499164104 483300030 504262924 569005430
1325.8 569005430 653942466 724657536 767564178 788117528 795539856 796056330 792703152 786585212
1342.1 786585212 778387725 769179225 759800375 749732494 738460243 726238728 712245882 692473650
1358.4 692473650 661141336 620230794 593226135 605110645 649504364 695459008 719709873
1372.7 719709873 715786278 691833675 678527594 696801782 726548374 742219329 743239462 736456990
1389G36456990j1837423j8426716k7478635l7674725m9574912m1376829P815361O6921651
1405.3F24824762P9446555M9333989J9855499L706932l491401p277131r769917j0114372
1421.6G46514916j1316955j3683259j4618874j4214933j1966645j0647357j4438748
1435.9F55628145j8536032j5151202q733750l125190k045393p410705j5115381j8533885
1452.2E66976607j2324989R361267L9486647M3624460L2455683K1562696J0564267
1466.5G11706638K474547k357066n649507n646408l741800l437698m696608o069600
1482.8F82582498o862224p977068r082377q729219p577598q882165j2355507j4721393
1499.1F06394947j6691685j9766927k8659403l9431691k6903212m625321J6323745
$$ plain form
1389 736456990 724619567 706192851 678714216 641039491 591464579 550087750 557903111 624824762
1405.3 624824762 704271317 753605306 773460805 777167737 773676336 766399205 756629288 746514916
1421.6 746514916 735197961 721514702 706895828 692680895 680714250 670066893 655628145
1435.9 655628145 637092113 621940911 613207161 610081971 608036578 600625873 585510492 566976607
1452.2 566976607 554651618 564012885 603499532 647123992 679579675 701142371 711706638
1466.5 711706638 714181185 711824119 706174612 700528204 696786404 693348706 688652098 682582498
1482.8 682582498 675720274 667743206 658660829 649931610 642354012 633471847 621116340 606394947
1499.1 606394947 589703262 569936335 541276932 501845241 474942029 470316708 486640453
1513.4D86640453L4987867M0599704K9123545J4821529L795028m278302q643806q768142
1529.7E88277876p526457n677521k543330j469672m000723q746028j5708387k4381578
1546E18224180k8676659k2698581j923502K3872227L8915693N1423133N5162728L3797443
1562.4F68096662K4169862K2884667K1095752J8229485J0786176K817571l584445q024454
1578.7G56471276j1883497j6614973k0634294k4034798k6887536k8721512k9962062
1593E97732604l1106949l0549169k6378333j8443794q660435j155049R69440K91347
1609.3D82699662M298956J5605867L1663775M2302728L1028866J4860750N197286O78122
1625.6F28336012J62840p74979m188478r585917j5788079j6015172j3607680j3067067
$$ plain form
1513.4 486640453 521628320 562228024 591351569 606173098 609968126 605689824 597046018 588277876
1529.7 588277876 580751419 575073898 572530568 571060896 567060173 558314145 542605758 518224180
1546 518224180 489547521 466848940 464925438 488797665 527713358 579136491 634299219 668096662
1562.4 668096662 692266524 715151191 736246943 754476428 765262604 768080175 764495730 756471276
1578.7 756471276 744587779 727972806 707338512 683303714 656416178 627694666 597732604
1593 597732604 566625655 536076486 509698153 491254359 482593924 481438875 482408315 482699662
1609.3 482699662 486998618 502604485 534268260 576570988 607599854 622460604 627657890 628336012
1625.6 628336012 628498852 627723873 623535395 613949478 598161399 582146227 568538547 555471480
1641.9E55471480j1084020q232594n572498n990564j7445147l7858040l8008153l2500446
1658.2C98780018k4003684m285694J6032935K6692122L8569480N1487058M7987223
1672.5E51259458M1589439L7134051K8161466K1568120J9954860K2370458J9075453
1686.8G41113305J3589978J1909128J0014832Q781910Q208334P450759Q012832O766557
1703.1H15847635M861594M548072L729165K431393J707732J635433K300143L164947
1719.4H40226114K936244J827717P68840K9027o7114j35303J97232K044856K954185
1737.8H50781798K688170K296030J907230J425266P75099M53353J033902R94086Q404
1756.1H62363338n09440l10600J36912N04195M20690L35693K99812L99887J186609
$$ plain form
1641.9 555471480 544387460 536154866 530582368 524591804 507146657 469288617 431280464 398780018
1658.2 398780018 374776334 370490640 386523575 413215697 451785177 503272235 551259458
1672.5 551259458 592848897 629982948 658144414 679712534 699667394 722037852 741113305
1686.8 741113305 754703283 766612411 776627243 785409153 793617487 801068246 809081078 815847635
1703.1 815847635 820709229 825257301 828986466 831417859 833125591 834761024 837061167 840226114
1719.4 840226114 843162358 844990075 845758915 845787942 845720828 845585525 845782757 847827613 850781798
1737.8 850781798 853469968 855765998 857673228 859098494 859873593 860326946 861360848 862354934 862363338
1756.1 862363338 861853898 861543298 861680210 862184405 862605095 862940788 863240600 863640487 864827096
1774.5H64827096J297415M12822l59774m02629l52204o59049j213193j646817p87735
1792.8H61115932P63715J296341J199365J158118J066089Q89063O69300K70248l875
1811.2H68424296J08302Q8334l77834p06017o10709l51369m8638J61886L20912O46591
1831.6H67655754N06938M9591L7968J430n12302o50704K02597N24878L7313k26617
1852H67626846k76268m50551n53727l52443k75015o41406j107931r19581n3525L76404
1872.4H63372803K93612K46883M7326k49803k36214j72495n43654j152099j481831
1890.7H60124528k309560m440248o627918o468713k380311L615200O781697N832494
1907.1H54127169L447175J760900J106202P40052J52945k65658l49164l11553j65761
$$ plain form
1774.5 864827096 866124511 866537333 866177559 865774930 865422726 864763677 863550484 861903667 861115932
1792.8 861115932 861879647 863175988 864375353 865533471 866599560 867488623 868157923 868428171 868424296
1811.2 868424296 868532598 868620932 868243098 867537081 866926372 866575003 866526365 866688251 867009163 867655754
1831.6 867655754 868162692 868212283 868250251 868251681 867739379 867088675 867291272 867816150 867853463 867626846
1852 867626846 867350578 866900027 866346300 865993857 865718842 865077436 863969505 863049924 862996399 863372803
1872.4 863372803 863666415 863913298 863960624 863710821 863474607 863302112 862758458 861606359 860124528
1890.7 860124528 857814968 853374720 846746802 840278089 837897778 841512978 848294675 854127169
1907.1 854127169 857574344 859335244 860441446 861181498 861334443 861068785 860719621 860408068 860242307
1925.4H60242307L6657K72095K36571j90854m18544k84672l63350n47528j08897M68015
1945.8H59341800L25680r6023j22905l457k79963o44982n67376m71473p79748q21889
1966.2H55879664k15053J35481j28388k26319l9339p1585j41502J37866L37303M9233
1986.6H55717361k16424o7294N6207k11120m28676k49446j61230l45588j98543J85192
2007H54080439R8526k30551j22904Q8393j36971l46184j72198j18732m09961m60446
2027.4H52269411j44839j09971l56555j90198K25067J57595j11401K7954J91569r4354
2047.8H51864278l27348j19985k3603l09050l57151m5121o9558m19975l83258r8765
2068.2H49710464k12907m15087k10643j8716k64823m82500l13341j90974k79903j08957
$$ plain form
1925.4 860242307 860278964 860551059 860787630 860596776 860178232 859893560 859530210 858982682 858873785 859341800
1945.8 859341800 859667480 859571457 859448552 859445095 859165132 858520150 857952774 857481301 856701553 855879664
1966.2 855879664 855664611 855800092 855671704 855445385 855406046 855334461 855192959 855330825 855668128 855717361
1986.6 855717361 855500937 855433643 855489850 855278730 854850054 854600608 854439378 854093790 853895247 854080439
2007 854080439 854178965 853948414 853825510 853913903 853776932 853430748 853258550 853139818 852729857 852269411
2027.4 852269411 852124572 852014601 851658046 851467848 851692915 851850510 851739109 851767063 851958632 851864278
2047.8 851864278 851536930 851416945 851393342 851084292 850727141 850682020 850612462 850192487 849809229 849710464
2068.2 849710464 849497557 849082470 848871827 848853111 848588288 848105788 847792447 847601473 847321570 847212613
2088.6H47212613L42488M29511J33693Q4222K26914M1664k28941j04547M4823k11656
2109H47970784m15206k02894q8513k78771k32578P7665N8472j97231j46449R775j98245
2131.4H46356809m56393l08394j14381k39134l34263j61111j14739l10004k73347q106
2151.8H44036937k5332k17796j05619R1434o9023l41057l29435k85566l99888k72870
2172.2H42081785J77503M12643K54512J53780K00688J9432k50340j79410Q643n5492
2192.6H42823744j33693J3411N8770j67430k25842j3172Q285k04683k62260j81794
2213H41715336k71976m29809l41952j37150r6202p3970R2984J20103j30951k82526
2233.4H40163887j92523j90676l16798k99454j98126k50399l04639j19865P2419N722
$$ plain form
2088.6 847212613 847555101 847984612 848118305 848202527 848429441 848471105 848242164 848137617 848182440 847970784
2109 847970784 847555578 847352684 847264171 846985400 846752822 846830487 846888959 846691728 846545279 846555054 846356809
2131.4 846356809 845900416 845592022 845477641 845238507 844904244 844743133 844628394 844318390 844045043 844036937
2151.8 844036937 844011605 843793809 843688190 843779624 843710601 843369544 843040109 842754543 842354655 842081785
2172.2 842081785 842259288 842671931 842926443 843080223 843280911 843300343 843050003 842870593 842879236 842823744
2192.6 842823744 842690051 842703462 842762232 842594802 842368960 842355788 842364073 842159390 841897130 841715336
2213 841715336 841443360 841013551 840671599 840534449 840438247 840364277 840457261 840577364 840446413 840163887
2233.4 840163887 839971364 839780688 839463890 839164436 838966310 838715911 838411272 838291407 838363826 838369548
2253.8H38369548r3162o616O676k02477l10421k26498k72572m56035m86135l88682
2274.2H35933626l74019l39628q3685J70112J44899L2902o616j80364n02348o17147
2294.6H34177732m35829l87013o36696p70927o32226m17471j54972P3731J4603l47436
2315H30483496p31826r35971j004279r69708o96003l28482j51395q9884l4988j47283
2335.4H25393677m16875n30720k54512L09706R32574J076758L00229r49919j868725
2353.7H23992193j924396j409411q18670l37422J80125P03633R55284J066327J222968
2372.1H23630631J208305J002908Q91864Q86023P02024L32415O4790m3630j69278k86757
2392.5H28219295k50340j30892o1989K2650J46091J51932m76j34707j26302j10507
$$ plain form
2253.8 838369548 838276386 838269770 838276446 838073969 837763548 837537050 837264478 836808443 836322308 835933626
2274.2 835933626 835559607 835219979 835136294 835306406 835451305 835484207 835477591 835297227 834794879 834177732
2294.6 834177732 833741903 833354890 832718194 831947267 831315041 830897570 830742598 830816329 830830932 830483496
2315 830483496 829751670 828815699 827811420 826841712 826145709 825817227 825665832 825575948 825540960 825393677
2335.4 825393677 824976802 824446082 824191570 824501276 825433850 826510608 826810837 825860918 823992193
2353.7 823992193 822067797 820658386 819839716 819502294 819682419 820386052 821341336 822407663 823630631
2372.1 823630631 824838936 825841844 826733708 827619731 828321755 828654170 828718960 828675330 828506052 828219295
2392.5 828219295 827968955 827838063 827776074 827798724 827944815 828096747 828096271 827961564 827835262 827724755
2412.9H27724755j59562j27077k3961j3530o4135o7472p6175j61052k39193k26021
2433.3H26566577k16007k68996k76864k29418k54393l27825l24071k63929k34544k24531
2453.7H23945999j91092j87159k36094k29657q3744Q2135J05560J6272q7738j59860
2474.1H22974622j89066j86741j78039j86145k07127k39729k98024l92258m78804m73022
2494.5H20145667l64364j80661O6995K57194K32101M1485j19090j92047k50160k93017
2514.9H19344103l01838l52203n14031p22229p72238n56111j95504J40310L37541L44038
2535.3H16751838J85251m2379k17199l70503n65171o13391l67880l1531J51575K12490
2555.6H15093100K45273J71364k2769j50502j53065j50740j27673k5511L1710j20819
$$ plain form
2412.9 827724755 827565193 827438116 827414155 827400625 827336490 827269018 827192843 827031791 826792598 826566577
2433.3 826566577 826350570 826081574 825804710 825575292 825320899 824993074 824669003 824405074 824170530 823945999
2453.7 823945999 823754907 823567748 823331654 823101997 823018253 823100388 823205948 823222220 823134482 822974622
2474.1 822974622 822785556 822598815 822420776 822234631 822027504 821787775 821489751 821097493 820618689 820145667
2494.5 820145667 819781303 819600642 819667637 819924831 820156932 820198417 820079327 819887280 819637120 819344103
2514.9 819344103 819042265 818690062 818176031 817453802 816681564 816125453 815929949 816070259 816407800 816751838
2535.3 816751838 816937089 816894710 816677511 816307008 815741837 815128446 814760566 814729035 814880610 815093100
2555.6 815093100 815338373 815509737 815486968 815336466 815183401 815032661 814904988 814879477 814911187 814790368
2576H14790368m31776n94258m11690o6459J76668K67506K37227Q0943o6102r1851j51336
2598.5H13739240k76089k92480k58028l41356m21643m03285m89593p44879r35793r07123
2618.9H08668971p29084m24623O6101N69284P55668O65903O31511O00517L64601J36436
2639.3H11305285R8764L9101j50859k84732l16560m34935o16670o51896o40809p90239
2659.7H07556450r24587p66635l72112K7657L01182L91424K14338j07288k37823j63316
2680.1H05919290j89960l02792k42710j02759j14083j86205j36256j11759k80738m17113
2700.5H03834915l82542m15981n76377o16789n58376o41466p61270o49870m03642k70963
2720.9G98557639k62737l58164p94232j529277j488626J28091J855433J879990Q14616
$$ plain form
2576 814790368 814358592 813764334 813352644 813286185 813462853 813730359 813967586 814048529 813982427 813890576 813739240
2598.5 813739240 813463151 813170671 812912643 812571287 812149644 811746359 811256766 810511887 809576094 808668971
2618.9 808668971 807939887 807515264 807581365 808150649 808906317 809572220 810203731 810804248 811168849 811305285
2639.3 811305285 811404049 811443150 811292291 811007559 810690999 810256064 809639394 808987498 808346689 807556450
2659.7 807556450 806631863 805865228 805493116 805520773 805821955 806213379 806427717 806320429 806082606 805919290
2680.1 805919290 805729330 805426538 805183828 805081069 804966986 804780781 804644525 804532766 804252028 803834915
2700.5 803834915 803452373 803036392 802460015 801843226 801284850 800643384 799882114 799232244 798828602 798557639
2720.9 798557639 798294902 797936738 797142506 795613229 794124603 794252694 796108127 797988117 798802733
2739.2G98802733J8955l58105n08726m43399l71813m58122m95314l81768m17113p05898
2759.6G94681430q93295q36313q31365r36747q51989o34670o49989q36968q81195q91268
2780G86437631j127541j404405j509428j647174j969636k208710k092182j681805j012385
2798.4G71784365k1100J025736J653016J790226J725792J485587R78171M38691Q8632
2816.7G80949116j75894m79221p14481q77261j162767j499713j628816j616895j706898
2835.1G71087170j827956j896083k054870k259791k330661k243757k071738j780808
2851.4G54621506j393557j190722j349807j766801k208828k251268j188278J349986
2867.7G44622231M319191N746364M887939K925872J204908q0645j169204j915277k183318
$$ plain form
2739.2 798802733 798821688 798463583 797954857 797511458 797139645 796681523 796186209 795804441 795387328 794681430
2759.6 794681430 793788135 792951822 792120457 791183710 790331721 789697051 789047062 788210094 787328899 786437631
2780 786437631 785310090 783905685 782396257 780749083 778779447 776570737 774478555 772796750 771784365
2798.4 771784365 771763265 772789001 774442017 776232243 777958035 779443622 780421793 780860484 780949116
2816.7 780949116 780773222 780294001 779579520 778702259 777539492 776039779 774410963 772794068 771087170
2835.1 771087170 769259214 767363131 765308261 763048470 760717809 758474052 756402314 754621506
2851.4 754621506 753227949 752037227 750687420 748920619 746711791 744460523 743272245 744622231
2867.7 744622231 748941422 754687786 759575725 762501597 763706505 763625860 762456656 760541379 758358061
2886.1G58358061k132475j856983j300633o16610j44064K3305J5378j51276n22554
2904.4G51672149j099289j995206l404736n285919p011056p146716m062116J765072
2920.7G23432183O649494P339120M737676J981258M97818n65529k531946o102204j1008024
2939.1G24429846j4334917j0407865J591563J2617409J4592052R870946M360259K03251
2955.4G42922544l011047n883515q168757q411944n129099Q52108O289005Q553446
2971.7G28012741P654965N319118L118575J593709O53982J55628j24097m95255r95934
2990.1G44893432j475633j881599k007067j496256k81155J148403J978815J825153
3006.4G42704093R74834J0848n36739n41628m33028p53104j511276k366006l221214
$$ plain form
2886.1 758358061 756225586 754368603 753067970 752451360 752307296 752330601 752345979 752194703 751672149
2904.4 751672149 750572860 748577654 745172918 739886999 732875943 725729227 721667111 723432183
2920.7 723432183 730081677 737420797 742158473 744139731 744637549 744072020 741540074 735437870 724429846
2939.1 724429846 710094929 699687064 701278627 713896036 728488088 738359034 742719293 742922544
2955.4 742922544 739911497 734027982 725859225 717447281 712318182 713170290 719459295 728012741
2971.7 728012741 735667706 740986824 744105399 745699108 746353090 746508718 746384621 745889366 744893432
2990.1 744893432 743417799 741536200 739529133 738032877 737751722 738900125 740878940 742704093
3006.4 742704093 743678927 743689775 743153036 742611408 742178380 741425276 739914000 737547994 734326780
3024.7G34326780m126311m914999n151152m312396k562404j221597j346052k280175
3041.1G08411694k521396j590610n42342m68850j273871k243340k912939l257989l307999
3059.4F90292358k976715k330780j447380k45750J223028K673686L840684M602910
3075.7F95632041M843056M478514L789544L131270K435208J585960O90878k48254j360953
3094.1G14977264k698421m119694n257547n541861m595578l113747k596795l593743
3110.4F83459878n148232o242812o625175o264448m975617k634049M70877L613234
3126.7F55653656O027877P201671P123948O299018N295456M193783K917409J856267
3143F96569085J193941N81205n8353n55516j102149j774311k242923k478063k733946
$$ plain form
3024.7 734326780 730200469 725285470 720134318 715821922 713259518 712037921 710691869 708411694
3041.1 708411694 705890298 704299688 703757346 703288496 702014625 699771285 696858346 693600357 690292358
3059.4 690292358 687315643 684984863 683537483 683291733 684514761 687188447 691029131 695632041
3075.7 695632041 700475097 704953611 708743155 711874425 714309633 715895593 716586471 716338217 714977264
3094.1 714977264 712278843 708159149 702901602 697359741 692764163 689650416 687053621 683459878
3110.4 683459878 678311646 672068834 665443659 659179211 654203594 651569545 652040422 655653656
3126.7 655653656 661681533 668883204 676007152 682306170 687601626 691795409 694712818 696569085
3143 696569085 697763026 698344231 698285878 697730362 696628213 694853902 692610979 690132916 687398970
3161.4F87398970l113925l515900l871023m302144m841328n295753n594731n799293
3177.7F51064873n740881n255044m347384l016770j243829Q45253K823472M257441
3194F39387131M996299N007387M302799L160954J966774Q75056j37806r98199j572549
3212.4F56987846j948238k310156k647400k865672l107369l544450m083574m638970
3228.7F31842017n271494n991698o717503p313966p717371p966459q006156p787585
3245E75069785p399499o795645n676091l972590j944363J19746J834273K610386K061426
3263.4E55907428M76182j488269l256678m496396n041659n056440n094648n365014
3279.7E26584506n683064n839408n534291m494190k629340k06530K346158M827738
$$ plain form
3161.4 687398970 684285045 680769145 676898122 672595978 667754650 662458897 656864166 651064873
3177.7 651064873 645323992 640068948 635721564 632704794 631460965 632306218 635129690 639387131
3194 639387131 644383430 649390817 653693616 656854570 658821344 659696400 659558594 658560395 656987846
3212.4 656987846 655039608 652729452 650082052 647216380 644109011 640564561 636480987 631842017
3228.7 631842017 626570523 620578825 613861322 606547356 598829985 590863526 582857370 575069785
3245 575069785 567670286 560874641 555198550 551225960 549281597 549401343 551235616 553846002 555907428
3263.4 555907428 556383610 554895341 551638663 547142267 542100608 537044168 531949520 526584506
3279.7 526584506 520901442 515062034 509527743 505033553 502404213 502197683 504543841 509371579
3296E09371579P045209Q723438R808242J0414303J0542750J0286927R931505R546578
3312.3E85670531Q924961P936120O738543N685389N105734N167961N642534N932748
3328.6F36804521N685270N061924M408479L803253L144265K542197K071381J592755
3345F65114045J101375P49409M51326K2590l59892n08607o41286r90749j296401j237094
3365.4F62404716j119196j372755j799285j907051j731455j635611j620233j583994
3381.7F49635136j558900j495957j273453r83656j015186j350403j401007r90331p25806
3400F38840437j074076j462459j292169r88603r15170r36687j017332j034260q39114
3418.4F29280567o58095o43372n86927l54886j31190j41084j04547J07467K5273l03328
$$ plain form
3296 509371579 516416788 525140226 534948468 545362771 555905521 566192448 576123953 585670531
3312.3 585670531 594595492 602531612 609270155 614955544 620061278 625229239 630871773 636804521
3328.6 636804521 642489791 647551715 651960194 655763447 658907712 661449909 663521290 665114045
3345 665114045 666215420 666964829 667416155 667438745 667078853 666570246 665928960 664938211 663641810 662404716
3365.4 662404716 661285520 659912765 658113480 656206429 654474974 652839363 651219130 649635136
3381.7 649635136 648076236 646580279 645306826 644323170 643307984 641957581 640556574 639566243 638840437
3400 638840437 637766361 636303902 635011733 634023130 633107960 632171273 631153941 630119681 629280567
3418.4 629280567 628622472 627979100 627392173 627037287 626906097 626765013 626660466 626767933 626793206 626489878
3438.8F26489878l16143K7775L49403M85360N51641O35267O72757O76454P68244Q96752
3459.2F31237388Q61525Q57115J149058J357615J015902M98533N05686Q51989J093387
3477.5F39428198J124800R47177Q70705R77277J000107J012981J097500J119018J131117
3495.9F48708880J102507J021087J041532J059353J037240J100779J280904J542806
3512.2F57895088J518786J208067J156330J389563J511038J323402J141429J276433
3528.5F68420136J487553J585603J675069J621247J406729J438141J612186J504362
3544.8F80751026J249373J276433J462102J528084J569927J643777J655817J509726
3561.1F92646265J160502R10402J395166K236724K335190K012670J885355J869798
$$ plain form
3438.8 626489878 626173735 626201510 626550913 627036273 627587914 628223181 628895938 629572392 630340636 631237388
3459.2 631237388 632098913 632956028 634105086 635462701 636478603 636977136 637482822 638334811 639428198
3477.5 639428198 640552998 641500175 642370880 643348157 644348264 645361245 646458745 647577763 648708880
3495.9 648708880 649811387 650832474 651874006 652933359 653970599 655071378 656352282 657895088
3512.2 657895088 659413874 660621941 661778271 663167834 664678872 666002274 667143703 668420136
3528.5 668420136 669907689 671493292 673168361 674789608 676196337 677634478 679246664 680751026
3544.8 680751026 682000399 683276832 684738934 686267018 687836945 689480722 691136539 692646265
3561.1 692646265 693806767 694717169 696112335 698349059 700684249 702696919 704582274 706452072
3577.5G06452072J954138K100289J942158J498162J572073K303362K365589J910508
3593.8G22098351J974284K248824K140760K022803J980424J604795J341999J649141
3610.1G37061381J951933J900077J535535J344919J913786K209664J551985O06597
3626.4G50075877L59177J472235K089620J743614J350701J002312Q65340P85768K04981
3644.8G59949625n87106k92659J150608J528263Q48651P72595J159847P99775K34783
3663.1G65564382q345n30779j068592n45859k36810o15656K05696J107752J014650
3681.5G64886439O34134J69992k18451q8096O38485J115382R33468L53337j70112j24574
3701.9G68130004L31819K03491m67003p81297j39296P65562P15434J31667l13103m71652
$$ plain form
3577.5 706452072 708406210 710506499 712448657 713946819 715518892 717822254 720187843 722098351
3593.8 722098351 724072635 726321459 728462219 730485022 732465446 734070241 735412240 737061381
3610.1 737061381 739013314 740913391 742448926 743793845 745707631 747917295 749469280 750075877
3626.4 750075877 750435054 751907289 753996909 755740523 757091224 758093536 758958876 759744644 759949625
3644.8 759949625 759362519 759069860 760220468 761748731 762597382 763369977 764529824 765329599 765564382
3663.1 765564382 765556037 765025258 763956666 763410807 763173997 762558341 762764037 763871789 764886439
3681.5 764886439 765520573 765690565 765472114 765384018 766022503 767137885 768071353 768424690 768254578 768130004
3701.9 768130004 768461823 768665314 768198311 767417014 767277718 768043280 768758714 768890381 768577278 768105626
3722.3G68105626l01063P6473K31325k59220r30369q17239K05516R53675M42981q84711
3742.7G66822994j336158k65538j24455l60191O40095J148164M71890j36972P4208
3761G66934037K50757q8513l30448k56419J56104M20153J19746k57075k82764p3254
3781.4G66592324l5346j7106J49131R9957j52469m34756o36399o07848p41363n51403
3801.8G63664722K37704J59085K5212M55201J45674p51436r62138l81291l56257p5460
3822.2G62161016N57960L16321n2392k17080l29375l89100o97016o72877P7545N33879
3842.6G61288881N48482L78251k09987j283467j970350k57373J451790R07481r2149
3861G60761559n30124l79085k85089n41926k68280K91288L97622J90378l29853m22716
$$ plain form
3722.3 768105626 767804563 767881036 768112361 767853141 766922772 766105533 766311049 767264724 767707705 766822994
3742.7 766822994 765486836 765221298 765096843 764736652 765376747 766524911 766996801 766859829 766934037
3761 766934037 767184794 767096281 766765833 766509414 766665518 767085671 767205417 766948342 766665578 766592324
3781.4 766592324 766556978 766539872 766689003 766788960 766636491 766201735 765565336 764957488 764216125 763664722
3801.8 763664722 763902426 764061511 764086723 764541924 764687598 763936162 762974024 762592733 762236476 762161016
3822.2 762161016 762718976 763035297 762982905 762765825 762436450 762047350 761350334 760677457 760755002 761288881
3842.6 761288881 761837363 762215614 762005627 760722160 758751810 758494437 759946227 760853708 760761559
3861 760761559 760231435 759852350 759567261 759025335 758757055 759048343 759445965 759636343 759306490 758883774
3881.4G58883774j46091j38521P0512L1054j96695J26064J41382n34832r08256n64277
3901.8G56764114M1723O33836P96974M54008L9280k95878n14149l83497q6784n8413
3922.1G57391214j68681j32262j31906k03847n1141J87814J61827m1187k34306k86937
3942.5G56490588j23799l9577j27196j32978k4558Q0288P3314l6776p3374j8835o4790
3965G56002307j39773r3639n1558p7724o7652m2796j12831j44303m3392j8835j24395
3987.4G55085409k00272k01404j60515j07527p8440
3997.6G54337251
$$ plain form
3881.4 758883774 758737683 758599162 758669674 758700728 758504033 758630097 758771479 758236647 757328391 756764114
3901.8 756764114 756805837 757439673 758236647 758690655 758729935 758434057 757919908 757536411 757449627 757391214
3922.1 757391214 757222533 757090271 756958365 756754518 756703377 756891191 757053018 757011831 756777525 756490588
3942.5 756490588 756366789 756327212 756200016 756067038 756042480 756122768 756196082 756159306 756085932 756067097 756002307
3965 756002307 755862534 755768895 755717337 755639613 755571961 755529165 755416334 755272031 755228639 755209804 755085409
3987.4 755085409 754885137 754683733 754523218 754415691 754337251
3997.6 754337251
##END=$$ End of the data block
