##TITLE=Diogo - 3 - p-tolu $$ Begin of the data block
##JCAMP-DX=5.00 $$ ACD/SpecManager v 10.08
##SPECTROMETER/DATA SYSTEM=Alpha
##DATE=22 Oct 2014 10:39:34
##DATA TYPE=INFRARED SPECTRUM
##DATA CLASS=XYDATA
##ORIGIN=
##OWNER=
##NPOINTS=1765
##FIRSTX=399.76428223
##LASTX=3997.64306641
##MAXX=3997.64306641
##MINX=399.76428223
##MAXY=0.84199607
##MINY=0.16106758
##XFACTOR=1.0000000000
##YFACTOR=1.000000000000000e-9
##FIRSTY=0.81907487
##DELTAX=2.03961372
##XUNITS=1/CM
##YUNITS=ARBITRARY UNITS
##XYDATA=(X++(Y..Y))
399.8 819074869 810803711 805086434 810377598 823677599 833966255 836665332 833845377 830579698
416.1 830579698 829899132 829651892 826789618 823437095 821772397 819052637 812251627 802962780 791887403
434.4 791887403 773525596 741469979 699089348 669828296 683314860 731383920 778583109
448.7 778583109 807514727 822185040 827591836 826843798 824215174 821708441 816692114 808051765
465 808051765 799710214 797080457 801062167 807666838 812980294 816227257 816840887 813828409 807945132
483.4 807945132 799646139 785702765 764630616 748442531 751946747 763925433 755980670 724081337
499.7 724081337 698224425 688651860 664318621 638529003 666291475 733723700 782027066 797473013
516 797473013 799818397 803707242 813214600 824511528 831529856 833251953 832374990 829579294 824326456
534.4 824326456 817102730 809583068 803678870 800882757 801954210 806850314 813633382 818053246
550.7 818053246 815872014 809669137 810827434 822635591 834158301 839113235 840803444 841822505
567 841822505 841996074 841320395 840728104 840746641 840717196 839878559 838903069 838858008 839128017 838276565 836338341
589.4 836338341 834407926 832123160 827433884 820721209 816869318 817866743 817579448 811262667 805567503
607.8 805567503 809780359 820822954 828872561 830973268 829747796 826552749 822173536 820328057
624.1 820328057 823795617 829247952 831657588 829481065 824636459 820984662 819688201 816927671
640.4 816927671 808619916 793378830 773935854 762818933 774062514 801178098 824571490 835496366
656.8 835496366 837609828 837309241 838125646 839498341 839191377 836215079 834582150 834360540 832597375
675.1 832597375 828762591 825220644 822094083 815200865 800984204 781898141 766481757 765245318
691.4 765245318 781420410 803902745 819831848 826720715 826817870 823119402 818734527 812111974
707.7 812111974 796002924 770990193 759505391 776880205 802238524 813793778 815020502 814745247
724.1 814745247 813424647 808035135 798946857 788884878 778656065 769257188 765592456 770465314
740.4 770465314 778551638 781493962 775261581 760097861 738564551 717912674 708981395 718202591
756.7 718202591 740339756 762254596 774568617 777526021 775812685 771773696 763122797 747990608
773 747990608 730778098 718695402 714752316 715411246 714287162 703830242 669692338 605824053
789.3 605824053 559668839 584029675 651613832 713023782 752617240 768940270 770104825 763737142
805.6 763737142 750613272 730899215 702219725 652411103 567397654 477830976 469651669 568416834
822 568416834 688484490 759101808 786500037 797096908 801193774 798597157 791526854 784014523
838.3 784014523 777830839 775450945 777850866 779800177 773044586 750584006 722939909 725249767
854.6 725249767 766424298 808460593 826367140 829212368 829714656 830699444 829292834 825158000
870.9 825158000 821901977 821281731 820363700 816826522 812890470 811179936 809854567 805206597 796659350
889.3 796659350 786829948 781500459 784494638 790650606 794136643 795387805 794313431 790248215
905.6 790248215 785673916 782696426 779380322 772979736 764389396 755699813 745335281 728671432
921.9 728671432 702750862 665788472 613145649 543755770 477637112 452658951 480875522
936.2 480875522 523702979 551704049 587007582 642907262 696208298 730072439 747630477
950.5 747630477 756948054 760744393 755923331 739460111 711455941 686362803 691998899 726254284
966.8 726254284 755584061 767048120 770445108 772847056 775304496 776787996 776740372 774125218
983.1 774125218 767966449 760233641 753662407 747519016 738705337 725321472 706845462 682678819
999.4 682678819 653907597 622328103 590480626 572182298 584838092 616932333 638976812
1013.7 638976812 642428815 625333071 581035614 524328291 489222407 499772996 548361480
1028 548361480 605048358 650218606 683702230 708726346 725130618 734595001 741466403 748157561
1044.3 748157561 753850698 757982671 761895359 766172290 769067824 769441009 768891096 769119978 769157290
1062.6 769157290 767397463 764764130 763413370 763332427 762545824 760589302 759195805 759123504 758638561
1081 758638561 756334007 753248274 750744700 748109937 744104862 739498854 735920787 733264148 729993284
1099.4 729993284 725537479 720021009 711739540 697576165 678178966 660757899 651032150 645697057
1115.7 645697057 641823232 642445326 643902600 635755002 621826053 624456525 651820719 682751179
1132 682751179 698700368 701229155 698063910 693691909 689108670 683704615 677710295 672201812
1148.3 672201812 667093813 660824776 652355134 642094553 630260885 615628719 596848845 574153602
1164.6 574153602 548439860 519072294 482435465 432620913 369098604 307663411 279957622
1178.9 279957622 316932827 411034048 499781221 524821162 482335329 402701586 324556977
1193.2 324556977 281343848 285607815 323065907 364127427 389407128 402078897 414516658
1207.5 414516658 433061153 453644097 467302233 473091066 477258354 481798828 487981439 500651479
1223.8 500651479 520649791 543688476 567001402 591370344 617277324 641379774 658934653
1238.1 658934653 667687237 668375909 665209055 663944840 665751219 665565014 658486903 646944463
1254.4 646944463 639759600 641620338 646854341 647480607 641002595 627843738 608174920 582538068
1270.7 582538068 552310765 518245161 479177177 433380097 381164491 326611131 277873635
1285 277873635 244235277 232444093 244560361 274841338 307566971 324319392 321671396 320201159
1301.3 320201159 343804717 394644767 457883388 515356421 545278430 527193308 477548122
1315.6 477548122 448616922 462548673 497901112 536302447 575097978 613770366 649505496
1329.8 649505496 679115057 701464832 718052983 731423438 742398858 749498904 752088070 751905322
1346.2 751905322 752156317 754901052 758015335 756964624 748428643 731704056 707692921 678494334
1362.5 678494334 647603810 613226295 569368720 520414829 479108453 449287474 419611543
1376.7 419611543 392063648 399153769 451957285 513413191 556990743 587321758 598719776
1391 598719776 573064983 533301532 543849707 601528585 645993710 655551791 643318951 622146547
1407.3 622146547 601202011 588505447 589966297 602609396 621214986 644326270 667089164
1421.6 667089164 688270092 708375394 724883080 737106562 744126678 746360898 746424019 746549428
1437.9 746549428 747278452 748529792 750273585 752043307 753542483 755203784 757626534 760890186
1454.3 760890186 765015006 769094110 771857262 774743140 779754639 786664486 793207705 799118578
1470.6 799118578 805139244 809588790 810966432 810269356 808998287 808642149 809759617 811736226 813848197
1488.9 813848197 815434933 815304935 812233448 805269301 794959307 781797171 763891816 732565761
1505.2 732565761 694680035 693450928 719723046 747182429 766647995 779712856 788488150 794558764
1521.6 794558764 798319161 800235450 800837159 799942851 797335505 793826520 791322768 789075017 785240531
1539.9 785240531 781464934 778848290 775337517 769621015 761235654 751275778 740163386 727324903
1556.2 727324903 706145883 678148031 663045704 659896374 665231824 673272908 678295374 679548323
1572.6 679548323 677738190 673027873 669055521 665060341 655804634 638427973 613897145 584582627
1588.9 584582627 552641094 518141210 476210922 421711236 360245705 315700680 318575114
1603.2 318575114 364808857 403036892 396519750 368818015 360375434 390444070 460187584 531718433
1619.5 531718433 588280737 636033654 668288171 685900927 696139753 703606367 712091148 723110199
1635.8 723110199 731159270 734182894 735013068 734511793 731740177 727319896 723224938 716476202 704615057
1654.1 704615057 694561541 686042190 677578270 668706179 658441484 647657990 636144996 625690937
1670.5 625690937 619064212 614382267 610504568 607891083 605704784 603505194 602213621 602674007
1686.8 602674007 603462934 602945983 601134241 601426899 607075453 610901237 604166508 590240300 575041234
1705.1 575041234 562379122 553155661 540968716 519739866 484783351 429431856 364180982
1719.4 364180982 304489791 246974140 197773799 168539405 161067575 171668395 195057169
1733.7 195057169 219438955 241645470 276924461 325763226 373599797 412516385 443324685
1748 443324685 475476950 512154460 542318225 555781484 542502582 498574495 442827612 413578928
1764.3 413578928 413029075 415259153 421429276 456406295 511950016 561260700 601739109 635873735
1780.6 635873735 663239181 685028732 702405930 715230525 725018322 733532250 740824461 747083306
1796.9 747083306 753010988 758906066 764833689 770141602 773920953 775746286 776759803 778581381
1813.2 778581381 781130791 783848584 787194848 791389465 795557380 799029887 801691592 804175913
1829.6 804175913 806673288 808527827 809781790 811219931 812931001 814051032 814388692 814974546 816278100
1847.9 816278100 817533851 818278015 818851888 819852054 821013510 821514606 821222067 820712984 820137203
1866.3 820137203 818872213 816789925 814732969 813648045 813970506 815470338 817789435 820676148
1882.6 820676148 823379278 824957669 825380325 825473249 825571477 825124800 824095964 823143899 822748363
1900.9 822748363 822739065 822687745 822548807 822518229 822384417 821704268 820836067 820703030 821242988 821162343
1921.3 821162343 820492446 820638120 821741045 822631478 822652936 822230935 822179675 822739661 823342919 823657811
1941.7 823657811 823659360 822911859 821823299 822172046 824470162 827280283 829343557 830337584 830611348
1960.1 830611348 830667198 830598950 830308139 830123425 830428362 831036806 831465185 831543803 831600070 831888258
1980.5 831888258 832153440 832005441 831575036 831272662 831128418 830873668 830448329 830035985 829737365 829390228
2000.9 829390228 828842938 828269362 827818513 827312112 826551497 825706363 825079203 824651599 824080348 823202491
2021.3 823202491 822298467 821593404 820980012 820439279 820184171 820150256 819953203 819389701 818605006 817854702
2041.7 817854702 817305684 817197621 817957640 819761992 822091103 824152291 825622261 826715946 827647865
2060 827647865 828332424 828688204 828919590 829273164 829666138 829866767 829869807 829873562 829926729 829836667 829515219
2082.5 829515219 829147041 828917325 828744531 828478217 828156292 827874482 827530444 826959372 826227605 825534999
2102.9 825534999 824906766 824178100 823403776 822916269 822835743 822919846 822939277 822918475 822960615 822966337 822749376
2125.3 822749376 822344780 821884692 821382403 820823610 820370376 820271254 820486546 820662081 820571959 820321321
2145.7 820321321 820077479 819852889 819607437 819424510 819402575 819467247 819422424 819213569 818993509 818809569
2166.1 818809569 818519354 818138123 817919791 817962646 818076551 818067789 817937493 817763865 817472219 816894531
2186.5 816894531 816091955 815363586 814904332 814693511 814647496 814786851 815083325 815275252 815168917 814892590
2206.9 814892590 814634085 814333558 813815475 813117266 812502027 812085867 811732948 811375916 811104178 810920596
2227.3 810920596 810672462 810283065 809913099 809725046 809592128 809291959 808829844 808394551 808078945 807820559
2247.7 807820559 807589889 807488561 807575703 807705522 807725906 807673872 807606936 807383716 806828916 806083262
2268.1 806083262 805535853 805311978 805128336 804742575 804224372 803802967 803605020 803570628 803648353 803870380
2288.5 803870380 804136038 804214060 804001868 803564250 802961826 802211225 801472127 801041782 801057816 801370978
2308.9 801370978 801782966 802240670 802779436 803397477 804010034 804569185 805097044 805549502 805821419 805973470
2329.3 805973470 806185722 806429803 806542039 806446135 806200922 805897892 805361807 804336369 803478062 803593636
2349.7 803593636 804585755 805751741 806501448 806750774 806506336 805737495 804408550 802658081 800799787
2368 800799787 799046397 797421038 795914412 794538915 793268859 792075694 790983200 790067852 789377093
2386.4 789377093 788850605 788423121 788138509 788054049 788125873 788241982 788330138 788406968 788488984 788527131 788486302
2408.8 788486302 788410127 788324654 788182080 787948787 787682176 787435114 787141860 786784232 786483347 786296308
2429.2 786296308 786110699 785793781 785333395 784823120 784344316 783896565 783416569 782831550 782110274 781300664
2449.6 781300664 780541599 779934943 779497564 779168904 778847396 778521299 778178692 777758062 777276874 776781976
2470 776781976 776272058 775741875 775213957 774708807 774183393 773586035 772967696 772456110 772134185 771957695
2490.4 771957695 771806538 771600783 771357059 771079063 770686328 770157754 769573927 769027233 768578827 768192470
2510.8 768192470 767760992 767236054 766600072 765808463 764881253 763953507 763108730 762306929 761579871 761054993
2531.2 761054993 760758579 760555565 760293484 759953022 759631932 759381473 759166062 758984327 758885920 758898914
2551.6 758898914 759003401 759253800 759897470 761148870 762901664 764804542 766509473 767826736 768644392
2569.9 768644392 768866479 768596649 768125057 767636895 767082989 766358793 765497983 764606178 763690650 762745738
2590.3 762745738 761964440 761626244 761749566 762039840 762266815 762494147 762811184 763111830 763270020 763304412
2610.7 763304412 763283491 763147950 762724042 762033343 761373281 760883987 760360062 759695590 759149790 758953452
2631.1 758953452 758952618 758867681 758670926 758513510 758413970 758207619 757874370 757626534 757516623 757319927
2651.5 757319927 756926060 756541789 756360531 756275773 756072342 755777359 755583405 755492985 755373180 755282044
2671.9 755282044 755512416 756288052 757468581 758760870 760128438 761634350 763035595 763981342 764518619
2690.3 764518619 764942527 765259087 765202343 764683723 763968945 763341784 762756944 762079895 761471510 761173427
2710.7 761173427 761086524 760891616 760490716 760061145 759628356 758897960 757681727 756239653 755182207
2729 755182207 754970968 755398095 755899072 756214082 756349206 756314099 756156325 755952060 755659461 755154312
2749.4 755154312 754418910 753588498 752794325 751922071 750748038 749415815 748427331 748024166 747947454
2767.8 747947454 747939706 748014510 748111844 747928441 747277021 746426404 745810747 745442808 745006025 744436204
2788.2 744436204 743965864 743614078 743049562 742091715 740991235 740055501 739233792 738295019 737303972
2806.5 737303972 736534834 735956192 735283673 734481514 733814538 733401000 733022690 732473254 731832266 731253684
2826.9 731253684 730642557 729815304 728857994 728062451 727497101 726814032 725726008 724344254 722801864
2845.3 722801864 720944226 718634963 716219604 714283407 712974966 712063909 711449802 711222112 711364627
2863.6 711364627 711628914 711799622 712013125 712525368 713119864 713415325 713573158 713938117 714425027 714679539
2884 714679539 714576900 714363337 714247286 714068949 713584542 712771952 711669862 710159659 708026707
2902.4 708026707 705212951 701918244 698197961 693709135 688313425 682804465 678862512 678142786
2918.7 678142786 681079745 686491489 692382157 697086155 699788213 700386882 699265599 696790159
2935 696790159 692988038 688243270 683796763 680860400 679718137 680335879 682770550 686366022 689615726
2953.4 689615726 691447914 691953957 691750407 691268623 690530658 689569473 688655078 688031316 687679410
2971.7 687679410 687263787 686378717 684769332 681363404 672892749 656140447 637739003 636032045
2988 636032045 656063676 678574860 688223779 686769426 678688943 664351761 645205379 630513787
3004.4 630513787 632849038 652261317 675389588 691862404 700974166 705651224 707840562 708344936
3020.7 708344936 707622647 705804408 702676237 698545098 695393920 695735037 699051142 702041805 703106940
3039 703106940 703397989 704461992 706648290 709153056 711145222 712268174 712615550 712671757 712783098
3057.4 712783098 712911129 712907374 712543309 711660802 710392118 709240615 709071517 710587621 713728309
3075.7 713728309 717581570 720957339 723247409 724574566 725232124 725481510 725387037 724735916 723534763
3094.1 723534763 722079098 720505953 718816042 717514396 717508495 718997300 721131206 722944617 724243343
3112.4 724243343 725255847 725852311 725758672 725126088 724507928 724458098 725095689 726156235 727389097
3130.8 727389097 728683889 729889333 730875790 731699407 732400298 732919872 733212769 733341753 733517170
3149.2 733517170 733791709 733864486 733599126 733318150 733294547 733416200 733450949 733415484 733512878 733728111
3169.6 733728111 733789325 733594298 733356893 733248889 733141661 732885599 732648849 732707500 733073890 733555019
3189.9 733555019 734059393 734640300 735311210 735936999 736432672 736940384 737532496 737991452 738096237 737944186
3210.3 737944186 737826169 737860203 737905443 737901092 738030851 738360226 738644838 738661289 738515198 738410830
3230.7 738410830 738342583 738183439 737917483 737707555 737604380 737424791 737144709 736967862 736929774 736858487
3251.1 736858487 736659288 736439943 736343980 736314356 736183882 735960424 735829651 735919476 736066341 735909641
3271.5 735909641 735481858 735148191 734914184 734565437 734143317 733845413 733675778 733466029 733218729 733048379
3291.9 733048379 732909501 732607484 732053161 731546998 731466711 731651723 731560707 730996668 730262518 729640186
3312.3 729640186 729062319 728353143 727621436 727043152 726467490 725672483 724701166 723773956 722952127 722047269
3332.7 722047269 720996976 720009744 719116569 718056977 716746747 715364099 714074433 712852657 711457193
3351.1 711457193 709830999 708317697 707100093 706000388 704896688 703874052 703001618 702077091 700852215
3369.4 700852215 699433565 698140204 697038949 695944190 694834113 693842292 692969501 692078352 691160023
3387.8 691160023 690400660 689795494 689084709 688177466 687308371 686636209 685961962 685145199 684365034 683799446
3408.2 683799446 683381438 682892144 682226896 681527555 680968285 680486441 679944992 679428995 679076552 678782880
3428.6 678782880 678333044 677667975 676903963 676103890 675015032 673338056 671295702 669640660 669109106
3446.9 669109106 669892788 671511292 673320413 674895287 675994694 676689744 677333832 678020358 678439319
3465.3 678439319 678490222 678470910 678498328 678279638 677560627 676435351 675247848 674412727 674227893 674902320
3485.7 674902320 676558793 678907871 681280434 683185160 684589565 685694695 686634421 687430680 688173831
3504 688173831 688930154 689639986 690277636 690877497 691477716 692097664 692726016 693276525 693819284 694662869
3524.4 694662869 695887029 697213650 698443174 699608445 700750053 701837897 702813625 703617930 704281628
3542.8 704281628 704939544 705647469 706309378 706904054 707575560 708302081 708925247 709528148 710222542 710821152
3563.2 710821152 711116135 711487472 712441981 713564694 714403927 715095341 715873837 716815114 717798233
3581.5 717798233 718592405 719146967 719815612 720923662 722063243 722956777 723905861 725042641 726090133
3599.9 726090133 726994514 727846563 728485465 728967726 729573071 730302274 731153667 731984913 732616127 733430624
3620.3 733430624 734513283 735339046 735599279 735595286 736151695 737067938 737766743 738201976 738510013 738849521
3640.7 738849521 739193141 739262342 738861084 738486052 738902032 739531100 739764154 740038216 740612209 740894973
3661.1 740894973 740671933 740201771 739470541 738569856 738192677 738164127 738067806 738542855 739381254 740010023
3681.5 740010023 740444660 740706027 740729570 740640819 740841150 741374195 741858184 742019534 741852999 741657138
3701.9 741657138 741717041 741728783 741325915 740616441 740280807 740694404 741159558 741218388 741060376 740906775
3722.3 740906775 740729749 740555882 740487218 740286946 739716351 739146292 739156604 739526391 739499748 738685727
3742.7 738685727 737744272 737632692 737616777 737336636 737508476 737943888 738057852 737908900 737905562 738021731
3763.1 738021731 738020658 737908244 737772048 737814248 737989604 738003373 737848163 737674534 737541139 737430692
3783.5 737430692 737400413 737487137 737514079 737340391 736949623 736417294 735934496 735422194 735055447 735175848
3803.9 735175848 735264957 735254645 735430717 735467613 735066950 734473228 734110951 733793318 733649194 733844578
3824.3 733844578 733965516 733945668 733807683 733576953 733379960 733002484 732478261 732354701 732633889 733010650
3844.6 733010650 733181179 732869446 731948674 730713844 730527580 731294453 731751025 731623769 731154799
3863 731154799 730793059 730593145 730224133 729916155 729933500 730089784 730127573 729784369 729385197 729236126
3883.4 729236126 729102969 729064822 729065061 728983641 729031503 729052305 728745461 728209913 727713108 727530301 727825046
3905.8 727825046 728263736 728465319 728392303 728067756 727575123 727164745 726960897 726839840 726746142 726801038
3926.2 726801038 726858616 726675570 726411343 726289034 726188302 725940228 725600541 725349963 725295484 725315213
3946.6 725315213 725324333 725426793 725569069 725574791 725484014 725447059 725464165 725483060 725453556 725363255 725262821
3969.1 725262821 725131333 724966168 724834204 724737108 724621236 724470198 724291682 724049509 723765731 723503649
3989.5 723503649 723237097 722966611 722754836 722609520
3997.6 722609520
##END=$$ End of the data block
