##TITLE=Diogo - 2 - Benzaldeido $$ Begin of the data block
##JCAMP-DX=5.00 $$ ACD/SpecManager v 10.08
##SPECTROMETER/DATA SYSTEM=Alpha
##DATE=22 Oct 2014 10:39:34
##DATA TYPE=INFRARED SPECTRUM
##DATA CLASS=XYDATA
##ORIGIN=
##OWNER=
##NPOINTS=1765
##FIRSTX=399.76428223
##LASTX=3997.64306641
##MAXX=3997.64306641
##MINX=399.76428223
##MAXY=0.84878600
##MINY=0.26807150
##XFACTOR=1.0000000000
##YFACTOR=1.000000000000000e-9
##FIRSTY=0.82283324
##DELTAX=2.03961372
##XUNITS=1/CM
##YUNITS=ARBITRARY UNITS
##XYDATA=(X++(Y..Y))
399.8H22833240k151072J924932J715124j780570j860499J692950K654195n54084m681230
418.1H19792986m613459r74834j549125n688667p882476p259786q534134j5640497
434.4G67650008k4115741k3776233j4287055j118243J3288856K1706641J7174363L598988
450.8G60121584l671229N116701J9881725K3640633J3874650K206802m524827k814888
467.1H13831151K671480K425611n167902j3455331j6942561j2188613O69122J1816501
483.4G83659458J2747049O625772l21627m874289l333509M147172J1893392J3036847
499.7H23580265O324112j001477k520263j018763j759290n303264p814169o947338
516H03539813l914476J173675P299900R774566P982671M859686O80089l564060m897356
$$ plain form
399.8 822833240 820682168 822607100 824322224 822541654 820681155 822374105 825028300 824474216 819792986
418.1 819792986 815179527 814204693 812655568 806966901 799084425 791824639 783290505 767650008
434.4 767650008 743534267 719758034 705470979 704352736 717641592 739348233 756522596 760121584
450.8 760121584 756450355 761567056 781448781 805089414 818964064 821170866 816646039 813831151
467.1 813831151 816502631 818928242 813760340 800305009 783362448 771173835 771842957 783659458
483.4 783659458 796406507 803032279 802710652 797836363 794502854 798650026 810543418 823580265
499.7 823580265 829904377 828902900 826382637 825363874 823604584 818301320 810487151 803539813
516 803539813 799625337 800799012 808098912 817873478 825856149 830715835 831395924 827831864 822934508
534.4H22934508l748893n541265j5798808l0207395k4725258J0828375L7140370K8079390
550.7H18961024R361744J921535J821160J563132p12276k275407j006126J030326M55617
569.1H31120729k345204m163027m290163l680349p30574K499581J969516J389921K730310
587.4H24500740J283228k522528l165364l06309L28660l522932n392194j29581O014944
605.8H17088664N433678J55091l533601l329814j087785O75619j76310k617300l760159
624.1H08848083n417109j0143101j1954546l249347R099305J1029124J955330q041501
640.4G92126238j1430859p894457m596531l774703K862812J4416456J9409835J4379084
656.8H15497875N077481j214921j499891n0307k685427q491755o533503k425552k352595
$$ plain form
534.4 822934508 819185615 813644350 797845542 767638147 742912889 753741264 790881634 818961024
550.7 818961024 828322768 830244303 832065463 833628595 832916319 830640912 829634786 830665112 831120729
569.1 831120729 828775525 824612498 820322335 816641986 815911412 818410993 820380509 821770430 824500740
587.4 824500740 825783968 823261440 820096076 819789767 820118427 816595495 811203301 811073720 817088664
605.8 817088664 822522342 822677433 819143832 815814018 814726233 815401852 815225542 812608242 808848083
624.1 808848083 803430974 793287873 781333327 778083980 787183285 798212409 800167739 792126238
640.4 792126238 780695379 772800922 768204391 764429688 767292500 781708956 801118791 815497875
656.8 815497875 820575356 819360435 817860544 817810237 815124810 806633055 800099552 797674000 795321405
675.1G95321405q057654j7446160k5439382l0239105k8409183j3959170Q831800K2323429
691.4G02925980J4596939k821207n073309J0841131K1820128J3395131q513570l0635536
707.7G16535687l2937288k611339L5125315M3853700K7404011J1792957N760491K754212
724.1H07677746k658844r139955j3295710j5268028j6005635j2136996l9578J6251803
740.4G55384803K6348173K3954988J3848126N525291L151357L274798Q97050l673792
756.7H28710794o347358o179750p010996j1821628j9085347k5447071k6698410j3996661
773G12123573J4024615L5428822L3036888J9080043P743120n68092o503284r353042
789.3H05012643j1542678j8197894k9825866l3655763j7161488J0728836L1237364
$$ plain form
675.1 795321405 787263751 769817591 744378209 714139104 685729921 671770751 680602551 702925980
691.4 702925980 717522919 714701712 709628403 720469534 742289662 755684793 747171223 716535687
707.7 716535687 683598399 680987060 716112375 759966075 787370086 799163043 804923534 807677746
724.1 807677746 805018902 795878947 782583237 767315209 751309574 739172578 739133000 755384803
740.4 755384803 781732976 805687964 819536090 825061381 828212738 831487536 832384586 828710794
756.7 828710794 822363436 816183686 809172690 797351062 778265715 752818644 726120234 712123573
773 712123573 726148188 761577010 794613898 813693941 821437061 820868969 814365685 805012643
789.3 805012643 793469965 775272071 745446205 711790442 694628954 705357790 736595154
803.6G36595154L3499181K0949006R173095N711258M134595j088857n522907k269924
819.9H01180601N904555R208024N317807P55012j392483l776849r219885j7232358
836.2G90744424k2023499j2489736Q930087K0146131J3827682N787432L823221j043022
852.6H07702720j6054272k7713180j0511339K1128893K5118947L497303j8880189l5630047
868.9G48658836l0543506P550359L9619505L4033239J4846384M498124l94940m608154
885.2H13659847q652866j3659179j9998849j8994689n063534O853819P143736O235123
901.5G67523408M691362m562735j7582059k4631441j9449472q674085l558815o691992
917.8F87064171j2458086j1396885k745986O787419J6409099K5171757K7406633K2175133
$$ plain form
803.6 736595154 770094335 791043341 800216436 805927694 810062289 808973432 803450525 801180601
819.9 801180601 807085156 816293180 821610987 822365999 820973516 817196667 807976782 790744424
836.2 790744424 768720925 756231189 765161276 785307407 799135089 804922521 808745742 807702720
852.6 807702720 791648448 763935268 753423929 774552822 799671769 803169072 784288883 748658836
868.9 748658836 718115330 725665689 765285194 799318433 814164817 818662941 818268001 813659847
885.2 813659847 805006981 791347802 771348953 752354264 747290730 754144549 761288285 767523408
901.5 767523408 772214770 767652035 750069976 725438535 705989063 697314978 693756163 687064171
917.8 687064171 674606085 663209200 660463214 667250633 683659732 708831489 736238122 758413255
934.1G58413255J5229821J0899961Q197964M109382l051698j2477219j9586742j6534269
950.5G45200455l580034R392023J6676605J6444803Q805632j437962j0222912j5633523
966.8G65645087j4170408l696681Q787215J2714803Q405924K788663j711070m018665
983.1G74744868l061652k151787m517079r557962j6656935k2888959k0415425j0255814
999.4F85239255p742941j5587389j7161668o724059M434347M231393p415950j6472161
1015.7F22800827j5759051j5785992k1772563j9094289L153801L1158745M4058204
1030F28759682L8974166K8310418K1810770J9324065J6045987R761095K171874m898011
1046.3G60260046j0237039r994030k683282K547682k336562j3411939k4265110k7979136
$$ plain form
934.1 758413255 773643076 784543037 792741001 796850383 793798685 781321466 761734724 745200455
950.5 745200455 741620421 751012444 767689049 784133852 792939484 791501522 781278610 765645087
966.8 765645087 751474679 747777998 756565213 769280016 777685940 780474603 778763533 774744868
983.1 774744868 771683216 769531429 765014350 755456388 738799453 715910494 695495069 685239255
999.4 685239255 677496314 661908925 644747257 638023198 642457545 646688938 639272988 622800827
1015.7 622800827 607041776 591255784 569483221 550388932 553542733 584701478 628759682
1030 628759682 667733848 696044266 717855036 737179101 753225088 762986183 765158057 760260046
1046.3 760260046 750023007 740028977 737345695 739893377 737556815 724144876 699879766 671900630
1062.6F71900630j5171766Q954882K1773458J4783025K950549l354907p170379o400109
1079F88265383N285859J9866765K3705840J7616868R974360L878236p29382l557145
1095.3G64306784n172432p317781j0853172j4425873j5435338j2669206r790301j1725128
1111.6F76917553j3653457n264282J1185526K2534013K2533238J6106725R854734N776882
1127.9G45990932K787113J36674j566053j988530k102792l025115m503846n376577
1144.2G30351806n406797n857528p350862q285999p996142q031785q373797p407844
1160.5F71641052o754518r463072j4403522j9516766k4181246k6085139k3807168k1195173
1176.9E26234448k2117078k3998678k3960054k3008853j8857122p949918J022041l075362
$$ plain form
1062.6 671900630 656728864 665683746 687457204 702240229 705190778 701835871 694665492 688265383
1079 688265383 693551242 713418007 737123847 754740715 764715075 768593311 767863929 764306784
1095.3 764306784 759134352 751816571 740963399 726537526 711102188 698432982 688642681 676917553
1111.6 676917553 663264096 657999814 669185340 691719353 714252591 730359316 740214050 745990932
1127.9 745990932 748778045 748914719 747348666 745360136 743257344 740232229 735728383 730351806
1144.2 730351806 724945009 719087481 711736619 703450620 695454478 687422693 679048896 671641052
1160.5 671641052 664886534 655423462 641019940 621503174 597321928 571236789 547429621 526234448
1176.9 526234448 504117370 480118692 456158638 433149785 414292663 406342745 407364786 404289424
1193.2D04289424j2251019j3560772q011073r8556J0312795K2256017L1577349L5367101
1209.5D69881266L3523351K7032018J8184841R451091J948535k079725J32084O402314
1225.8E64475775R944558P987976O073475R552181J5058040J6492844J3874650J0770798
1242.1F54230297Q648634N738973J32263p256270j3117611j5023410j6187370k2071898
1258.4E95093608k9881895k8190672j1097074J1566580K1940410J3255298m901528
1272.7E67784727k1233619l2049179l6947816l5288006k8264344j8604308p977307
1287C87420148L203600J2270540J4442444R016633R37164m810572p313609q530915
1303.3D06635433r762942r767801p760793m717797m76539O625831J5610129K2641033
$$ plain form
1193.2 404289424 392038405 378477633 370466560 370368004 380680799 402936816 434514165 469881266
1209.5 469881266 503404617 530436635 548621476 558072567 560021102 557941377 558073461 564475775
1225.8 564475775 574420333 582408309 588481784 598033965 613092005 629584849 643459499 654230297
1242.1 654230297 662878931 668617904 668750167 661493897 648376286 633352876 617165506 595093608
1258.4 595093608 565211713 537021041 525923967 537490547 559430957 572686255 567784727
1272.7 567784727 546551108 514501929 477554113 442266107 414001763 395397455 387420148
1287 387420148 390623748 402894288 417336732 426353365 427290529 422479957 415166348 406635433
1303.3 406635433 396872491 387104690 379343897 374626100 374149561 380775392 396385521 419026554
1319.6D19026554K6426077K9339998L2523185L4940184L5371542L2748937K7885437
1333.9F38261914K1633804J2754023K461076j046479N504668J2481749J1886537O016672
1350.2G09953964l278m789949q695483j0872603r574353n109132k746880p418096j5232980
1368.6F45511210j5401602n554139J537144n113185j7187237k6362122k6377916m378796
1384.9E46673357K8036476K6355385r535431k5918425l056108L4435212N5047870M7542631
1401.2F99580967K8056980J6853094J1393666Q385003P319569O941378O467521N939544
1417.5G90937722N154669L365457J739919K22802j755893l468454l070056j622498
1433.9G91503668k122045m158497m668116o113768j1421621j8708109j9952477p452130
$$ plain form
1319.6 419026554 445452631 474792629 507315814 542255998 577627540 610376477 638261914
1333.9 638261914 659895718 672649741 675110817 674064338 679569006 692050755 703937292 709953964
1350.2 709953964 709950686 705160737 696465254 685592651 676018298 670909166 668162286 660744190 645511210
1368.6 645511210 630109608 624555469 626092613 620979428 603792191 577430069 551052153 546673357
1384.9 546673357 574709833 601065218 591529787 565611362 562555254 596990466 652038336 699580967
1401.2 699580967 727637947 744491041 755884707 764269710 771589279 778530657 784998178 790937722
1417.5 790937722 796092391 799457848 801197767 801420569 799664676 796196222 793126166 791503668
1433.9 791503668 789381623 785223126 780555010 774441242 763019621 744311512 724359035 716906905
1450.2G16906905P333040J2242556J5936792K2192299J5784979Q064747N377412M654407
1466.5H08493137M519642M634261M556239L282249J848340P08341n37872j935005l299058
1484.9H22270274n284488q735120j2746156j4644146j5676856r237110J2263953K5457085
1501.2G93667436K0064234J0995388N875886K484918N94615j14738k88666l28839q07821
1519.5H32142413j647413j640499j026273q57353j079678j749814k278328j757085
1535.8H20105970j627326k910972l272474k207875j813888k169907l074885l602505
1552.2G99426138l607928l712416o268442r202778p839024r311736j2427151j5606463
1568.5G31450200j7501175j1753083J80245J4853358J4639259Q85128j0821938j5801191
$$ plain form
1450.2 716906905 724239945 736482501 752419293 774611592 790396571 798461318 803838730 808493137
1466.5 808493137 813012779 817647040 822203279 825485528 827333868 828042209 827504337 825569332 822270274
1484.9 822270274 816985786 808250666 795504510 780860364 765183508 755946398 768210351 793667436
1501.2 793667436 813731670 824727058 830602944 833087862 833682477 833567739 833279073 832950234 832142413
1519.5 832142413 830495000 828854501 827828228 826970875 825891197 824141383 821863055 820105970
1535.8 820105970 818478644 815567672 812295198 810087323 808273435 806103528 803028643 799426138
1552.2 799426138 795818210 792105794 785837352 776634574 768795550 759483814 747056663 731450200
1568.5 731450200 713949025 702195942 702376187 717229545 731868804 732753932 721931994 706130803
1584.8G06130803j4923215j4016211j5055597j5860796j4783025j1048674q482755
1599.1F11960530j1030256j1956096m700899L951609P365882O302357L877044K928674
1615.4F08698845N549848R998500J6156316K4411440K5724053K1142006J6383410J1509299
1631.7G39573717R093523R103835O921410M159928L333211L312289L744901L646075
1648G82888889K179981J390457J730799J149476J79768l04938j35958j6332p56383
1666.4G88305759k467393l785968l569365m145443n459607n807280n874932o952465
1682.7G50243306r608030r860575r598494j0057032q573532q650541r576261j0680318
1699F73638523j4528156j5617132j8715680k3852348k5503516k7602196l0140042l1568706
$$ plain form
1584.8 706130803 691207588 677191377 662135780 646274984 631491959 620443285 611960530
1599.1 611960530 600930274 588974178 584273279 588224888 595590770 601893127 605770171 608698845
1615.4 608698845 614248693 624247193 640403509 664814949 690539002 711681008 728064418 739573717
1631.7 739573717 748667240 757771075 764692485 768852413 772185624 775497913 779242814 782888889
1648 782888889 785068870 786459327 788190126 789339602 789519370 789214432 789078474 789062142 788305759
1666.4 788305759 785838366 782052398 778483033 774337590 768877983 763070703 757195771 750243306
1682.7 750243306 740635276 730774701 721176207 711119175 702545643 693895102 684318841 673638523
1699 673638523 659110367 643493235 624777555 600925207 575421691 547819495 517679453 486110747
1715.3D86110747l1293214k4561941j7288625j6020477j6659290j7439753k0097166
1729.6C42750281k4014056k9826909k0837814J38373J4223069K3026049K8615623L2272935
1745.9C66347551L5575837L9580882L5935163K3362071J4357865J1183440R086788
1760.2E35429597N706668q0228o147265j1112631j3688683j2216002k089083J1132568
1776.5E06934941J8582701J7964840J0142088J552344k095640J075923J2291968K8468967
1792.8E94918132L4295559L0533492K7139724K3472070J8576145J4131129J1306286
1807.1G54372537R341121P750094O224036N047441M560947M293978L906667L508151
1823.4G99004972L321409K904237K612352K415061K060473J863599J927912J938581
$$ plain form
1715.3 486110747 454817533 430255592 412966967 396946490 380287200 362847447 342750281
1729.6 342750281 318736225 288909316 268071502 268209875 282432944 305458993 334074616 366347551
1745.9 366347551 401923388 441504270 477439433 500801504 515159369 526342809 535429597
1760.2 535429597 541136265 541056037 534908772 523796141 510107458 497891456 495802373 506934941
1776.5 506934941 525517642 543482482 553624570 555176914 553081274 554157197 566449165 594918132
1792.8 594918132 629213691 659747183 686886907 710358977 728935122 743066251 754372537
1807.1 754372537 763713658 771463752 777687788 782735229 787296176 791590154 795496821 799004972
1823.4 799004972 802326381 805230618 807842970 810258031 812318504 814182103 816110015 818048596
1839.8H18048596J740456J668513J546144J152277Q02875Q14319J010417J154125J046598
1858.1H28984320Q35598O93082N78642M64380M02033N66841P52329Q64208P08878K59877
1878.5H35110188j23859r4473K04980L99709M38690N46575P15553O06656L49403L20077
1898.9H38473499O95646J058519Q97169K81334j73510j7046M14311M95255J15812j20044
1919.3H42120945R4057M85837N66959K23697j0491K20239N70238N40674J96516r5308
1939.7H44913363r6082r1851l88205n33164m7266N13315L69191m18544j069784p88808
1960.1H42362165J63019O88970M06862J21474K95520M35233K09808N484L13282R42766
1980.5H45944583J251340Q69632J03355l92855k69889J74045L45290Q6248j23322P4446
$$ plain form
1839.8 818048596 819789052 821457565 823003709 824155986 824958861 825773180 826783597 827937722 828984320
1858.1 828984320 829819918 830513000 831091642 831556022 831958055 832524896 833277225 834141433 834850311 835110188
1878.5 835110188 834986329 834891856 835096836 835496545 835935235 836481810 837197363 837804019 838153422 838473499
1898.9 838473499 839169145 840227664 841124833 841406167 841232657 841215611 841629922 842125177 842240989 842120945
1919.3 842120945 842215002 842700839 843267798 843491495 843481004 843701243 844271481 844812155 845008671 844913363
1939.7 844913363 844817281 844725430 844337225 843804061 843756795 844270110 844639301 844220757 843150973 842362165
1960.1 842362165 842525184 843214154 843621016 843742490 844038010 844473243 844683051 844688535 845001817 845944583
1980.5 845944583 847195923 848065555 848168910 847776055 847506166 847680211 848025501 848111749 847988427 848062873
2000.9H48062873L84807L38316l8683k33591l2007J91450K2292l70204m62950k25782
2021.3H47636521j35303m22477p73728p43389k99454R7513Q7440j32799j06216J81079
2041.7H45389187K50221j33276n84841n80788j66774J67191J99914J65105L52264O71088
2062.1H45729291P18475L60131J8954P4268K88069J79529k36392m82201k98739K8610
2082.5H46379995L2783k64764l63111m5479K77996J84536j69337k88367R54K64287
2102.9H46009493P4625l48747m45425j31429J00971j22607n34892n61118j69218R9480
2123.3H43971133o9499l31342j63496L29912N00441J53899j94609n3585L99769N34296
2143.7H45076919J86205p2361J94908O03676N23805m887l02434j5498L57390J78873
$$ plain form
2000.9 848062873 848447680 848785996 848747313 848513722 848481715 848673165 848695457 848325253 847862303 847636521
2021.3 847636521 847501218 847078741 846305013 845561624 845262170 845359683 845447123 845314324 845208108 845389187
2041.7 845389187 845639408 845506132 844921291 844340503 844173729 844340920 844540834 844705939 845058203 845729291
2062.1 845729291 846447766 846807897 846826851 846901119 847189188 847368717 847132325 846650124 846351385 846379995
2082.5 846379995 846412778 846148014 845784903 845739424 846017420 846201956 846032619 845744252 845745206 846009493
2102.9 846009493 846084118 845735371 845289946 845158517 845259488 845136881 844601989 844040871 843871653 843971133
2123.3 843971133 843901634 843570292 843406796 843736708 844237149 844391048 844196439 844142854 844542623 845076919
2143.7 845076919 845263124 845190763 845385671 845989347 846513152 846508265 846205831 846190333 846547723 846726596
2164.1H46726596l75151n55277j48058K41756N8473l98875m38750J133K41220j24097
2184.5H45228970o04927n01812P1645K97546j16169n61595m04060J05858J76370l07441
2204.8H43384385o34193l56973O9857m411m96208o98805l06189J21236l4511n34714
2225.2H40509474o41763j72138K30431K4438m07755l52323J72436M29034J2994n54323
2245.6H39250505n22733J0312K63274o1095m08292k35438J62541J10984m13537p15434
2266H37441087l90113O8725n37m12822m35710O6758M55439K29120k97070m04715M3452
2288.5H36363614L78668J23024l10302l08990J9431P3910l58582p94709o71386j65463
2308.9H34349215J8179l14116n61535l46601n603N6565q3566J7047M32849P37667N50329
$$ plain form
2164.1 846726596 846351445 845796168 845648110 845889866 845948339 845549464 845110714 845111847 845353067 845228970
2184.5 845228970 844624043 844122231 844193876 844491422 844375253 843813658 843409598 843515456 843691826 843384385
2204.8 843384385 842750192 842393219 842463076 842458665 841962457 841263652 840957463 841078699 841044188 840509474
2225.2 840509474 839867711 839695573 839926004 839950442 839542687 839190364 839362800 839791834 839804828 839250505
2245.6 839250505 838727772 838738084 839001358 838940263 838531971 838296533 838459074 838570058 838156521 837441087
2266 837441087 837050974 837119699 837119162 836706340 836270630 836337388 836792827 837021947 836724877 836320162 836363614
2288.5 836363614 836742282 836865306 836555004 836246014 836265445 836339355 835980773 835186064 834514678 834349215
2308.9 834349215 834367394 834053278 833491743 833145142 833139539 833196104 833112538 833129585 833562434 834300101 834850430
2331.3H34850430J2100l09825k13086m3810j16169k49744K9266M37558L34084j23441
2351.7H34607363n12541n14268k30790q1420k46226l85821k11120k801m6194k31028
2372.1H32145154k74360p9870J03951R5546q285n6744P75J02937J62602J85549K24888
2394.5H32602143L07679L68834L08096J82033J21176J30177R8228k4497j37031j62304
2414.9H33794534j59621j74046j66297r7751j3471j2755n9843n5790m8340j15394k00570
2437.4H32690656k12490j53482j05262j19627j44004j28747j11699j45793k08139k18630
2457.8H31142783j38640n5015p8619j88529k60413k42591k29180k83122l45945k82884
2478.1H29037845r3162J2279q3626k28345j76847K5868P8142q2552j97232q2493J06633
$$ plain form
2331.3 834850430 834862530 834552705 834339619 834295809 834179640 833929896 833959162 834396720 834730804 834607363
2351.7 834607363 834094822 833580554 833349764 833268344 833022118 832636297 832425177 832422376 832376182 832145154
2372.1 832145154 831870794 831790924 831894875 831990421 831982136 831925392 831926167 832029104 832191706 832377255 832602143
2394.5 832602143 832909822 833278656 833586752 833768785 833889961 834020138 834118366 834093869 833956838 833794534
2414.9 833794534 833634913 833460867 833294570 833196819 833183348 833170593 833110750 833054960 833006620 832891226 832690656
2437.4 832690656 832478166 832324684 832219422 832099795 831955791 831827044 831715345 831569552 831361413 831142783
2457.8 831142783 831004143 830949128 830870509 830681980 830421567 830178976 829949796 829666674 829320729 829037845
2478.1 829037845 828944683 828956962 828873336 828644991 828468144 828494012 828572154 828489602 828292370 828209877 828316510
2500.6H28316510O6697j78754l10123j71244N3584O6936j06632j60396K98J26958K0086
2523H27723920j57416j10685J09970J88411J0192k13206k06113O795J01149r0122k61962
2545.5H27100933j09971J70469K00868m3333k22385j38521L159r8645l65973m28975
2565.8H26067626j69158R7156L3200k18630k59101l9220J06931k0445k25901k17736
2586.2H25154722j8478L6002k12372m25815k55228J17779K62261Q2373q7917J6451
2606.6H24669778K28584K10166n0664j79231K2411K23101Q6128k06768k92182j37806
2627H24573517l0339j65760l66450l48747j47640n5313j90318l17812k01702L4034
2647.4H22783470J32024L9041n1319M6849K10107J96695p510j57774r8467K98m0710
$$ plain form
2500.6 828316510 828383207 828204453 827894330 827723086 827776670 827843606 827736974 827576578 827576876 827703834 827723920
2523 827723920 827566504 827455819 827565789 827754200 827764392 827551186 827345073 827351868 827453017 827362895 827100933
2545.5 827100933 826990962 827161431 827362299 827318966 827096581 826958060 826961219 826862574 826496601 826067626
2565.8 826067626 825898468 825995624 826028824 825810194 825551093 825511873 825618804 825598359 825372458 825154722
2586.2 825154722 825136244 825172246 824959874 824534059 824278831 824396610 824658871 824741244 824653327 824669778
2606.6 824669778 824898362 825108528 825057864 824878633 824901044 825124145 825210273 825003505 824711323 824573517
2627 824573517 824543178 824377418 824010968 823662221 823514581 823459268 823268950 822951138 822749436 822783470
2647.4 822783470 822915494 822954535 822903216 822950065 823160172 823356867 823349357 823191583 823093116 823093414 823052704
2669.9H23052704j75416k31087j15633J8954j6213j52468j55449J0729J27673P5161
2690.3H22438955n5611p2956P2539J64568M4525j61231k33411j58429r3520j35482
2710.7H21809947k08199j60753j1444M8756p7128k36690k47002j61052j84357l29256
2731.1H20242822l80099k52068j26898j85847l34919l82244l26395k77043l03209l83138
2751.4H17290962m02332k56240m6253K7358J5855P4685J57893J40964l8862l08394
2771.8H16655636m62413m17054l01540k38537k24233j60992k7240K1756q0943j95384
2792.2H14569056k15232j57297j30773k43544l77536l61145k30312j41680k24590l62695
2812.6H12124252l09229j20401m2975j35064k54214k47419j60694k05576m35829o25968
$$ plain form
2669.9 823052704 822877288 822646201 822530568 822549522 822533309 822380841 822225392 822236121 822363794 822438955
2690.3 822438955 822383344 822310388 822382927 822547495 822592020 822430789 822197378 822038949 821945429 821809947
2710.7 821809947 821601748 821440995 821429551 821478307 821401179 821164489 820917487 820756435 820572078 820242822
2731.1 820242822 819862723 819610655 819483757 819297910 818962991 818580747 818254352 817977309 817674100 817290962
2751.4 817290962 816888630 816632390 816586137 816613495 816629350 816704035 816861928 817002892 816964030 816655636
2771.8 816655636 816193223 815776169 815474629 815236092 815011859 814850867 814823627 814845383 814764440 814569056
2792.2 814569056 814353824 814196527 814065754 813822210 813444674 813083529 812853217 812711537 812486947 812124252
2812.6 812124252 811815023 811694622 811651647 811516583 811262369 811014950 810854256 810648680 810212851 809586883
2833H09586883n91338n05090p48634j308859j778662k164542k980710m734456q157253
2851.4G86617339j5027106k5839389l2833278k1970749N825401K7886212K9576003
2865.7G54234433J9812584J0941208N885243L179073J685679J000405O76989L94225
2882G97809839K14219N9724k73108p49469j255035j902819l357589o294609r287357
2900.3G74963796q365989k409041L608883N608916N042017M263639L556013K633333
2916.6G88901567J587391O98030K24233J29223J50144r000n19038j094996j514793
2935G88552761k065837k948821l943741m666507m681409l490031r91225J803935L340244
2953.4G70909369L495693L412008L440798L140986K437532J653731R74178M36246Q5175
$$ plain form
2833 809586883 808995545 808490455 807741821 806432962 804654300 802489758 799509048 794774592 786617339
2851.4 786617339 771590233 745750844 712917566 690946817 696772218 724658430 754234433
2865.7 754234433 774047017 784988225 790873468 794052541 795738220 796738625 797415614 797809839
2882 797809839 798024058 798083782 797810674 797061205 795806170 793903351 790545762 784251153 774963796
2900.3 774963796 766597807 764188766 767797649 773406565 778448582 782712221 786268234 788901567
2916.6 788901567 790488958 791186988 791411221 791540444 791690588 791681588 791162550 790067554 788552761
2935 788552761 786486924 783538103 779594362 774927855 770246446 766756415 765765190 767569125 770909369
2953.4 770909369 774405062 777817070 781257868 784398854 786836386 788490117 789464295 789900541 789985716
2971.7G89985716k14159o55651j251579k119541l485024m974186n200803l110409o55353
2990.1G68319011j767934p364153j2923241j1469186k405881N788803P852971O877244
3006.4G52907634N678892M771471M538357M129231K715051R98974K07126R77874K159178
3024.7G79083788K024591Q36432l72767j371324k052009k001167r86278M45843J376867
3043.1G76983976J201630J36793r12369j641035k477646l159403k504051l81053J557768
3061.5G68804610K212882J975894J479089J224518J421749J717508J831353J758218
3077.8G82425821J353442Q28326O78897P99954Q50201O92367L23832K1756j3649O0796
3098.2G88021743M2975l8028N0307L21567M06027J62184M7982K87175M40955K64585
$$ plain form
2971.7 789985716 789771557 789115906 787864327 785744786 782259762 777285576 772084773 768974364 768319011
2990.1 768319011 766551077 759186924 746263683 734794497 732388616 738177419 746030390 752907634
3006.4 752907634 758586526 763357997 767896354 772025585 774740636 775739610 775946736 776924610 779083788
3024.7 779083788 781108379 781944811 781572044 780200720 778148711 776147544 775161266 775607109 776983976
3043.1 776983976 778185606 778322399 777410030 775768995 773291349 770131946 767627895 767246842 768804610
3061.5 768804610 771017492 772993386 774472475 775696993 777118742 778836250 780667603 782425821
3077.8 782425821 783779263 784607589 785286486 786086440 786936641 787629008 787952840 787974596 787960947 788021743
3098.2 788021743 788064718 788026690 788076997 788398564 788804591 788966775 789014757 789301932 789742887 790007472
3118.6G90007472o3300k49803j23441P9274J14023N305j12235r4593k5034j14321l38793
3141G89084554m52936l58045k43068k06709j42276j05858j92761l11733m05967m41909
3161.4G86223292l85999l16978l23653l63171l36886k74956k36690k21670k77698l83555
3181.8G83102036m56751n19633o22690p44462p44402n48125l47435k98143l46004m11690
3202.2G78062701m16994l82900m45902n43714n24819m34041l78251l73542l76046l98457
3222.6G73788035m79341n71131o16193o16312o01590o63996p90476q34823p74920o56843
3243G67182410n00977m61102o09338o67036n19693m24444m99130n81502n52655m47809
3263.4G61918724l40164k81811k62856l29972m41193n31137o50287o73294n77927m99427
$$ plain form
3118.6 790007472 789944172 789694369 789570928 789650202 789764225 789769530 789657295 789562702 789537668 789423347 789084554
3141 789084554 788631618 788273573 788030505 787823796 787681520 787575662 787382901 787071168 786665201 786223292
3161.4 786223292 785837293 785520315 785196662 784833491 784496605 784221649 783984959 783763289 783485591 783102036
3181.8 783102036 782645285 782125652 781502962 780758500 780014098 779465973 779118538 778820395 778474391 778062701
3202.2 778062701 777645707 777262807 776816905 776273191 775748372 775314331 774936080 774562538 774186492 773788035
3222.6 773788035 773308694 772737563 772121370 771505058 770903468 770239472 769448996 768614173 767839253 767182410
3243 767182410 766681433 766220331 765610993 764943957 764424264 763999820 763500690 762919188 762366533 761918724
3263.4 761918724 761578560 761296749 761033893 760703921 760262728 759731591 759081304 758408010 757830083 757330656
3283.8G57330656m76301n14328n19276n18262o45936q37981r94325r95457p28786m16935
3304.2G50683069n26905j029312j378537j381755j265049j250028j300454j303911
3320.5G41247118j236022j166224j343191j620412j644313j534522j462519j465798
3336.8G29774117j643240j861036j947999k041518k046228j844406j857162k140522
3353.1G14392006k228081k104044k034724k094984k116203j985609j954794k141953
3369.4F97731614k323806k306342k128899j980722j923263j887918j805425j653492
3385.7F81721747j469076j293719j260399j409054j422048j127481r05931j086951
3402.1F71747088j334130j245559j026451r47416r29654r07421q95917q54373p87079
$$ plain form
3283.8 757330656 756854355 756340027 755820751 755302489 754656553 753818572 752824247 751828790 751100004 750683069
3304.2 750683069 750156164 749126852 747748315 746366560 745101511 743851483 742551029 741247118
3320.5 741247118 740011096 738844872 737501681 735881269 734236956 732702434 731239915 729774117
3336.8 729774117 728130877 726269841 724321842 722280324 720234096 718389690 716532528 714392006
3353.1 714392006 712163925 710059881 708025157 705930173 703813970 701828361 699873567 697731614
3369.4 697731614 695407808 693101466 690972567 688991845 687068582 685180664 683375239 681721747
3385.7 681721747 680252671 678958952 677698553 676289499 674867451 673739970 672834039 671747088
3402.1 671747088 670412958 669167399 668140948 667193532 666263878 665356457 664460540 663606167 662819088
3420.4F62819088p14839o58929o50764o38366o21914o28710n74410m33922l60072m27127
3440.8F57110035n46693o18697n87761m28617r3877L58224P37190R19461R78291J012087
3461.2F58839643R53317P96616P96973J092256J444518J616120J622499J562655J501679
3479.6F70226276J437187J275659J095175J011432R16004P61449O68884O64472O57857
3497.9F78714395O97732Q50141J043498J146972J172960J241982J382649J504600J540244
3516.3F89295173J529634J486718J500368J559496J518906J429140J405835J420677
3532.6G01145947J448035J458287J374245J289427J309216J410127J508892J468718
3548.9G12412894J336634J310408J345575J331508J324654J356601J386345J384437
$$ plain form
3420.4 662819088 662104249 661445320 660794556 660156190 659534276 658905566 658331156 657897234 657537162 657110035
3440.8 657110035 656563342 655944645 655356884 654928267 654834390 655192614 655929804 656849265 657827556 658839643
3461.2 658839643 659792960 660589576 661386549 662478805 663923323 665539443 667161942 668724597 670226276
3479.6 670226276 671663463 672939122 674034297 675045729 675961733 676723182 677392066 678056538 678714395
3497.9 678714395 679412127 680262268 681305766 682452738 683625698 684867680 686250329 687754929 689295173
3516.3 689295173 690824807 692311525 693811893 695371389 696890295 698319435 699725270 701145947
3532.6 701145947 702593982 704052269 705426514 706715941 708025157 709435284 710944176 712412894
3548.9 712412894 713749528 715059936 716405511 717737019 719061673 720418274 721804619 723189056
3565.2G23189056J468182J641809J702488J708329J756787J716733J636863J669109
3581.5G36489356J685798J607239J587510J655221J666963J689613J706004J632333
3597.9G49720037J521468J544535J629949J472533J277983J340091J480460J531363
3614.2G61518419J375437J213133J396656J522958J271129Q12113O07789J068771J346349
3632.5G72132754J219988J011789P82371O78837P22229O32644K63810J59323P32303
3650.9G78336048R57310O98150O72102P51852N69225L79741K80619p987k14696J34766
3671.3G82557130J47879k24650O8784M74632N51939N33580L45290R8288Q5712L95059
3691.7G85033643N93722L99947L4631j51873L0458L38495K34008j68384l98278j28567
$$ plain form
3565.2 723189056 724657238 726299047 728001535 729709864 731466651 733183384 734820247 736489356
3581.5 736489356 738175154 739782393 741369903 743025124 744692087 746381700 748087704 749720037
3597.9 749720037 751241505 752786040 754415989 755888522 757166505 758506596 759987056 761518419
3614.2 761518419 762893856 764106989 765503645 767026603 768297732 769109845 769717634 770786405 772132754
3632.5 772132754 773352742 774364531 775146902 775825739 776547968 777180612 777444422 777603745 778336048
3650.9 778336048 779293358 779991508 780663610 781415462 781984687 782364428 782645047 782637060 782422364 782557130
3671.3 782557130 782705009 782480359 782549143 783023775 783575714 784109294 784454584 784552872 784638584 785033643
3691.7 785033643 785627365 786027312 786061943 785910070 785940528 786279023 786513031 786344647 785946369 785817802
3712.1G85817802K62082J52528j18256j43826l3319m1008p1048l279j7166j03950j02818
3734.5G85597742J76131M76480J99258m63664n64456J4186j9193j33217K83301L31819
3754.9G85898387j2517j03235J63079J93297o3240k34604k27332k146J61231P5817
3775.3G85848737j1862l6358q1897j46449j07765O4254J73151P7010k16127l92318
3795.7G85170376k55346k52426k52902q464m0889J9491K67982J51217k51233m41373
3816.1G84106433k47418k34604j10269J49310Q2254O378k5630l5525m0352k96771m40062
3838.5G82913744q8870J66476J78754J29938l2425m43220r16064l55303M40896L20673
3858.9G82314599l8803k66075k23696j71006l11971k11358K1041J09195P5400j27673
$$ plain form
3712.1 785817802 786079884 786232412 786114156 785970330 785937011 785896003 785824955 785821676 785804510 785700560 785597742
3734.5 785597742 785773873 786250353 786449611 785985947 785421491 785435677 785416484 785283267 785566568 785898387
3754.9 785898387 785885870 785782635 785945714 786139011 786075771 785841167 785613835 785611689 785772920 785848737
3775.3 785848737 785836875 785800517 785718620 785572171 785464406 785528660 785701811 785778821 785562694 785170376
3795.7 785170376 784915030 784662604 784409702 784401238 784360349 784379840 784647822 784799039 784547806 784106433
3816.1 784106433 783859015 783624411 783514142 783663452 783745706 783752084 783726454 783690929 783650577 783353806 782913744
3838.5 782913744 782824874 782991350 783170104 783300042 783267617 782824397 781908333 781553030 781993926 782314599
3858.9 782314599 782275796 782009721 781786025 781615019 781303048 781091690 781112731 781221926 781297326 781169653
3879.3G81169653r3758L0398p9751p1525q7321j29938J5139J2398k24590l85404l07798
3901.8G79847503p9036K14159L28124J78099k8670k11418l01957j81913n6446j39773
3922.1G79568672k14755j19090q1778j70946j51992l8385m9234j13129j16527j04249
3942.5G78408587o6102l5822J5736Q9168K6882q0049m2856N3465K5034n9187k0444
3965G78314412J01387J12474K861o6936p3850n5134m1485m6551r2507j85728k00271
3987.4G77768672j47641j65165k30610k37346j67846
3997.6G76820064
$$ plain form
3879.3 781169653 781075895 781106293 781026542 780955017 780867696 780737758 780752897 780765295 780540705 780155301 779847503
3901.8 779847503 779768467 779982626 780310750 780488849 780460179 780248761 779946804 779764891 779708445 779568672
3922.1 779568672 779353917 779234827 779153049 778982103 778830111 778791726 778742492 778629363 778512836 778408587
3942.5 778408587 778342485 778306663 778322399 778411567 778438449 778358400 778315544 778369009 778394043 778334856 778314412
3965 778314412 778415799 778528273 778531134 778464198 778390348 778335214 778293729 778247178 778154671 777968943 777768672
3987.4 777768672 777621031 777455866 777225256 776987910 776820064
3997.6 776820064
##END=$$ End of the data block
