##TITLE=Diogo - 1 -  Cl $$ Begin of the data block
##JCAMP-DX=5.00 $$ ACD/SpecManager v 10.08
##SPECTROMETER/DATA SYSTEM=Alpha
##DATE=22 Oct 2014 10:39:34
##DATA TYPE=INFRARED SPECTRUM
##DATA CLASS=XYDATA
##ORIGIN=
##OWNER=
##NPOINTS=1765
##FIRSTX=399.76428223
##LASTX=3997.64306641
##MAXX=3997.64306641
##MINX=399.76428223
##MAXY=0.85224682
##MINY=0.42915949
##XFACTOR=1.0000000000
##YFACTOR=1.000000000000000e-9
##FIRSTY=0.83716094
##DELTAX=2.03961372
##XUNITS=1/CM
##YUNITS=ARBITRARY UNITS
##XYDATA=(X++(Y..Y))
399.8H37160945m352689l162265o37293J155615N24640l600299j0174870j3025880
416.1H03887904n627454Q160532J0037959N894005N828798O622135L984273m42505
432.4H38345647j615167Q73745K383172K87533k538979j811504Q79287N04971j955271
450.8H35353434k014398O48558J831948j338541m776359l890514q39889J58310q22365
469.1H24310184k31743K808451M353166J916408j220583r75848J398504J372993j490891
487.5H32240641l177225k035678j621306m261672o218136o272077q232951p218123
503.8G93203473K506018J0551333R546936N664408K229929q52704j085639J614272
520.1H23378026L012300J094818j301825r00507O71566j139820o147742p154823m12583
$$ y = [837160945, 832808256, 829645991, 829008698, 830164313, 830688953, 827088654, 816913784, 803887904, 798260450, 806420982, 816458941, 822352946, 828181744, 834803879, 838788152, 838345647, 836730480, 837604225, 839987397, 840274930, 837735951, 835924447, 836803734, 837308705, 835353434, 833339036, 833987594, 835819542, 834481001, 829704642, 825814128, 824974239, 825132549, 824310184, 824078441, 826886892, 831240058, 833156466, 831935883, 830960035, 832358539, 833731532, 832240641, 829063416, 827027738, 825406432, 821144760, 814926624, 808654547, 800421596, 793203473, 795709491, 806260824, 815807760, 821472168, 823702097, 822849393, 821763754, 823378026, 826390326, 827485144, 826183319, 825282812, 825954378, 824814558, 818666816, 811511993, 811099410]
538.5H11099410N724073L509402j934946j795709L203631N174338K081514o77169J33276
556.8H26517820J887977J194478j060784j348198P52449J826108J10030j657069p06672
575.2H27516139J365959J293481p81060j649201K981J380086R1016j944721j462400
593.5H25812280J158834K395570P82311r31323k40922J120210L80457j328826q06332
611.9H28342259J542032K442181P13467j324832r64165J183272K011895L17752j213848
630.2H33050013n78404J19805j271843l359080l819346k019644J270413M065216M851997
648.6H32309127M567921M292011L014982M98414q56459L10898J756251J287460k38776
667H46941829j274824m27008m45306k452314l248513p03335J790643J904964R82464
$$ y = [811099410, 816823483, 820332885, 818397939, 816602230, 819805861, 824980199, 827061713, 826384544, 826517820, 828405797, 829600275, 828539491, 827191293, 827943742, 829769850, 829879880, 828222811, 827516139, 828882098, 830175579, 829394519, 827745318, 827748299, 829128385, 829219401, 827274680, 825812280, 826971114, 829366684, 830148995, 829217672, 828976750, 830096960, 830477417, 829148591, 828342259, 829884291, 832326472, 833039939, 831715107, 830750942, 831934214, 833946109, 834263861, 833050013, 832471609, 832591414, 831319571, 827960491, 824141145, 822121501, 823391914, 827457130, 832309127, 836877048, 841169059, 844184041, 844682455, 843825996, 844136894, 845893145, 847180605, 846941829, 845667005, 845239997, 844794691, 842342377, 839093864, 838390529, 840181172, 842086136, 843068600]
685.3H43068600K91109M38809N57482r58383k702295j008690L205836M447460J641274
703.7H48981202r97723p08103P64609o05464m416108l695906K438188N617857L123641
722H50502193j5497n91278L49819j23679l049791n260408k787769K400160M046202
740.4H45469952J133263j728952j910091o01649L24607N49674J059949K023757J883626
758.7H48204136K00927q37982K67387J879454J586437k76685j202524j26898R33766
777.1H50628018j03652k206981k922297k670884m806399j1677325j8010676j1972606
793.4G96257198L321409J1419058J0768592Q662343O671369M340172O34670l075361
809.7H38999450m143834l128350l596604r883940k2981345k5186420K4498K3196399
$$ y = [843068600, 843359709, 843798518, 844356000, 843397617, 840695322, 839686632, 842892468, 847339928, 848981202, 847983479, 847275376, 848039985, 847434521, 843018413, 839322507, 841760695, 847378552, 850502193, 850486696, 849895418, 850245237, 850121558, 847071767, 841811359, 839023590, 841423750, 845469952, 846603215, 844874263, 842964172, 842362523, 842687130, 843236804, 844296753, 846320510, 848204136, 848405063, 847567081, 847834468, 849713922, 851300359, 851023674, 849821150, 849694252, 850628018, 850524366, 848317385, 845395088, 842724204, 837917805, 826240480, 808229804, 796257198, 799578607, 810997665, 821766257, 830428600, 837099969, 841440141, 842074811, 838999450, 834855616, 831727266, 828130662, 818246722, 795265377, 770078957, 770103455, 793299854]
826G93299854J5182018l320336p552147M75168R480298J1613130N509675l783644j1231124
844.4H09672892r746551L654599J5279948J4648021O949305n64336k058149L143370
860.7H40979099O607771L975332J58429j020610o79970k129197n184293l835857K779544
879.1H41650248O391644L954947K49982j532197j757860k687514m639983m266382j26063
897.4H37236822L551662K698898j117826l122866j368701M78446l04818j014709l93272
915.8H36643636p59721k165615l508628n683660r293377j4013947j8753290j9030332
932.1G63435066j0701597L015280J5087783K0795465J9058406J3150752P983207M932702
948.4H36757064K382636J3769j171530j788795l367603l615200n90920J375019m8339
$$ y = [793299854, 808481872, 805161536, 797609389, 798084557, 807564855, 819177985, 824687660, 820904016, 809672892, 799926341, 803580940, 818860888, 833508909, 840458214, 839893878, 837835729, 840979099, 847586870, 851562202, 851720631, 850700021, 850020051, 847890854, 842706561, 838870704, 841650248, 848041892, 851996839, 852246821, 850714624, 848956764, 846269250, 841629267, 837362885, 837236822, 840788484, 843487382, 842369556, 839246690, 837877989, 838356435, 838051617, 837036908, 836643636, 835883915, 833718300, 830209672, 824526012, 815232635, 801218688, 782465398, 763435066, 752733469, 755748749, 770836532, 791631997, 810690403, 823841155, 831824362, 836757064, 839139700, 839153469, 837981939, 836193144, 832825541, 829210341, 828619421, 829994440, 829946101]
966.8H29946101j998425l084361k625764K04146K927363K849758J089394O7651J98722
985.1H29574585J27017j040279k545178l280640l929675o251454j0108411j2812913
1001.4G89733052j2563407j0386408r070158n993902K850294Q503497O142854L727675
1017.8G72943497J879394k726138p248759q352041p558048n722344J364350J2186408
1034.1G56766319J7089248J3539731Q320332N676150M516185K864122P48694p17163
1050.4H08803618j224101j024723k00808O90341Q12054m1187j884878m335701o374955
1068.8G95219660o585419m585147k609968k680064l722906n763113j1619270j8922568
1085.1G38731205j7236411l463626R562373J3640046J4309407J4786839J2644410P694364
$$ y = [829946101, 827947676, 824863315, 822237551, 822441697, 825369060, 828218818, 829308212, 829375863, 829574585, 829701602, 828661323, 826116145, 822835505, 818905830, 812654376, 802545965, 789733052, 777169645, 766783237, 757713079, 751719177, 754569471, 763072968, 769215822, 772943497, 774822891, 772096753, 764847994, 756495953, 748937905, 743215561, 744579911, 756766319, 773855567, 787395298, 795715630, 801391780, 805907965, 808772087, 809520781, 808803618, 807579517, 806554794, 806353986, 807044327, 807856381, 807815194, 805930316, 801594615, 795219660, 788634241, 784049094, 781439126, 778759062, 775036156, 769273043, 757653773, 738731205, 721494794, 718031168, 727593541, 741233587, 755542994, 770329833, 782974243, 790668607]
1101.4G90668607K532542q3864N85019J792431N67079l004849o550729o866754l138899
1119.8G76500583J740515N444944P312715P003009N426109L485084J686930Q67367
1136.1H09467256R73880R24766J95921n45979n65529j56283l11494j188934j920342
1154.4H06873262k010405k048075k676368l584623m101694m439533n632937q352339
1170.7G74027288j2650311j7603517j9982695j6095579r597719q844137j4262080k1811902
1187.1F53179348k8724969k7933597j2612641J0740697K5016666K2238790J1861682
1201.3F53765976O043911O304622Q395910J0760963J3290286J3831497J0033548K720057
1217.7G25146770l428339l471196J589358N837977O533861N941570O331503P648468
$$ y = [790668607, 793201149, 793117285, 793702304, 795494735, 796061814, 793056965, 786506236, 779639482, 776500583, 778241098, 783686042, 790998757, 798001766, 803427875, 806912959, 808599889, 809467256, 810441136, 811365902, 811561823, 811015844, 810450315, 810294032, 809982538, 808793604, 806873262, 804862857, 802814782, 800138414, 796553791, 792452097, 788012564, 782379627, 774027288, 761376977, 743773460, 723790765, 707695186, 698097467, 689253330, 674991250, 653179348, 624454379, 596520782, 583908141, 594648838, 619665504, 641904294, 653765976, 659809887, 666114509, 674510419, 685271382, 698561668, 712393165, 722426713, 725146770, 721718431, 718247235, 719836593, 725674570, 732208431, 738150001, 744481504, 752129972]
1234G52129972Q538961P845700O128252N075812M763067L524184P41780k212703l940761
1252.3G82594264m585267m725158m263043l757060m410982n181551l453672j33574
1268.6G52083957J1206n467296j4469623k4238289l1462073k7970135j0280490L708482
1285F41915739m744530k3876667k9341400j5312791P585228K6868045L3740759K3471057
1301.3F60305440O78897j5661359j1924386o55114K130270q86560j663983J664103
1317.6F33987308P407665J3147116J6503989J6567230J4934659J3853193J3640821
1331.9G30041981J3486624J2635529J0867953Q379042N467951L309131K475738K256573
1348.2G88920522J650929K21789j512289k823055l458023m373073p467926j2599528
$$ y = [752129972, 760668933, 768514633, 774642885, 779718697, 784481764, 788005948, 788747728, 786535025, 782594264, 778008997, 773283839, 769020796, 765263736, 760852754, 755671203, 752217531, 752083957, 752095163, 746627867, 732158244, 707919955, 676457882, 648487747, 638207257, 641915739, 637171209, 613294542, 583953142, 568640351, 576225579, 603093624, 636834383, 660305440, 660984337, 645322978, 633398592, 632743478, 634873748, 633987188, 632323205, 633987308, 641394973, 654542089, 671046078, 687613308, 702547967, 716401160, 730041981, 743528605, 756164134, 767032087, 775411129, 780879080, 784188211, 786663949, 788920522, 790571451, 790793240, 789280951, 786457896, 782999873, 778626800, 771158874, 758559346]
1364.5G58559346j5724003j2428165k239644O670058M881739j0211229k5393605k0335138
1380.8F83779359L189206K0185173K1774113J4277816L829479m867494r258509k924860
1397.1G29984283J0501564J1641860O29842r75072Q027971J1252463P028520K815842
1413.5G80907273J256049J753926L525019M354179M578292M369974L263235K133728
1429.8H06141675Q24272J19329Q37385Q90553j90556k5630P65920J164675R72449P4566
1450.2H11574638p25508o75261O9022n64873k151310j368881Q54075J702488P43806
1468.5H09458196N63920J306355O62684j363218l819942q230210j5220940j7436981
1484.9G65919864p898450N737245Q909583N326808O858945J1202872R744167M830778
$$ y = [758559346, 742835343, 730407178, 728167534, 734837592, 739719331, 729508102, 704114497, 683779359, 686968565, 707153738, 728927851, 743205667, 747035146, 742167652, 732909143, 729984283, 740485847, 752127707, 752757549, 751782477, 759810448, 771062911, 778091431, 780907273, 782163322, 783917248, 787442267, 791796446, 796374738, 800744712, 804007947, 806141675, 806965947, 807085276, 807922661, 808813214, 808622658, 808597028, 809362948, 810527623, 811500072, 811574638, 810849130, 810173869, 810242891, 809678018, 807526708, 806157827, 807011902, 808714390, 809458196, 810022116, 811328471, 811991155, 810627937, 806807995, 798577785, 783356845, 765919864, 758021414, 763758659, 772668242, 777995050, 784853995, 796056867, 805801034, 810631812]
1501.2H10631812K304554K599656L226340O73473k80261N15222R74358P35461N28753
1519.5H21909368J043081L86954o53386q11398q21949k03967J78874q56519q38578
1537.9H19332480R34780N14329j425446j963436j611948j061261j263439k105594k706886
1556.2H08643579l336310n519509m090905P34925L882527K670467j283526n057931
1572.6G96643317p495523j0829508j4109790j7519236j9081116r494900Q150816J6838073
1588.9G43102133J1465133K337217l386915n435407n313933m871428n111575o226897
1605.2G26558328q495331j1376798j2099028r491026p930518j1389791j2819231m556000
1621.5F48400605J2484729K4669468K3573518J6402304Q898974O440103P475734N109429
$$ y = [810631812, 812936366, 815536022, 818762362, 819435835, 819155574, 819670796, 820645154, 821380615, 821909368, 822952449, 823339403, 822686017, 821874619, 821052670, 820848703, 821027577, 820171058, 819332480, 820267260, 820781589, 819356143, 817392707, 815780759, 814719498, 813456059, 811350465, 808643579, 805307269, 799787760, 795696855, 796431780, 800314307, 802984774, 801701248, 796643317, 789147794, 778318286, 764208496, 746689260, 727608144, 718113244, 726264060, 743102133, 754567266, 756904483, 753517568, 748082161, 742768228, 737896800, 732785225, 726558328, 718062997, 706686199, 694587171, 685096145, 677165627, 665775836, 652956605, 648400605, 660885334, 685554802, 709128320, 725530624, 734429598, 740869701, 748345435, 753454864]
1637.8G53454864K145946J984298L074467N547345N745471K452850L295004N723894
1654.1G83424139K235293R24886J914084K725720K215862J203299J645088J781762
1670.5G98070133L99768M20749N38349p10904j223266j58549Q50976j041234k370119
1688.8G94775903k432823k316415k156854k898455l966629m239857m420936n107761
1705.1G67236173o597996q159816r283900j0308921j1875630j5131235j7117143j7350256
1721.5F71411276k1131456k7643800l3681810l8327694m0405810m4904530l4473806
1735.7D30842370j682878L4879476O0065866O0281396M7054529L1567096K0069838
1750F83077693J1387944N167604K147853n27143m474044q482874j1732638j3930678
$$ y = [753454864, 755600810, 757585108, 760659575, 766206920, 771952391, 774405241, 777700245, 783424139, 785659432, 786584318, 788498402, 791224122, 793439984, 794643283, 796288371, 798070133, 798469901, 798890650, 799428999, 798718095, 797494829, 797336280, 798187256, 797146022, 794775903, 792343080, 790026665, 787869811, 784971356, 781004727, 776764870, 772343934, 767236173, 760638177, 752478361, 743194461, 732885540, 721009910, 705878675, 688761532, 671411276, 650279820, 622636020, 588954210, 550626516, 510220706, 465316176, 430842370, 429159492, 464038968, 524104834, 584386230, 631440759, 663007855, 683077693, 694465637, 699633241, 701781094, 701253951, 696779907, 688297033, 676564395, 662633717]
1766.3F62633717j2107551J000345K0617842K5929571J7019748R817243O331682N589664
1782.6G36832261P462919R060800Q535743Q445739Q403063N584955L253162L296554
1799G90875196L723026L200888K309323K019465K062440J800477Q92759K61783M40538
1817.3H07585895P07209O26207N88059O78480O06239Q92221N73039k64048j49012L77596
1837.7H12221885L11374J27674N14745M60923n0247j36554k03609k92778p2837J65701
1858.1H13046277m352n05328p84516l66151M74035M93110j96219j85490K95520N02706
1878.5H12769592K64764n6088r3222O3837J61945k31206o54101k91944K00749P8856
1898.9H12213182k79665l62992m3392K86996J59681l55422o13690k14636L99053K52664
$$ y = [662633717, 650526166, 651526511, 672144353, 698073924, 715093672, 724910915, 731242597, 736832261, 744295180, 753355980, 761891723, 770337462, 778740525, 784325480, 787578642, 790875196, 794598222, 797799110, 800108433, 802127898, 804190338, 805990815, 806883574, 807145357, 807585895, 808293104, 808919311, 809507370, 810185850, 810792089, 811684310, 812257349, 811993301, 811844289, 812221885, 812533259, 812660933, 813175678, 813636601, 813586354, 813449800, 813246191, 812953413, 812880576, 813046277, 813041925, 812536597, 811752081, 811385930, 811859965, 812353075, 812156856, 811971366, 812266886, 812769592, 813034356, 812978268, 812885046, 812948883, 813110828, 812879622, 812225521, 811933577, 812134326, 812213182, 811933517, 811570525, 811527133, 811814129, 811973810, 811618388, 811004698, 810790062, 811189115, 811441779]
1919.3H11441779l25620k71738p9989k03967m18842m30167q5234K60949K19166q643
1939.7H10097694K13027N59032L53873j15573l60489j39892K48193K05398k04801l57748
1960.1H10498714j02043J48893N9485k77161l57151K1219K51949n5731l80039k26319
1980.5H09581816J30832J18733k40624m02033m4704L06547m17m92037m74989n4300
2000.9H08428824J71900q3983m00663l04520L8743R3818k07663l88920j93775P2360
2021.3H07226121k6226l81946m23312n3108J94847l6597m03166l30329J03236K41518
2041.7H06111038j59145n01513l15011M3691j014l88682m83870n1439L63529K69472
2062.1H04887056m2975m4524K69711L89039K2888l39090j58608K63989K74539j18435
$$ y = [811441779, 811116159, 810844421, 810764432, 810560465, 810141623, 809711456, 809626222, 809887171, 810106337, 810097694, 810310721, 810869753, 811223626, 811108053, 810747564, 810607672, 810855865, 811061263, 810856462, 810498714, 810396671, 810545564, 810605049, 810327888, 809970737, 809991956, 810243905, 810188174, 809808135, 809581816, 809712648, 809831381, 809590757, 809188724, 809144020, 809450567, 809450150, 808958113, 808483124, 808428824, 808600724, 808516741, 808116078, 807811558, 807850301, 807944119, 807736456, 807347536, 807153761, 807226121, 807199895, 806817949, 806394637, 806341529, 806536376, 806499779, 806096613, 805766284, 805869520, 806111038, 805951893, 805450380, 805135369, 805179060, 805178046, 804789364, 804305494, 804254055, 804617584, 804887056, 804844081, 804799557, 805069268, 805458307, 805481195, 805142105, 804983497, 805247486, 805522025, 805403590]
2082.5H05403590k89619J6093L07203J32084k61903k92003Q0764K69473j312k89797
2102.9H05074573j42754K14339K25961j50323l61562j31964J43408M8936k65122l15368
2123.3H04340124P808K24412q404l09408j86205J83701K46227n9604k20359L3319L03507
2145.7H04555118J57535j94847k44320P0036K81334J03116j71125j07050J87516K27034
2166.1H04864347n3287k31802n6505J96337J42336j48296k32160o0J60933j609k67387
2188.5H04372847k68161l0935P7546q8394k53677j51575O4611O1453j51873k47657
2208.9H03384185r3997O7592k384k09511k63989p7605Q3208j6451j96039j69277q35
2231.4H02504897O2585m8339j62483r6738L8147q881k11358k83957j39892j2636o3300
$$ y = [805403590, 805113971, 805130064, 805437267, 805569351, 805307448, 805015445, 805096209, 805365682, 805364370, 805074573, 804931819, 805146158, 805372119, 805221796, 804860234, 804728270, 804871678, 804920614, 804655492, 804340124, 804347932, 804572344, 804563940, 804254532, 804068327, 804252028, 804498255, 804438651, 804218292, 804251611, 804555118, 804712653, 804517806, 804273486, 804343522, 804624856, 804727972, 804556847, 804449797, 804637313, 804864347, 804811060, 804579258, 804522753, 804719090, 804861426, 804713130, 804480970, 804480910, 804641843, 804640234, 804372847, 804104686, 804073751, 804151297, 804062903, 803809226, 803657651, 803722262, 803783715, 803631842, 803384185, 803290188, 803357780, 803355396, 803145885, 802881896, 802804291, 802887499, 802871048, 802675009, 802505732, 802504897, 802567482, 802519143, 802356660, 802259922, 802298069, 802289188, 802077830, 801793873, 801653981, 801641345, 801578045]
2253.8H01578045j69754j43707J0014R3221j1325j59919j49369k2531J1683p8678j63675
2276.2H00794005j50442p9512r3699j71184j59264m2796Q3446Q9586m6074j15752j4186
2298.7H00094128M8756p7426k03312j41978K1994J12653P4625n722L6120K54870M27723
2321.1H00642431L54230J35720O4909L09647M90605J85013j66714o5446K98262N10394
2341.5H02759051O07968K43127j037002j636624p07269O34015J093030R56714O21975
2359.9H03534985R9837k77876k60711j63377k89559n60522o99341o36578o15179p49648
2380.2G99382031q42750o65784l15726r7334j25587k02120j47402k4378l994j26540
2400.6G96830416j89424o9797P9632N4240j16408j70648m291J10984k8909k08080j71423
$$ y = [801578045, 801408291, 801264584, 801274598, 801367819, 801356494, 801196575, 801047206, 801024675, 801036358, 800957680, 800794005, 800643563, 800564051, 800470352, 800299168, 800139904, 800097108, 800180554, 800270140, 800224066, 800108314, 800094128, 800142884, 800065458, 799862146, 799720168, 799742162, 799854815, 799929440, 799923718, 799959838, 800214708, 800642431, 800996661, 801132381, 801197290, 801506937, 801997542, 802182555, 802015841, 801950395, 802248657, 802759051, 803367019, 803610146, 802573144, 800936520, 800229251, 800863266, 801956296, 802913010, 803534985, 803634822, 803356946, 803096235, 802932858, 802643299, 802082777, 801383436, 800746858, 800131679, 799382031, 798539281, 797873497, 797557771, 797460437, 797334850, 797132730, 796985328, 796960950, 796956956, 796830416, 796640992, 796571195, 796650827, 796705067, 796588659, 796418011, 796413720, 796524704, 796495795, 796287715, 796116292]
2423.1G96116292l457L6359j20520k42710j09792R7811N4240j67787k25663n7638O8963
2445.5G95446098k5392k11358k11835l7312K086j74463k90751j76668m113j1504j84476
2467.9G94120312k70307j52290j3828m9592k04265k33173n1677O2465q4519k43485
2488.3G92879641j75178j2875n185j49310k13086q6785N2214N603j54496j82032k8074
2510.8G91930437P5877n365j22308q9765L3200L8504r2148j70648q8871L1292p15j54674
2535.3G91384816k11239j05738j4484p5162j75774j60694m8459K0147p1049k16603
2555.6G90325761k12372j01327r5845k00689j97827j0431J63078J37270j3113q6487
2576G89708018k5689K1338n1439j59204j43706l1352q405j06573j93834j42872j0252
$$ y = [796116292, 796112835, 796149194, 796028674, 795785964, 795676172, 795773983, 795828223, 795660436, 795434773, 795377135, 795446098, 795420706, 795209348, 794997513, 794960201, 794962287, 794787824, 794497073, 794320405, 794316292, 794304788, 794120312, 793850005, 793697715, 793683887, 793634295, 793430030, 793196857, 793145180, 793207645, 793123126, 792879641, 792704463, 792691588, 792686403, 792537093, 792324007, 792237222, 792289436, 792295039, 792140543, 791958511, 791930437, 792006314, 792000949, 791878641, 791788876, 791822076, 791860580, 791768432, 791597784, 791508913, 791540205, 791539490, 791384816, 791173577, 791067839, 791053355, 790978193, 790802419, 790641725, 790593266, 790613413, 790542364, 790325761, 790113389, 790012062, 789916217, 789715528, 789517701, 789507270, 789670348, 789807618, 789794505, 789708018, 789682329, 789703667, 789652228, 789493024, 789349318, 789317966, 789309561, 789202988, 789009154, 788866282, 788856030]
2598.5G88856030J9311r0837j60694m5359R5844O3658p1705j28507o3181j3411p8619
2620.9G88382530j67012j49310o0200n6327j70290k25544j06752K6286j9014j57059
2641.3G87297308j81973q7380m9293j33693j98901j43468l7670j6511r3758j48475
2661.7G86206186r5487M17p450j14560j40369l8266L1352k8193j25647j36495o2584
2684.1G85488904l0816j04249j42037p9155j6571j1861p8320j30356r0599l7074l2246
2706.6G84735620o7055j19209j31012j00016q7559r2745q2553l8087q047q7559k01344
2729G83720434j78516n2273J6868m6909j80781k31981j57416r1672j44124k45512k57849
2751.4G82150269j61410p0095o0677n5969m947j3173j25647k08735j66178l6299L1233
$$ y = [788856030, 788875341, 788784504, 788623810, 788578451, 788674295, 788737953, 788666248, 788537741, 788474560, 788461149, 788382530, 788215518, 788066208, 788006008, 787949681, 787779391, 787553847, 787447095, 787473381, 787454367, 787297308, 787115335, 787027955, 786978662, 786844969, 786646068, 786502600, 786464930, 786448419, 786354661, 786206186, 786110699, 786111116, 786103666, 785989106, 785848737, 785810471, 785841823, 785813630, 785687983, 785551488, 785488904, 785458088, 785353839, 785211802, 785132647, 785116076, 785104215, 785025895, 784895539, 784804940, 784767866, 784735620, 784668565, 784549356, 784418344, 784318328, 784230769, 784138024, 784055471, 784017384, 784009337, 783921778, 783720434, 783541918, 783489645, 783506513, 783459604, 783278823, 783046842, 782889426, 782797754, 782653630, 782408118, 782150269, 781988859, 781918764, 781858087, 781802118, 781797171, 781783998, 781658351, 781449616, 781283438, 781247139, 781278372]
2773.9G81278372r4950k41101j90973p9215j08540j94013j74761p3969k7955j08242
2794.3G79984653k02835j93119j17957q2076j50442k16544j23918l4570j43588k87712
2814.7G78431892k79247j34707l9816j30415k70903k72810j81973j69456k65122l30806
2835.1G76356637k51710k24709m52638p05958p08401n81026o33061q58426j078844
2853.4G70861864j406968k099573l063262l337741j745939J004279K646446K481282
2869.7G65340388J689792J046240N97775L71754K38538R7692L5167R179p6175k07961
2890.1G69142389k72810k38121k78294m74989o98269q92579j083613j117706q07524
2908.5G63278484k82645J37746K69652J84417M5418m5716j3650N9486O1690J2994j32501
$$ y = [781278372, 781183422, 780942321, 780751348, 780672133, 780563593, 780369580, 780194819, 780120850, 780092895, 779984653, 779781818, 779588699, 779470742, 779388666, 779238224, 779021680, 778897762, 778863192, 778719604, 778431892, 778152645, 778017938, 777978122, 777847707, 777576804, 777303994, 777122021, 776952565, 776687443, 776356637, 776104927, 775880218, 775427580, 774721622, 774013221, 773432195, 772799134, 771940708, 770861864, 769454896, 767355323, 764292061, 760954320, 759208381, 760212660, 762859106, 765340388, 767030180, 768076420, 768674195, 769045949, 769284487, 769382179, 769417346, 769426525, 769350350, 769142389, 768869579, 768631458, 768353164, 767878175, 767179906, 766287327, 765203714, 764086008, 763278484, 762995839, 763133585, 763403237, 763587654, 763633072, 763587356, 763573706, 763633192, 763694882, 763707876, 763575375]
2930.9G63575375k84970l56912m91381o98924p99835p17640n68032m30286j69158K53856
2951.3G59312093N17488N14984M98295N30302N54204N29230M55081L90232L68297L59595
2971.7G64029801K24233j08004m59909q86024j938104l798962m707396j926541K857625
2990.1G53286719M451573K374530J26958q69513j213193j483798j946210k314330j471281
3008.4G50941455J031697L399253L766298K668202J505673P59721L64900J65105M7564
3026.8G64649868J03056K54572K12312k8432j70827m4942N3227j07765k74122k50518
3047.2G64396429j95861l20554m94778m74572l76642l05593j26540J00672K02238Q1659
3067.6G62486458k08557l80695k72989o0499l2723k70426m72963m23848l53456l87013
$$ y = [763575375, 763290405, 762933493, 762442112, 761743188, 760943353, 760225713, 759657681, 759227395, 759058237, 759312093, 759829581, 760344565, 760842860, 761373162, 761927366, 762456596, 762911677, 763301909, 763670206, 764029801, 764254034, 764146030, 763686121, 762800097, 760861993, 757063031, 752355635, 750429094, 753286719, 757738292, 760112822, 760239780, 759370267, 758157074, 756673276, 754727066, 752412736, 750941455, 751973152, 755372405, 759138703, 761806905, 763312578, 764072299, 764437199, 764602304, 764649868, 764752924, 765007496, 765219808, 765191376, 765020549, 764975607, 765028834, 764921069, 764646947, 764396429, 764200568, 763880014, 763385236, 762910664, 762534022, 762228429, 762101889, 762202561, 762404799, 762486458, 762277901, 761897206, 761624217, 761563718, 761530995, 761260569, 760787606, 760363758, 760010302, 759623289]
3088G59623289l96490l67224k87116j94788k41279m45128p28309r59754r93609p69318
3108.4G54240274k76923L98278Q76189P54356K45690j83224l67522k77579q2195l5703
3128.8G55291641j10626j74761k12848j87934j86503l39866m90963m96030m25279k94745
3149.2G52372086j82152l21030n75602o22631n37633m84348m90606n25415n18977n04255
3169.6G47609437n55635o47247o72042o02067n66065o15478o80029p12275p15316p35223
3189.9G41108060p87616q14199p66278p08460p16031p49946p39693p03752o93798p11382
3210.3G33716905p32183p59244p99477p95126p58827p93576q74520r05335q87751q36313
3230.7G25574553p93517q70704r45390q93771q54492q44360q15630q55624r26614r09448
$$ y = [759623289, 759226799, 758859575, 758572459, 758377671, 758136392, 757691264, 756962955, 756003201, 755009592, 754240274, 753963351, 754361629, 755237818, 755992174, 756237864, 756054640, 755687118, 755409539, 755327344, 755291641, 755181015, 755006254, 754793406, 754605472, 754418969, 754079103, 753588140, 753092110, 752666831, 752372086, 752189934, 751868904, 751293302, 750670671, 750133038, 749648690, 749158084, 748632669, 748113692, 747609437, 747053802, 746406555, 745734513, 745132446, 744566381, 743950903, 743270874, 742558599, 741843283, 741108060, 740320444, 739506245, 738739967, 738031507, 737315476, 736565530, 735825837, 735122085, 734428287, 733716905, 732984722, 732225478, 731426001, 730630875, 729872048, 729078472, 728203952, 727298617, 726410866, 725574553, 724781036, 723910332, 722964942, 722071171, 721216679, 720372319, 719556689, 718701065, 717774451, 716865003]
3251.1G16865003q17954p40350p34269p37250p26640p23482o53147n06580m24922n55277
3271.5G10245132p55429p87794p20561p21216p92861q03530p25925o78718p04050p87735
3291.9G02767313q93832r77218j094460j197935j114368r31442r77039j319349j661241
3310.3F92600429j721263j559853j509667j636326j717508j661360j625359j820326
3326.6F79348767k068341k114177k055347j978635j937628k114654k357423k417803
3342.9F62304759k456248k454161k309740k364934k675890k814413k719521k633274
3359.2F41876578k664208k694368k571464k500892k700269k962589k913296k636314
3375.5F20233178k463162k362251k256572k147973k007544j814663j548052j473010
$$ y = [716865003, 716047049, 715306699, 714572430, 713835180, 713108540, 712385058, 711731911, 711225331, 710800409, 710245132, 709489703, 708701909, 707981348, 707260132, 706467271, 705663741, 704937816, 704259098, 703555048, 702767313, 701873481, 700896263, 699801803, 698603868, 697489500, 696558058, 695581019, 694261670, 692600429, 690879166, 689319313, 687809646, 686173320, 684455812, 682794452, 681169093, 679348767, 677280426, 675166249, 673110902, 671132267, 669194639, 667079985, 664722562, 662304759, 659848511, 657394350, 655084610, 652719676, 650043786, 647229373, 644509852, 641876578, 639212370, 636518002, 633946538, 631445646, 628745377, 625782788, 622869492, 620233178, 617770016, 615407765, 613151193, 611003220, 608995676, 607181013, 605632961, 604159951]
3391.9F04159951j740813j818538j436114j185536j471460j782716j588761j240373
3408.2E91895640j137674j144230j174987j199603j025498p76112p27296p04884n03659
3426.5E83501697k92063k56360k40981r1076l7492j55389j18315R2745L40998N78880
3446.9E83322644N32508L82662M84645O40333P24792Q52168R94444J056492J085818
3465.3E90076506J162589J168370J070023J016974R70066Q82506R95159J294732J327813
3483.6E99964738J224577J293719J283527J180470J226127J362621J342655J315713
3500F10194147J587987J663327J286804J304329J651585J601458J378476J360119J405298
3518.3F23433530J465261J723230J860142J746356J724124J646579J509905J670062
$$ y = [604159951, 602419138, 600600600, 599164486, 597978950, 596507490, 594724774, 593136013, 591895640, 590757966, 589613736, 588438749, 587239146, 586213648, 585437536, 584710240, 584005356, 583501697, 583209634, 582953274, 582712293, 582621217, 582583725, 582428336, 582310021, 582402766, 582743764, 583322644, 583855152, 584237814, 584722459, 585362792, 586087584, 586939752, 587934196, 588990688, 590076506, 591239095, 592407465, 593477488, 594494462, 595464528, 596347034, 597342193, 598636925, 599964738, 601189315, 602483034, 603766561, 604947031, 606173158, 607535779, 608878434, 610194147, 611782134, 613445461, 614732265, 616036594, 617688179, 619289637, 620668113, 622028232, 623433530, 624898791, 626622021, 628482163, 630228519, 631952643, 633599222, 635109127, 636779189]
3534.6F36779189J862228J632214J386702J630842K154470K129137J463533J382232
3551F50420547J782357J630485J421035J654327J704216J457095K152919L461123K664924
3569.3F68349028J083076J171410J883506K159894K201200K013385J755476K486050
3585.6F83103025L721833K806187J354396J904607K672255K432585K329111K214253
3601.9G02538252J574695J678467K762973K864778K221584J819730J428724K449095
3618.3G19338298L176629J232207m22597N31495L953457L956496N52893J13309P59124
3636.6G33191311Q61824Q72433L38078j85132J165568M131556L232718p89941q31604
3655G41986811J293600P75218k83361k69770n62847l16799J562536J406729k12848
$$ y = [636779189, 638641417, 640273631, 641660333, 643291175, 645445645, 647574782, 649038315, 650420547, 652202904, 653833389, 655254424, 656908751, 658612967, 660070062, 662222981, 665684104, 668349028, 669432104, 670603514, 672487020, 674646914, 676848114, 678861499, 680616975, 683103025, 686824858, 689631045, 690985441, 692890048, 695562303, 697994888, 700323999, 702538252, 704112947, 705791414, 708554387, 711419165, 713640749, 715460479, 716889203, 719338298, 722514927, 723747134, 723324537, 723856032, 727809489, 731765985, 732318878, 732432187, 733191311, 734053135, 734925568, 735263646, 735078514, 736244082, 740375638, 743608356, 742818415, 741986811, 743280411, 744055629, 743772268, 743502498, 742939651, 742622852, 744185388, 745592117, 745379269]
3673.3G45379269J827300J836717r52304j257360j060843p90358J333654L212154J267135
3691.7G50795364q28623q68619m47869K71678J213670M35888j050830p06970J235008
3710G50048697K353013K14159j631379j111865o6579L65258M46141K49385q55505j234889
3730.4G48776436L49760K175987J895129q41736k937258r90748K678871P03275q94964
3748.8G50914752K008439J507938j545251j484573K87652K44260q66294m59015K35379
3767.1G50843287P35223O53326o33359j133859j42932R53317L51131m47691j04248
3785.5G51074195j02282l80337n53846n25713O9558p4327K78056J683950J00375n29886
3805.9G51039743P64728o94573k088606p18951J314878N66483O16610J456022o91414
$$ y = [745379269, 747206569, 749043286, 748090982, 746833622, 745772779, 744982421, 746316075, 749528229, 750795364, 749966741, 749098122, 748650253, 748921931, 750135601, 750571489, 749520659, 748813689, 750048697, 752401710, 752615869, 750984490, 749872625, 749806046, 750171304, 750617445, 750866830, 750011325, 748776436, 749126196, 751302183, 753197312, 752355576, 749418318, 748427570, 751106441, 751809716, 750914752, 752923191, 754431129, 752885878, 751401305, 751688957, 751933217, 751066923, 750607908, 750843287, 751578510, 752231836, 751598477, 750464618, 750321686, 751275003, 751626134, 751178443, 751074195, 750971913, 750591576, 750037730, 749512017, 749581575, 749507248, 749785304, 751469254, 751569629, 751039743, 751804471, 751109898, 749021292, 748302341, 749617219, 750183702, 750800312, 752256334, 751564920]
3824.3G51564920j357079p18593n09083j42277j48654O29723J683474N47171n64456
3842.6G50985146p06315j445175k265572j218736L413856M551470j093984k982020
3858.9G49238670j486361K88725N33819m91977L33369J225114N5015p84934j262545
3877.3G47648895l22640O00278l5405M99249M708q40246N11109K32637j450598r82821
3897.7G45865166N67973J230895J179874K01345j060307j080930o12259l93749K41638
3916G46139646P09652J00196m16279k5392L2187m54307r0778N92530J64926n79595
3936.4G46172786o30677j81675L45588J84178j72615J04010J74523j63079k41697j14202
3956.8G45477140o5565L7432J24275k7716j46031r2745k1696N4836O9857p8798j62303
$$ y = [751564920, 750207841, 749489248, 748980165, 748837888, 748689234, 749318957, 751002431, 751549602, 750985146, 750278831, 748833656, 746568084, 745349348, 748763204, 753314674, 752220690, 749238670, 747752309, 748041034, 748574853, 748082876, 748416245, 749641359, 749696374, 748911440, 747648895, 747326255, 747926533, 747891128, 748390377, 748395085, 747554839, 748065948, 748298585, 746847987, 745865166, 746433139, 747664034, 748843908, 749045253, 747984946, 746904016, 746291757, 745898008, 746139646, 746849298, 746949494, 746533215, 746507823, 746540010, 746085703, 745994925, 746587455, 746752381, 746172786, 745542109, 745360434, 745706022, 745890200, 745717585, 745821595, 745996118, 745833039, 745591342, 745477140, 745411575, 745449007, 745573282, 745545566, 745399535, 745306790, 745285094, 745339930, 745409787, 745330989, 745168686]
3979.3G45168686k5094K8015j27197j86682p6890l814n365p4148j86682
3997.6G44510829
$$ y = [745168686, 745143592, 745171607, 745044410, 744857728, 744780838, 744777024, 744771659, 744697511, 744510829]
##END=$$ End of the data block
