##TITLE=Diogo - 01 $$ Begin of the data block
##JCAMP-DX=5.00 $$ ACD/SpecManager v 10.08
##SPECTROMETER/DATA SYSTEM=Alpha
##DATE=30 Sep 2014 13:58:06
##DATA TYPE=INFRARED SPECTRUM
##DATA CLASS=XYDATA
##ORIGIN=
##OWNER=
##NPOINTS=1765
##FIRSTX=399.76428223
##LASTX=3997.64306641
##MAXX=3997.64306641
##MINX=399.76428223
##MAXY=1.00173247
##MINY=0.10181056
##XFACTOR=1.0000000000
##YFACTOR=0.000000010000000
##FIRSTY=1.00000000
##DELTAX=2.03961372
##XUNITS=1/CM
##YUNITS=ARBITRARY UNITS
##XYDATA=(X++(Y..Y))
399.8 100000000 97902840 95089704 91347855 85590774 78007692 72960812 75065035 82422501
416.1 82422501 90470165 96276122 99080849 100065112 100173247 100154960 100000000 99353766 98381394 97437924
436.5 97437924 96078074 93620378 89798152 84876615 79794639 76306981 76370865 80455166 86305851
454.8 86305851 91424936 95015401 96951902 97484922 97242439 96680987 95361948 92583001 88817656
473.2 88817656 86232352 86713266 89955080 93943030 97017252 98638994 99234009 99644464 100000000
491.5 100000000 99967867 99681842 99651158 99609220 99073631 98314381 97581208 96312028 94215143 92182815
511.9 92182815 91486251 92456591 94385767 96436852 98010182 98719662 98850852 99074972 99355012
530.3 99355012 99260557 99011505 99053264 99120003 98818552 98449612 98336172 98132986 97568679 96985716
550.7 96985716 96513259 95678806 94259423 92478812 90181202 86982626 83448571 81168646 81350815
569.1 81350815 83726746 87072706 90299493 92566693 93356842 92631310 90470004 87657511 86526346
587.4 86526346 88935941 93286741 96326602 97328919 97533554 97439289 96655482 95212740 93927693
605.8 93927693 93238753 92663145 91899806 91431683 91654921 92369515 93193173 93740422 93429112 91762912
626.2 91762912 88671666 84013003 77629149 70833027 66973799 68534917 74158919 80516529 85752434
644.5 85752434 89636803 92188698 93632883 94569290 95355541 95916909 96360707 96948189 97554344
662.9 97554344 97900498 98171055 98786730 99315488 99446315 99482554 99705124 99899650 99823630 99758244
683.3 99758244 99918693 100000000 99848598 99786723 99921042 99920613 99724168 99665761 99758261 99672705 99438214
705.7 99438214 99375933 99427158 99296457 99092793 99098051 99151361 98981196 98789579 98823822 98859692 98680520
728.1 98680520 98521650 98558980 98531020 98294276 98111528 98077011 97925985 97626841 97477341 97489929 97369236
750.6 97369236 97134346 97064471 97093326 96937466 96675152 96553969 96454006 96154004 95820343 95688188
771 95688188 95612204 95406330 95230168 95212823 95136970 94870067 94634145 94533885 94334215 93961060 93652272
793.4 93652272 93439394 93084395 92597359 92202014 91828263 91244811 90533817 89886951 89163595 88135195
813.8 88135195 86883402 85523087 83873308 81739920 79147917 76065385 72272986 67393106 60767674
832.2 60767674 52291554 44359794 41455430 45251948 51567507 54842287 53540879 50934595 52653277
850.5 52653277 60897684 71738309 80475551 85912794 89042199 91241133 93449432 95698243
866.8 95698243 97543234 98832810 99670625 100000000 99793279 99328667 98813581 98076266 96989298
885.2 96989298 95695114 94119883 91835177 88915092 86671889 86663908 88745588 91196334 92736864
903.5 92736864 93227327 92971742 92375052 91745073 91038144 90114737 89103454 88194376 87312979 86335874
923.9 86335874 85344845 84378260 83221602 81701106 79956591 78305328 76785851 74957877 72345102
942.3 72345102 68774194 64246392 58673388 51805419 44312072 39560643 41323122 48609468 56233859
960.7 56233859 59987575 59050220 54562408 47825295 40028960 32437482 26355481 22943021 22923903
979 22923903 26271975 32123432 39083758 45862848 51826328 56901973 61023289 63756824 64425230
997.4 64425230 63307136 62795371 64389384 65628135 63375109 57061630 48208410 40237337 37864774
1015.7 37864774 43659887 55118817 67278159 77082735 83913839 88282782 91006523 92629302
1032 92629302 93379456 93523347 93307090 92691267 91571230 90077579 88357174 86364543 84092224
1050.4 84092224 81653863 78995401 75810319 71830297 66919154 60918409 53863162 46654832
1066.7 46654832 41214901 39253733 40770373 44235763 47960591 50556529 50965089 49751624 49852800
1085.1 49852800 53577965 59673631 65590805 70366192 74070758 76804096 78743237 80189389
1101.4 80189389 81333041 82234710 82992297 83681351 84208488 84481800 84616983 84741569 84802914 84761274
1121.8 84761274 84732878 84766644 84740812 84603995 84451425 84281945 83958566 83457553 82887751 82241273
1142.2 82241273 81385976 80311179 79111040 77785182 76311141 74824536 73463339 72078341 70306998
1160.5 70306998 67935890 65261310 63304281 63180041 64686882 66378814 67358828 67775965 67768168
1178.9 67768168 67114317 65640879 63376981 60474712 57133728 53568757 49966362 46397388 42874333
1197.3 42874333 39566740 36869344 35195574 34692320 35075492 35767016 36475471 37596253 39833856
1215.6 39833856 43568486 48524252 53791153 58320993 61531621 63331056 63774544 62977058 61158884
1234 61158884 58527833 55373842 52487057 51139599 51811159 52988535 52630264 50710166 48747379
1252.3 48747379 47180477 45374441 44445440 47223666 53595036 59276360 61346990 60614806 58532661
1270.7 58532661 55633557 51918936 47127497 41704804 38018179 38239816 40811053 42431444 42043757
1289 42043757 40393844 38193119 35821435 33477345 31234133 29162598 27503353 26590326 26483691
1307.4 26483691 26745871 26773873 26273844 25332522 24246003 23413646 23192945 23706457 24865061 26472425
1327.8 26472425 28368339 30497113 32852086 35477132 38577753 42215028 45851216 48868430
1344.1 48868430 50848627 51292902 50002772 47681540 45666313 44981128 45836285 47927749 50806123
1362.5 50806123 53795272 56522578 59010774 60516328 59002274 53745818 48622316 46803761
1378.8 46803761 47522482 48958465 48244688 44520867 42183188 43508041 45165524 44280741 42087409
1397.1 42087409 42059249 45276830 49628860 53161466 55328721 56743014 58196342 59926260 61740845
1415.5 61740845 63458252 64899331 65673071 65900820 66077423 66567534 67279077 67770094 68106496
1433.9 68106496 69088221 70761448 71953732 72139764 71191531 69696826 69044381 69699907 70533705
1452.2 70533705 70544088 69506121 68742043 69648415 71318787 72979003 74521482 76034307 77535152
1470.6 77535152 79009861 80300057 81414640 82463342 83468056 84399956 85163599 85752594 86279804
1488.9 86279804 86867279 87464094 88033730 88622791 89185053 89644068 89989656 90283608 90609699 90921491
1509.3 90921491 91163111 91357100 91487914 91522968 91454613 91333038 91299254 91399890 91625261 91957533
1529.7 91957533 92346829 92751718 93095928 93325347 93403977 93383437 93508130 93853134 94270891 94602519
1550.1 94602519 94780231 94812721 94664609 94053495 92983031 92167825 91592556 91336966 91616648 92328173
1570.5 92328173 93062711 93659109 94170481 94517523 94680649 94700640 94637817 94542968 94417036 94247365
1590.9 94247365 94039440 93771017 93407828 92996657 92679876 92571509 92584264 92531604 92322093 91980308
1611.3 91980308 91552800 91002774 90365165 89893544 89554846 89232451 88991487 88808429 88625115 88472801
1631.7 88472801 88332814 88119197 87872583 87643772 87401694 87147582 86856961 86624485 86545354 86516184
1652.1 86516184 86508906 86520594 86405486 86065477 85479033 84766853 84020996 82957727 81464237 80064458
1672.5 80064458 78929412 77908146 76793271 75349873 73568434 71972108 71487743 71611959 71600658
1690.9 71600658 71308005 70640105 69606310 68183076 66151094 64134306 62086529 59758741 57516360
1709.2 57516360 55346334 53099978 50634772 47759402 44963470 42599878 40273255 37952757
1725.5 37952757 35849205 33938193 32192236 30286732 28339973 26502869 24118498 21212946
1741.9 21212946 18317005 15642487 13373880 11618142 10522210 10181056 10576087 11772189 13798626
1760.2 13798626 16617554 19538364 22029585 24075109 25527307 26426676 26834193 26837394 26492587
1778.6 26492587 25752386 24591288 23016508 21177801 19505875 18539114 18951611 20806429 23505507
1796.9 23505507 26698706 29996380 32888830 35181138 37061763 38706237 40118247 41233101
1813.2 41233101 42193767 43310052 44703496 46191674 47521141 48573518 49423465 50395191 51658875
1831.6 51658875 53060317 54479408 55828810 57017958 58026898 58863622 59418631 59648770 59683484
1850 59683484 59790891 60273504 61186504 62266451 63214594 63920504 64481288 65089858 65874916 66773015
1870.3 66773015 67607623 68359739 69064516 69713885 70293999 70821387 71328014 71817070 72305518 72815847
1890.7 72815847 73330474 73812193 74255264 74666715 75042176 75352550 75585139 75761771 75902659 76033354
1911.1 76033354 76196539 76428610 76722288 77062958 77449876 77893215 78352517 78768450 79143482 79498363
1931.5 79498363 79827201 80116725 80392480 80674738 80949676 81205052 81458908 81715375 81945086 82138473
1951.9 82138473 82333744 82562667 82802671 83035058 83272129 83504415 83692956 83845949 84006160 84177881
1972.3 84177881 84345186 84528214 84757382 85006100 85226911 85416996 85602963 85779107 85930634 86085624
1992.7 86085624 86273319 86466122 86630970 86787313 86954534 87110573 87236732 87354797 87477475 87580973
2013.1 87580973 87657887 87743604 87855220 87956548 88023371 88071704 88109004 88121200 88121915 88150847 88214833 88286018
2037.6 88286018 88357776 88437009 88484591 88442266 88314927 88161463 88031989 87972450 88034093 88221109 88470513
2060 88470513 88722998 88974541 89232534 89471334 89666069 89833856 89996284 90143669 90269583 90388530
2080.4 90388530 90497804 90570152 90605760 90644383 90708780 90777320 90836799 90913683 91023225 91144663 91263455
2102.9 91263455 91384095 91493946 91570950 91618311 91642976 91621846 91553235 91499805 91494566 91453654 91280818
2125.3 91280818 91044807 90940034 91049987 91264707 91454023 91572094 91599941 91529989 91398066 91259456
2145.7 91259456 91140622 91063470 91077000 91208196 91413784 91638499 91873503 92115825 92336589 92521262
2166.1 92521262 92689031 92841899 92951810 93015391 93068916 93124175 93151331 93145543 93144852 93168336 93196815 93225467
2190.6 93225467 93268365 93318641 93358380 93405271 93486530 93577367 93629980 93643111 93637097 93591249 93484432 93361026
2215 93361026 93289006 93276948 93301970 93373108 93484014 93569052 93575871 93515342 93420881 93329799 93313104 93445915
2239.5 93445915 93698204 93946522 94117707 94227618 94279850 94230753 94069004 93850827 93655753 93545741
2259.9 93545741 93555391 93662840 93772674 93790400 93730611 93700570 93768597 93919444 94120789 94345003 94542491
2282.3 94542491 94675130 94764090 94844133 94898611 94909459 94921446 94972974 95027769 95038402 95007682 94934839
2304.8 94934839 94771248 94500822 94215828 94034821 93972790 93965453 93980712 94014096 94037175 94036746 94035679 94038582
2329.3 94038582 94026828 94018817 94047624 94095773 94143319 94235420 94413471 94634211 94811988 94895309 94875032
2351.7 94875032 94774210 94640285 94523793 94449049 94376999 94274127 94171029 94105196 94068146 94036436 94028950
2374.1 94028950 94087166 94206387 94348043 94479626 94556928 94527036 94413096 94336283 94377309 94495547 94635183
2396.6 94635183 94803852 95003754 95190609 95345926 95498693 95647037 95751792 95817471 95890486 95967537
2417 95967537 96001875 95999289 96003300 96010345 95988685 95955330 95951360 95967621 95975000 95991433 96041340 96092105 96104705
2443.5 96104705 96101755 96122438 96148318 96147507 96141726 96153319 96149749 96108109 96065754 96049160 96030962 95997524 95984125
2470 95984125 96003246 96011502 95990157 95978236 95989430 95986038 95959032 95941901 95933336 95894367 95828074 95772767 95729327
2496.5 95729327 95675617 95636749 95656222 95707393 95723701 95693874 95644134 95565867 95453846 95368958 95360994 95382029
2521 95382029 95369184 95333570 95302027 95258099 95199221 95178759 95226628 95299655 95351571 95394254 95442343 95459777
2545.5 95459777 95427608 95381677 95342773 95292068 95238906 95228875 95261270 95282549 95273256 95257062 95225734 95143574
2569.9 95143574 95021385 94908792 94817281 94726425 94654500 94634932 94643736 94633257 94610512 94605201 94600922 94574201
2594.4 94574201 94553173 94569987 94606233 94635570 94670868 94727689 94782382 94815022 94850981 94905728 94938999 94913435
2618.9 94913435 94846791 94776905 94737202 94763219 94861388 94982767 95067614 95107847 95141554 95188802 95225579
2641.3 95225579 95236158 95240569 95252901 95267129 95291293 95342034 95406830 95462763 95519507 95593476 95664561 95710337
2665.8 95710337 95744520 95787281 95830864 95857728 95878762 95913827 95950699 95969170 95977390 95991081 96001476 95997846
2690.3 95997846 95997834 96017063 96035391 96033543 96029067 96030194 96013522 95976084 95948899 95950496 95965290 95980614 96009439
2716.8 96009439 96053654 96087247 96100593 96109200 96108544 96067524 95963389 95781392 95524138 95301557 95283508
2739.2 95283508 95470995 95688713 95812738 95853508 95861071 95849276 95815802 95782501 95764977 95731884 95652491
2761.6 95652491 95548546 95458376 95401692 95391595 95433521 95502752 95555919 95571703 95561653 95537359 95485204
2784.1 95485204 95395452 95292497 95209128 95151073 95110035 95084310 95060366 95002764 94897211 94774860 94669372
2806.5 94669372 94590586 94534832 94481254 94389957 94245845 94097626 94000357 93943727 93885702 93813306 93731505
2828.9 93731505 93632364 93503678 93348163 93179578 93008119 92839104 92684555 92555392 92439306 92312896
2849.3 92312896 92172706 92024177 91850936 91640359 91428375 91260207 91120046 90947938 90706176 90398580
2869.7 90398580 90062362 89764130 89559031 89434910 89327407 89211792 89133811 89117509 89112324 89063543 88966072
2892.2 88966072 88834512 88676417 88503331 88331705 88157481 87960625 87736571 87483591 87148809 86617774
2912.6 86617774 85768479 84509248 82753563 80355197 77032876 72415614 66658813 61427528 59396142
2930.9 59396142 61704504 66650718 71608609 75170505 77172667 77895480 77748412 77246344 76861358
2949.3 76861358 76889825 77450514 78445256 79588455 80615628 81429553 82063961 82587039 83043659 83454740
2969.7 83454740 83840430 84203029 84523296 84803396 85059041 85272574 85409409 85450810 85362041 85058367
2990.1 85058367 84371388 82986331 80420512 76246703 70684141 65460467 63228542 64655131 67643541
3008.4 67643541 70292068 72449380 74479473 76290971 77669746 78705049 79640287 80574572 81429613
3026.8 81429613 82124001 82656753 83084202 83462816 83809179 84125662 84403318 84621072 84774917 84887886
3047.2 84887886 85000521 85135198 85277283 85409552 85528189 85639048 85748267 85852861 85955286 86063039
3067.6 86063039 86175281 86296737 86442864 86619020 86795080 86926973 87020445 87109983 87197536 87279582
3088 87279582 87365949 87448174 87513745 87575012 87647361 87713599 87749088 87769568 87807661 87859410 87889880 87913746
3112.4 87913746 87982029 88081330 88170111 88239682 88301677 88375217 88463336 88555998 88644868 88722938 88797575 88885260
3136.9 88885260 88979280 89051491 89099693 89150870 89222127 89311785 89405364 89476937 89516854 89548957 89588690 89631122
3161.4 89631122 89675397 89718688 89755595 89789873 89822280 89841014 89847893 89860874 89880836 89890933 89886820 89881134
3185.9 89881134 89877182 89867228 89850879 89832938 89812261 89785725 89757913 89732993 89708161 89682108 89659786 89649892
3210.3 89649892 89649564 89648759 89649212 89654243 89659327 89657348 89648151 89639634 89632565 89627397 89623070 89595157 89536941 89480513
3238.9 89480513 89441097 89409441 89382118 89351279 89301747 89245445 89206117 89182216 89157361 89125288 89095747 89074451
3263.4 89074451 89057511 89048010 89047217 89033014 88995373 88955927 88926977 88907039 88889569 88865042 88834172 88807821
3287.8 88807821 88792747 88771409 88718557 88631970 88523543 88409275 88310826 88238430 88165557 88057554 87920702
3310.3 87920702 87781566 87649661 87515277 87371033 87222213 87072444 86916369 86742908 86553746 86359835
3330.7 86359835 86160821 85955876 85742581 85501760 85224074 84932244 84651941 84392810 84155333 83920097
3351.1 83920097 83663684 83392960 83124775 82856560 82575560 82282186 81983995 81671512 81332421 80975139
3371.5 80975139 80621982 80291134 79992616 79733741 79512811 79319191 79143202 78984797 78846437 78706151
3391.9 78706151 78544772 78381336 78234154 78094918 77950537 77803952 77669096 77549738 77437407 77325952
3412.3 77325952 77215618 77112138 77026486 76960850 76909560 76873344 76851994 76839143 76830304 76830381 76847351 76881802
3436.7 76881802 76925129 76975179 77039373 77113193 77190971 77279949 77383900 77494186 77602154 77706009 77807158
3459.2 77807158 77905810 77996171 78069311 78133202 78210706 78301239 78386360 78459209 78518450 78563833 78595328 78594065
3483.6 78594065 78539598 78438878 78309184 78165215 78045422 78016698 78125608 78356773 78652632 78968954
3504 78968954 79259115 79474020 79606378 79675585 79709148 79737711 79779762 79831237 79876304 79899937 79881781
3526.5 79881781 79811925 79743022 79769218 79964316 80355620 80889511 81459588 81996965 82498705 82978636
3546.9 82978636 83426553 83831072 84201515 84534162 84817040 85059375 85279781 85490918 85687464 85872459
3567.3 85872459 86074662 86316758 86600834 86927867 87299389 87704742 88123363 88532859 88930732 89334673
3587.7 89334673 89738017 90113741 90466666 90813363 91156125 91496623 91842777 92188966 92523587 92849803
3608.1 92849803 93168038 93473798 93771088 94057661 94321865 94579548 94850951 95126367 95378917 95589393
3628.5 95589393 95799571 96029139 96246761 96444738 96627957 96801895 96979064 97160578 97317195 97427714
3648.8 97427714 97555476 97738045 97899622 98008955 98117936 98236811 98340708 98433882 98511028 98541170
3669.2 98541170 98565853 98610806 98601705 98596478 98667514 98762232 98862338 98957783 99012619 99039423 99107665 99205750
3693.7 99205750 99292713 99367654 99421775 99446529 99478680 99538165 99587500 99585909 99557519 99581391 99639535 99673647
3718.2 99673647 99682695 99685705 99689096 99701333 99737817 99774379 99770349 99724704 99687964 99723077 99807048 99835879
3742.7 99835879 99782884 99787742 99823922 99783003 99758869 99808645 99839896 99812138 99777764 99757338 99722338 99694639
3767.1 99694639 99701291 99743974 99809468 99861288 99878746 99870050 99870920 99889541 99909449 99934334 99959087 99982500
3791.6 99982500 100000000 99997413 99994832 99985516 99945658 99941504 99957132 99954575 99985671 100035655 100043201 100011778 100005341
3818.1 100005341 99983627 99933892 99942023 99977541 100005817 100019300 100009525 100000000 99973792 99927443 99917930 99931031
3842.6 99931031 99943483 99973089 100015628 100027204 99926209 99803984 99829179 99904054 99930680 99892670 99838674
3865 99838674 99809581 99752027 99655962 99562413 99460083 99365634 99281907 99249536 99313992 99409729 99517792 99628180
3889.5 99628180 99693602 99745136 99811888 99845356 99823123 99782026 99752587 99762291 99814671 99863392 99893880 99925709
3914 99925709 99941504 99934524 99941170 99956375 99950206 99934798 99923271 99893624 99839860 99790341 99753845 99713731 99661070
3940.5 99661070 99612743 99606925 99640512 99681771 99729240 99782759 99821204 99833411 99829227 99817252 99806923 99810189
3965 99810189 99827987 99856931 99888754 99916828 99945867 99977738 100000000 100004566 99998254 99984628 99961698 99926084
3989.5 99926084 99876952 99807739 99707121 99595392
3997.6 99595392
##END=$$ End of the data block
