##TITLE=$$ Begin of the data block
##JCAMP-DX=5.00 $$ ACD/SpecManager v 10.08
##SPECTROMETER/DATA SYSTEM=Varian
##DATE=15 Jan 2013 15:39:56
##DATA TYPE=INFRARED SPECTRUM
##DATA CLASS=XYDATA
##ORIGIN=
##OWNER=
##NPOINTS=3735
##FIRSTX=399.26403809
##LASTX=4000.35498047
##MAXX=4000.35498047
##MINX=399.26403809
##MAXY=61.72751999
##MINY=12.37710571
##XFACTOR=1.0000000000
##YFACTOR=0.000000100000000
##FIRSTY=26.38531113
##DELTAX=0.96440572
##XUNITS=1/CM
##YUNITS=TRANSMITTANCE
##XYDATA=(X++(Y..Y))
399.3B63853111K012940J475429R42726m159755K60524l225135L206920K365666p735081
407.9B58997345n144157l2845M157791N893459J987229q643799J383991P478104l41835
416.6B65735283N014267j3684349p763825J5515080l902416q601303q107815L029461
424.3B47234383N361194L350315N816803J705227m228592L29609K890377p05948j376609
433B60376759R40857j224099p924442N46913K926312k868672J558781K253303L112145
441.7B59697857J437244k200985k85244M55895p19853k980251o6261K382011J566773
450.4B59287186j893120k683506r73778L15476J174640j528930J090030K806568m502353
459.1B53092213l680191K56691L658943R46197l97739l230915l695831L81240J534462
$$ plain form
399.3 263853111 265866051 267341480 268284206 264124451 264384975 261159840 264366760 266732426 258997345
407.9 258997345 253853188 253820343 257978134 263871593 265858822 257215023 258599014 266077118 265735283
416.6 265735283 270749550 257065201 249301376 264816456 260914040 252312737 244204922 247234383
424.3 247234383 252595577 255945892 261762695 263467922 259239330 259568939 262459316 261753368 260376759
433 260376759 261317616 260093517 252169075 252715988 255642300 252773628 254332409 256585712 259697857
441.7 259697857 261135101 258934116 258648872 259104767 258384914 255404663 255338402 257720413 259287186
450.4 259287186 257394066 254710560 253736782 254052258 255226898 253697968 254787998 257594566 253092213
459.1 253092213 249412022 249668713 253327656 254273853 253876114 250645199 246949368 247330608 248865070
467.7B48865070q57296o798057l202515M730683J076812R67903N270443p64408l813133
476.4B45475502j055241J345120j344967m941959J863365N2948k271366M708156J651249
485.1B45482807l61996L128472J172733k374973n90744l83015j256122j799603k104549
493.8B40913010K052745K71264j116772r27601j505203n92537P65896L241958j488647
502.5B41614113j233540K34127j053829O10294m74681p63722r39255J040326j406537
511.1B37627296j655292J527328o03180J366692K95258o39897j31378j925201j843357
519.8B34018269j847001J21232n8403K61764l10459j235085J256104N86319k022896
528.5B30769844j488151J229171J40324J030922M35085j959095k24781J01032Q25081
$$ plain form
467.7 248865070 248007774 241209717 238007202 242737885 243814697 244782600 250053043 249288635 245475502
476.4 245475502 244420261 245765381 244420414 239478455 241341820 241394768 239123402 243831558 245482807
485.1 245482807 245120811 248249283 249422016 247047043 246456299 246073284 244817162 243017559 240913010
493.8 240913010 242965755 243237019 242120247 241192646 239687443 239094906 239860802 243102760 241614113
502.5 241614113 240380573 240614700 239560871 240171165 239696484 238932762 237993507 239033833 237627296
511.1 237627296 235972004 237499332 236896152 238262844 238558102 237918205 237786827 235861626 234018269
519.8 234018269 232171268 232292500 232234097 232495861 232185402 230950317 232206421 232792740 230769844
528.5 230769844 229281693 230510864 230651188 231682110 232117195 230158100 229933319 230034351 230859432
537.2B30859432j16367r10645k32372k63290l51925j363983j87912J82094l89652l90682
546.8B26834698k15378j39904l96137q40397k6989J775360k005291k681561J188965
555.5B23493366J377449N0698j120892O24180N17959l39851n73196j442051r88961
564.2B21598701j05323K557983Q96435j784840o25629J47419L06492l26290J5335o00129
573.8B22080154l75499m58813j040096j23692j321754J58043J959076L26156J23406
582.5B21326981M04758m96693m14924Q03394J493321N57251k55814J028938r0103l80878
592.1B23976231K446537J384773q50735j313591J73512R70287L57761K11316j89572
600.8B27166519K26765O68239j63822r76810l89366k59858k55641k52266r83773j43985
$$ plain form
537.2 230859432 230743065 229832420 229600048 229336758 228984833 227620850 227432938 227615032 227225380 226834698
546.8 226834698 226619320 226479416 226083279 225242882 225215893 226991253 224985962 222304401 223493366
555.5 223493366 224870815 224921513 223800621 224424801 224942760 224602909 224029713 222587662 221598701
564.2 221598701 221493378 224051361 224947796 223162956 222537327 222684746 222991238 222664948 222680283 222080154
573.8 222080154 221704655 221245842 220205746 220082054 218760300 218918343 220877419 221203575 221326981
582.5 221326981 221731739 221235046 220820122 221623516 223116837 223674088 223418274 224447212 224357109 223976231
592.1 223976231 226422768 227807541 226956806 225643215 225816727 226787014 227144775 227356091 227166519
600.8 227166519 227393284 228061523 227897701 226920891 226531525 226271667 226016026 225763760 224779987 224636002
610.5B24636002M72850M84867o09149p15065K10151n52330k28500l64361L21159O82240
620.1B24337864m6005O70051Q34103P51152M8389L38269Q21018P10029J440735J115303
629.8B31020908Q79898K74849N71614J931457O52828k59037J405259K343502J912155
638.4B40733433J140404N18665R62086P48653K31190Q54854P90997P52315J125775
647.1B47858372J586914J348934P70779K22454L61480J096688j43566n47753q93535
655.8B51660767J15203J125775n33924O10847m59900j147346N80406K91939K86j56078
665.4B52087975O82354O02989L717422n83515k565098J35193O99921R87301N30033
674.1B56294575J39980J720944J377391J128941P49054L40748P99389J190261N96600
$$ plain form
610.5 224636002 225108852 225593719 224984570 224269505 224479656 223927326 223698826 223334465 223655624 224337864
620.1 224337864 224291859 224961910 225796013 226547165 226595554 226933823 227754841 228464870 229905605 231020908
629.8 231020908 231900806 232175655 232747269 234678726 235331554 235072517 236477776 238821278 240733433
638.4 240733433 241873837 242392502 243354588 244103241 244334431 245189285 245980282 246732597 247858372
647.1 247858372 249445286 250794220 251564999 251787453 252148933 253245621 253102055 252554302 251660767
655.8 251660767 251775970 252901745 252367821 252978668 252518768 251371422 251951828 252243767 252244053 252087975
665.4 252087975 252770329 253373318 257090740 256507225 253942127 254077320 254777241 255764542 256294575
674.1 256294575 256434555 258155499 259532890 260661831 261410885 261751633 262551022 263741283 264337883
682.8B64337883P33509J399078J48831k7428Q89664J701565R93366J46408P39059K6818
692.4B71088753q73490L5477J791325J069793k06070R5482M03309O91300Q45146N18226
702.1B75459251L30544J727352J457119N93414N80006M66156J099720l86372j9912
710.8B81307278J248417R33055P44744K0790P78160N95665J67923K47116J255245K248307
720.4B89546700O45484J43662k04983Q9035N69554N14412N21869J340428K116756J30310
730.1B95413227J49460J167889J369209Q16784J04103K90184o37169J05457M92955
738.7B99272099L07998K85492J106281J667576m29172j74809K4243K22206J056843
747.4C03338757J281871J484070M92115J83983k06413M67338R04122J396923J241722
$$ plain form
682.8 264337883 265071392 266470470 266619301 266591873 267481537 269183102 270176468 270322876 271061935 271088753
692.4 271088753 270215263 270250740 272042065 273111858 272905788 273001270 273404579 274095879 274941025 275459251
702.1 275459251 275789795 277517147 278974266 279567680 280147686 280613842 281713562 281327190 281307278
710.8 281307278 282555695 283488750 284233494 284254284 285032444 285628109 285796032 286043148 287298393 289546700
720.4 289546700 290192184 290335846 290130863 290219898 290789452 291303864 291825733 293166161 295282917 295413227
730.1 295413227 295562687 296730576 298099785 298916569 299020672 299310856 298673687 298779144 299272099
738.7 299272099 299580097 299865589 300971870 302639446 302210274 302035465 302059708 302281914 303338757
747.4 303338757 304620628 306104698 306596813 306780796 306574383 307041721 307945843 309342766 310584488
756.1C10584488P591J126766J612301K054863Q92716K65045O55479N3444R46217J30520
765.7C18329430K47459Q58059Q99029R20028O78978r7427j408386K55089k03705l02849
775.4C20175705J259537R23462j3123o41289J008911O80962O2599m89654k05155J183167
785C23945122M28619J509476P77626o60439m04052J50947Q77609M7150j057129q51021
794.7C24763908J021500n18684j660653o50863j500817j493301j026955r02748k334575
803.4C15696812k180138r97410j369171j000996r09099j977425l021164k165851j571713
812C00503845j485672j139297p66583n43499j306190j458130j190491m35181l26194
820.7B91852608m3221P31144M49886P37153J153297J626434J577282J399803J517296
$$ plain form
756.1 310584488 310592079 311718845 313331146 315386009 316278725 316543770 317199249 317252693 318198910 318329430
765.7 318329430 318576889 319434948 320333977 321254005 321932983 321835556 320427170 320682259 320478554 320175705
775.4 320175705 321435242 322358704 322345581 321704292 322713203 323394165 323456764 322967110 322761955 323945122
785 323945122 324373741 325883217 326660843 326000404 325596352 325747299 326624908 326672058 325614929 324763908
794.7 324763908 325785408 325266724 323606071 322955208 321454391 319961090 318934135 318031387 315696812
803.4 315696812 313516674 312519264 311150093 310149097 309239998 307262573 304241409 302075558 300503845
812 300503845 299018173 297878876 297112293 296568794 295262604 293804474 292613983 292178802 291852608
820.7 291852608 291809387 292540531 292990417 293727570 294880867 296507301 298084583 299484386 301001682
829.4C01001682K523175K748603J459294K165413J535911K688084L619537J003323
837.1C18745022Q51230J761742L461113K469521J775627J837349N44281J968040J938820
845.8C35352745K144051J754875J290474K262459K621688K392006J537896K528724
853.5C51884918K044640J870079J937752K520866L073616J451645J868210J059150
861.2C67710876J619301J844178J180648R64508o00662J08566k64472j8349m69742
869.9C72074852j780586k096062k221794j106720n35202M46243K76833o0272o90499
878.6C64306793n05028M38385l56979j179542k056313p28607k01454K02064j48926
887.3C59770393j147728k57873r18198m87518r31778q80547k74963P38831K033348
$$ plain form
829.4 301001682 303524857 306273460 307732754 309898167 311434078 314122162 317741699 318745022
837.1 318745022 319596252 321357994 324819107 327288628 329064255 330901604 331445885 333413925 335352745
845.8 335352745 337496796 339251671 340542145 342804604 345426292 347818298 349356194 351884918
853.5 351884918 353929558 355799637 357737389 360258255 363331871 364783516 366651726 367710876
861.2 367710876 369330177 371174355 372355003 373319511 372718849 372827415 372562943 372544594 372074852
869.9 372074852 370294266 368198204 365976410 364869690 364334488 364780731 365057564 364997292 364306793
878.6 364306793 363801765 364240150 363883171 362703629 360647316 359918709 359717255 359919319 359770393
887.3 359770393 358622665 358364792 357446594 356959076 356027298 355146751 354871788 355610619 357643967
895.9C57643967J58386L53660J64872j60141l40500k75002M11682l46069N34935R7275
905.6C58243065J034279J721267J393662J116066q02498L14865r3460j243324j083451
914.3C60600471o99844j313019k260666j692962k401962j893082k145920k534370k942467
922.9C42716179l208313j844177k145996k065621k625923k719917k217064k008095
930.7C23881073k184486k802926j226940q80317p83081j002388j770230n19619l69873
939.3C12341213j312313r82532j06068j289692j797867r90734j249046j714287j409149
948C01489525k02999n99747j176224j161117j385365j582813k046852k266064k360649
956.7B88707695j777992k145157k427616k094021k332096k022515j686077j910572
$$ plain form
895.9 357643967 357802353 358156013 358320885 358160744 357820244 357545242 357956924 357610855 358145790 358243065
905.6 358243065 359277344 360998611 362392273 363508339 362705841 363020706 362927246 361683922 360600471
914.3 360600471 359900627 358587608 356326942 354633980 352232018 350338936 348193016 345658646 342716179
922.9 342716179 339507866 337663689 335517693 333452072 330826149 328106232 325889168 323881073
930.7 323881073 321696587 318893661 317666721 316786404 316003323 315000935 313230705 312711086 312341213
939.3 312341213 311028900 310046368 309940300 308650608 306852741 305862007 304612961 302898674 301489525
948 301489525 301286526 300686779 299510555 298349438 296964073 295381260 293334408 291068344 288707695
956.7 288707695 286929703 284784546 282356930 280262909 277930813 275908298 274222221 272311649
964.4B72311649k212181j611690j613846j965828j951141j663304j177997k099972
972.1B58015690k516384k399769k357044k152386k602081l002816k596664k124691
979.8B38263855l029022l959503l868466l173790l044281l337841l804397l832436
987.6B10214119l044987l129139l081302l355942l765621l560887k912655k822990
995.3A84540596l043575k670880l046836k314568k284622k465115k068958k304974
1003A64341068j718158j136742m64211j108083q57535m80995q26025o80323j718912
1011.7A55350084j377983j011925q33091j208773j739426j014633j191721j931143
1019.4A45041389k140378o67115j175050j948328j392184r85098n37100j728954j415901
$$ plain form
964.4 272311649 270099468 268487778 266873932 264908104 262956963 261293659 260115662 258015690
972.1 258015690 255499306 253099537 250742493 248590107 245988026 242985210 240388546 238263855
979.8 238263855 235234833 231275330 227406864 224233074 221188793 217850952 214046555 210214119
987.6 210214119 207169132 204039993 200958691 197602749 193837128 190276241 187363586 184540596
995.3 184540596 181497021 178826141 175779305 173464737 171180115 168715000 166646042 164341068
1003 164341068 162622910 161486168 161021957 159913874 159056339 158575344 157749319 157068996 155350084
1011.7 155350084 153972101 152960176 152127085 150918312 149178886 148164253 146972532 145041389
1019.4 145041389 142901011 142233896 141058846 139110518 137718334 136733236 136196136 134467182 133051281
1028.1A33051281j207685o22015n27449j458235o49023m55456J1826l86343J61724
1036.7A27918625P75680M15402P12089J080141J636439J89743j13907L17659L70398
1045.4A33302269J73273k36807L63312k7561l30363j070451J48353N76611j019650
1054.1A31878986p00054n46932N60865J93158k16313P96862J369905J207676R27735
1062.8A35471888J858329J504279J637716J373043J002016J369839J323929J387643
1070.5A46928682O79846O35033O8798Q78467J726618O52638N74131M23593O76975N36109
1080.1A53780890L53803L75090J038122J881838J638984J350565O95954J300735J303959
1088.8A63719940Q80985J365948J834946J577720O42758J005955P62787J383743J365318
$$ plain form
1028.1 133051281 131843596 131221581 130694132 129235897 128586874 128131418 128143244 127756901 127918625
1036.7 127918625 128694305 129109707 129821796 130901937 132538376 132728119 132614212 132931871 133302269
1045.4 133302269 133475542 133238735 133602047 133574486 133244123 132173672 132322025 132898636 131878986
1054.1 131878986 131178932 130632000 131192865 131386023 131169710 131966572 133336477 134544153 135471888
1062.8 135471888 137330217 138834496 140472212 141845255 142847271 144217110 145541039 146928682
1070.5 146928682 147608528 148243561 148312359 149190826 150917444 151570082 152144213 152567806 153244781 153780890
1080.1 153780890 154134693 154509783 155547905 157429743 159068727 160419292 161115246 162415981 163719940
1088.8 163719940 164600925 165966873 167801819 169379539 170022297 171028252 171791039 173174782 174540100
1097.5A74540100M30184J456184J032753J041622J449204R42440O84738J025104J463280
1106.2A84065609P03697Q71620O62442l0632K74181P63302R09347L59364P67918N23185
1115.8A89870033L2196M69876L44123J36738l43551n3921O55861P34367K80438J74770
1125.5A92300930P73869L97548M33216J220990J480770J463222J343022J849155J605282
1134.1B02868004P90291J202793J445293J701756J437530Q15277J189232J137257R66225
1142.8B13553658O56795J32008J89018K823J81141Q65650N50709m7856k91347l42980
1152.5B15449619l92570n18208o6013K20928k36683q40206q61015o00910k55757R9144
1162.1B11998329l10592o30169m7722Q78544J475830K012481K153569J571655J381664
$$ plain form
1097.5 174540100 174970284 176426468 177459221 178500843 179950047 180892487 181577225 182602329 184065609
1106.2 184065609 184769306 185640926 186303368 186272736 186546917 187310219 188219566 188578930 189346848 189870033
1115.8 189870033 189902229 190372105 190716228 190852966 190509415 190455494 191111355 191845722 192126160 192300930
1125.5 192300930 193074799 193472347 193905563 195126553 196607323 198070545 199413567 201262722 202868004
1134.1 202868004 203658295 204861088 206306381 208008137 209445667 210260944 211450176 212587433 213553658
1142.8 213553658 214210453 214342461 214531479 214534302 214715443 215581093 216131802 216083946 215792599 215449619
1152.5 215449619 215057049 214538841 214472828 214693756 214457073 213616867 212755852 212154942 211899185 211998329
1162.1 211998329 211687737 211057568 211009846 211888390 213364220 215376701 217530270 219101925 220483589
1170.8B20483589J606236J750526K200756K380543K340374K357826K153778J970501
1178.5B37244129K366219K326927J419010R01928P24182J812973J907520P91646K81353
1187.2B49775887n1594L92780l529n88493q84094o25858m98143r31778p99007r85603
1196.8B44800568r81713j527691j847877j860027j681710j055641j216583j120644
1204.5B33508682j355800j536675q87585m49409o95152r27124n70755o22063n95264
1213.2B25868855j23635N0144k26593n57937m30203L6335L33443K10285Q58j36966
1222.9B25024586j48125l05119j46598q1540p33261o90288m63257r1534p858p02038
1232.5B21654968o36558l39546k84901l29952m00181m32205m55456l39604j99394j5926
$$ plain form
1170.8 220483589 222089825 223840351 226041107 228421650 230762024 233119850 235273628 237244129
1178.5 237244129 239610348 241937275 243356285 244258213 244982395 246795368 248702888 249494534 249775887
1187.2 249775887 249724293 250117073 250113544 249525051 248640957 248015099 247516956 246585178 245786171 244800568
1196.8 244800568 243818855 242291164 240443287 238583260 236901550 235845909 234629326 233508682
1204.5 233508682 232152882 230616207 229728622 229279213 228584061 227656937 227086182 226464119 225868855
1213.2 225868855 225745220 225795364 225568771 225010834 224580631 224616966 224950409 225160694 225161552 225024586
1222.9 225024586 224876461 224571342 224424744 224343204 223609943 222919655 222456398 222364864 222357006 221654968
1232.5 221654968 221018410 220678864 220393963 220064011 219663830 219231625 218776169 218436565 218237171 218221245
1242.2B18221245n1117k50607n83057o36482m11034n97687o35757l31364j35345p4196
1251.8B14514599j52931k18029l66764m22059j52206m4422J72367j4229j98631J67484
1261.4B13285179k1038K47974O41823P24259M70905J21498N61695O38790R50413J205826
1271.1B18827324N83782N56584J060962R92584P70874J153908J217289J085644J373119
1279.8B27622070J263333J025066J210785J267910J333504J771812J838131J264992
1287.5B38597603J393413J726723J308098J026421Q10565J156025J021195O87103J037979
1296.2B48765125J237240J178436L59555N17749M78383n8041J27430K15034M10233
1304.8B53231144o1359J35479N17082K51865k65503p39326o45066n26523j030J91860
$$ plain form
1242.2 218221245 218170128 217919521 217336464 216699982 216288948 215691261 215055504 214724140 214588795 214514599
1251.8 214514599 214361668 214143639 213776875 213354816 213202610 213158188 213330555 213316326 213117695 213285179
1261.4 213285179 213264141 213512115 214153938 214878197 215349102 215470600 216032295 216671085 217621498 218827324
1271.1 218827324 219411106 219967690 221028652 222021236 222792110 223946018 225163307 226248951 227622070
1279.8 227622070 228885403 229910469 231121254 232389164 233722668 235494480 237332611 238597603
1287.5 238597603 239991016 241717739 243025837 244052258 244862823 246018848 247040043 247727146 248765125
1296.2 248765125 250002365 251180801 251540356 252058105 252536488 252478447 252605877 252820911 253231144
1304.8 253231144 253169785 253305264 253822346 254074211 253808708 253069382 252424316 251897793 251896763 252088623
1314.5B52088623M26483L27893J35135P4425Q4705P98283O11648M65889J80493O40793
1324.1B55834370Q86135M29878O33621j69220L5782j15242m72317o35547r94511k36664
1333.8B55196285k65465L8033n6534k05746m19216o23436M62380M00619O39572J77231
1343.4B55343723M79794O07643q373M48131j60656l03878l32737R3364O2371k31839
1353.1B55997543k8419o55670l29533m31290m73251o88648m31481k21939q29925l08304
1362.7B51599083o97537j69067n53856r10187n87806r93691n99537l99704n2261m18243
1372.3B46217194m02050p67918q49152N23911p7019k11964l82270l39585k94437n60074
1382B42856636o54488j002025q64391r56498m93316j192246q38299l61709j113034
$$ plain form
1314.5 252088623 252515106 252842999 252978134 253052559 253137264 253935547 254547195 255013084 255193577 255834370
1324.1 255834370 256720505 257150383 257784004 257614784 257650566 257535324 257063007 256427460 255432949 255196285
1333.8 255196285 254930820 254968853 254912319 254706573 254287357 253663921 254126301 254526920 255166492 255343723
1343.4 255343723 255823517 256431160 256422787 256870918 256710262 256406384 256073647 256167011 256229382 255997543
1353.1 255997543 255969124 255313454 254983921 254552631 254079380 253390732 252959251 252737312 251907387 251599083
1362.7 251599083 250901546 250732479 250178623 249268436 248680630 247686939 247087402 246687698 246635437 246217194
1372.3 246217194 245815144 245047226 244198074 244721985 244644966 244433002 244050732 243711147 243416710 242856636
1382 242856636 242202148 241200123 240335732 239379234 238885918 237693672 236855373 236493664 235380630
1390.7B35380630r70401j111908q14400j641617j728592n71804r68036r03473k244587
1399.3B24425812j376343m27666r42783j453571j434002j194706j143723o14090r34772
1408B14904156j293125j091195j182403j154575o72246m37259p66792m35753l05024
1416.7B07565784p58705o92672r89247M42181N03120K19040K90966m36573q3427M60624
1426.3B06521091N36709L83873k3784N30452O47469O59656N99614N01823R31320R37119
1436B12225342O41117O50997J063995O70186O60037N80178K46372O17580L90206N46245
1445.6B18292255N78385O06327J55563L26576R48811M18396K20585K87228O79931L71590
1455.3B22885647L34472m10060k58542K215653O62537J345806J000614J090908J700268
$$ plain form
1390.7 235380630 234410229 233298321 232483921 230842304 229113712 228541908 227573872 226670399 224425812
1399.3 224425812 223049469 222621803 221679020 220225449 218791447 217596741 216453018 215838928 214904156
1408 214904156 213611031 212519836 211337433 210182858 209510612 209073353 208306561 207870808 207565784
1416.7 207565784 206807079 206114407 205125160 205567341 206070461 206289501 206580467 206143894 206060467 206521091
1426.3 206521091 207057800 207441673 207417889 207948341 208595810 209255466 209855080 210356903 211288223 212225342
1436 212225342 212866459 213517456 214581451 215251637 215911674 216491852 216738224 217355804 217746010 218292255
1445.6 218292255 218870640 219476967 219632530 219959106 220907917 221326313 221546898 221834126 222514057 222885647
1455.3 222885647 223220119 222810059 222551517 224767170 225429707 226775513 227776127 228867035 230567303
1464B30567303N57747J453876J472950J895313J622277K240333K638893J823063L546829
1472.6B47818584K684098K719383K438354K350731K720948K496223J876621J270638
1480.3B66375580J612472J704731J577988J639175J273251Q46081M75178K57186R93023
1489B76754665j237564r21573P95688l73668q76503r22966q55656m323940j142063
1497.7B66896420j764546k575226n80425j382408j147823j132355j78547p66602j416721
1506.4B55951767l861733j322002J818028o52199M26292p86171j280880n09243j475067
1515.1B48308792m00677j469516o67954P26242J087246K24323j404876k65122r3288
1523.7B46045170J152973L3054O07357P63188K83947P21149Q08335R98973N47448L83606
$$ plain form
1464 230567303 231125050 232578926 234051876 235947189 237569466 239809799 242448692 244271755 247818584
1472.6 247818584 250502682 253222065 255660419 258011150 260732098 263228321 265104942 266375580
1480.3 266375580 267988052 269692783 271270771 272909946 274183197 275029278 275504456 275761642 276754665
1489 276754665 275517101 274595528 275391216 275017548 274141045 273218079 272362423 268038483 266896420
1497.7 266896420 265131874 262556648 261976223 260593815 259445992 258313637 258135090 257368488 255951767
1506.4 255951767 252090034 250768032 252586060 251933861 252360153 251573982 250293102 249783859 248308792
1515.1 248308792 247908115 246438599 245770645 246496887 247584133 247808456 246403580 246138458 246045170
1523.7 246045170 247198143 247231197 247838554 248601742 248885689 249606838 250415173 251414146 251961594 252345200
1533.4B52345200j242848R41620P49378N17426J609268q70686k504215O05068K296105
1542.1B54446316J172809R71718Q58994n84717J326733N47351P02420N4969J25313
1550.7B59621906J064625J92890R41391j096916N34554J094322J60980N34134k112599
1559.4B60935287j453075l89328P30591q61797n89238j570301j781578l31917j351165
1568.1B53337479p26681n368195j132679j164913k298813k117767k236424L0003q074799
1576.8B30247211j226711j949138k764225k788735l878803k120667l830337k388992
1584.5B09299603l317452k844753l055344l648071j847344l829498k348423l695755
1592.2A84712963j925774k396793l514137j986160l277283j594944l385601j537056
$$ plain form
1533.4 252345200 251102352 252043972 252793350 253310776 254920044 254049358 251545143 252150211 254446316
1542.1 254446316 255619125 256590843 257449837 256865120 258191853 258739204 259441624 259496593 259621906
1550.7 259621906 260686531 260879421 261820812 260723896 261258450 262352772 262513752 263047886 260935287
1559.4 260935287 259482212 259092884 259823475 258961678 258372440 256802139 255020561 254688644 253337479
1568.1 253337479 252610798 247242603 246109924 244945011 242646198 240528431 238292007 238322010 230247211
1576.8 230247211 229020500 227071362 224307137 221518402 217639599 215518932 211688595 209299603
1584.5 209299603 205982151 203137398 200082054 196433983 194586639 190757141 188408718 184712963
1592.2 184712963 182787189 180390396 176876259 174890099 171612816 170017872 166632271 165095215
1599.9A65095215k578163k346993j396341k852125o42214k614555o71111k010450j334858
1608.6A48648405j079712j660108J08776k264214n3139j590995J18522o53438l863879
1617.3A37710218J928177j051807P79343j068278R11484k23656j139974J507768l68204
1626A38985071J621390j235152R84335K88754K60992J030159K21672J689024m6025
1634.6A43800220L227005k039766J256161J086693M63361J480561N2452J889496K54221
1643.3A51470404J644201R44881q82911J043262p26862K954722K24428K307443J238747
1652A60218315M38538n84450j160688L243265J78089J707687P10106J398983J738453
1660.7A67888298J221924K038650m94747K980995J455040K425118K058544J662293
$$ plain form
1599.9 165095215 162517052 160170059 158773718 155921593 155279379 152664824 151993713 149983263 148648405
1608.6 148648405 147568693 145908585 146017361 143753147 143700008 142109013 142227535 141574097 137710218
1617.3 137710218 139638395 138586588 139365931 138297653 139209137 138985481 137845507 139353275 138985071
1626 138985071 140606461 139371309 140355644 140644398 140905390 141935549 142157221 143846245 143800220
1634.6 143800220 147027225 144987459 146243620 147330313 147793674 149274235 149326687 151216183 151470404
1643.3 151470404 153114605 154059486 153176575 154219837 153492975 156447697 156672125 158979568 160218315
1652 160218315 160656853 160072403 158911715 162154980 162333069 164040756 164750862 166149845 167888298
1660.7 167888298 169110222 171148872 170654125 173635120 175090160 177515278 179573822 181236115
1668.4A81236115L327445L55721L920803J637955L220348K501888J862793L083191
1676.1B01146259K323418L824177K231979M028320K741223L263759L825379O37817
1683.8B24022331N901470J927281N613670L851242L983994M301662L677826M419708
1691.5B57699184L606339M617710L918324M618225L392181N011749O045266N168991
1699.3B94077969O065998L509O191769N056209M756337M087200L316574M047584L863488
1707.9C31466637M339409L036651K757607L250274L677941L404121J334343K364349
1715.6C55631332K968674J427651n13688M575997L611145K200813K095070J522064
1723.4C73519058J936302K484131K285157J699600J954880K560195R79958J385651
$$ plain form
1668.4 181236115 184563560 184919281 188840084 190478039 193698387 196200275 198063068 201146259
1676.1 201146259 203469677 207293854 209525833 213554153 216295376 219559135 223384514 224022331
1683.8 224022331 229923801 231851082 237464752 241315994 245299988 249601650 253279476 257699184
1691.5 257699184 261305523 265923233 269841557 274459782 277851963 282863712 288908978 294077969
1699.3 294077969 300143967 300147476 306339245 311395454 316151791 320238991 323555565 327603149 331466637
1707.9 331466637 335806046 338842697 341600304 344850578 348528519 351932640 353266983 355631332
1715.6 355631332 358600006 360027657 359513969 364089966 367701111 369901924 371996994 373519058
1723.4 373519058 375455360 377939491 380224648 381924248 383879128 386439323 387419281 388804932
1731.1C88804932L493232L532105q93212j745567N313873M619866K821884K719269
1738.8D08666382J226768M07677M506493L552971J821479L068962M224892L801308
1746.5D31276932L023262L638382K681808M845047L471832K944184N430755M171525
1754.2D61483727M640045M197769J896782K797889L583680L576431L894577J528168
1761.9D87599068J630058L780708K348175K501755K754364J762352j26533L164901
1769.7E05414848M483948J164360j83792p9613M173622K752152M39110K451515Q93402
1778.3E21509552K063599J416549K37923K102203K485009K388458J85318Q11157J862221
1787E35061989J400986J048202J971932J541748P46231o59752K9297L820457J648140
$$ plain form
1731.1 388804932 392298164 395830269 394937057 393191490 398505363 403125229 405947113 408666382
1738.8 408666382 409893150 410300827 414807320 418360291 420181770 423250732 427475624 431276932
1746.5 431276932 434300194 437938576 440620384 445465431 448937263 451881447 457312202 461483727
1754.2 461483727 466123772 470321541 472218323 475016212 478599892 482176323 486070900 487599068
1761.9 487599068 489229126 493009834 495358009 497859764 500614128 502376480 502249947 505414848
1769.7 505414848 509898796 511063156 510879364 510799751 514973373 517725525 518164635 520616150 521509552
1778.3 521509552 523573151 524989700 525227623 527329826 529814835 532203293 532388611 533199768 535061989
1787 535061989 536462975 537511177 539483109 541024857 541771088 541111336 541140633 544961090 546609230
1795.7E46609230P8659J694107K503929J444893l95660K390442P11174J243095J898995
1804.4E58178864Q51135J489677P76329Q86917J310845J709175J373J139946J604500
1813E67948761M68101J369019P16667J325722J11580N88264J427994Q54492J722603
1821.7E76533203J32942J345787J630059j319924K57073K229919K030068m52004j984711
1830.4E80402412J218148K593155Q55178P63360P39135K70577M87900M3601J477395
1839.1E88850861M71916J109504J106835J084862Q38127m272576K160874K094574L92532
1847.8E93837509L4790Q11386J278191L9024P34482o9618Q25271M61770N7182Q46901
1857.4E98856888L17459R29756j88980M36516K88429O45142O94198J37558R11675m81758
$$ plain form
1795.7 546609230 546687889 548381996 550885925 552330818 551935158 554325600 555036774 556279869 558178864
1804.4 558178864 559029999 560519676 561296005 562182922 563493767 565202942 565204315 566344261 567948761
1813 567948761 568416862 569785881 570502548 571828270 571939850 572528114 573956108 574810600 576533203
1821.7 576533203 576666145 578011932 579641991 578322067 578579140 580809059 582839127 582387123 580402412
1830.4 580402412 581620560 584213715 585068893 585832253 586571388 586841965 587329865 587373466 588850861
1839.1 588850861 589322777 590432281 591539116 592623978 593462105 589189529 591350403 593444977 593837509
1847.8 593837509 593872299 594683685 595961876 596000900 596735382 596665764 597491035 597952805 598009987 598856888
1857.4 598856888 599174347 600104103 599915123 600351639 600640068 601285210 601979408 602116966 603028641 602546883
1867.1F02546883Q94241q97903o57769J595536R11140Q95729P2556P24067j48277L12004
1876.7F06248207M85458M77639P37838m83055M38080j66397O33926J78872k56577P66106
1886.3F09060097K64587J205406l85627j031571N58129R28001J28670l1624K72255
1895F10968323m82178J090851K23808L15361L91045j64070K56614k51655O50825o7482
1904.7F12931442L77655L00026Q8425M22592q7967K33803o97441P46574L03955J43242
1914.3F14762306L53203J28784J378479j571769l02086P97348j2932L3188o55632M75769
1923.9F15386658O10161N38482m20685N3063L1509q4343M07334l33519J57013m11072
1933.6F15934601K18315J21498L63541O37245o38008j49536m02871O80275k41050j052437
$$ plain form
1867.1 602546883 603441124 602543221 601885452 603480988 604392128 605287857 605360413 606084480 605936203 606248207
1876.7 606248207 606733665 607211304 607949142 607466087 607904167 607737770 608371696 608550568 608293991 609060097
1886.3 609060097 609324684 610530090 610144463 609112892 609671021 610599022 610727692 610696068 610968323
1895 610968323 610486145 611576996 611800804 612116165 612507210 612343140 612599754 612348099 612998924 612931442
1904.7 612931442 613309097 613609123 613697548 614120140 614032173 614265976 613568535 614315109 614619064 614762306
1914.3 614762306 615115509 615244293 616622772 615051003 614748917 615546265 615533333 615566521 614910889 615386658
1923.9 615386658 615996819 616535301 616114616 616167679 616199188 616114845 616522179 616188660 616345673 615934601
1933.6 615934601 616152916 616274414 616637955 617275200 616637192 616487656 616084785 616765060 616524010 615471573
1943.2F15471573R59358O13632P9804o36788j66893m92172j4801J97029K8839N28450
1952.9F16568031j90353J7738l95736j41907l24516n9586K10381m38347M51164L3951
1962.5F15730820L78418P0266k92511k95600p37114M9858r9831L66631r0905Q8272
1972.2F15168304K66800j37214o9466l72162J76316l02125P1030m9896J48544N22156
1981.8F15422287j30730J2245p25021j56479n45883l15666J81198j71089P56950j80092
1991.5F14147720m91218l70255K29798j36414o33240J17264k46811L97263m5014j48620
2001.1F12820473l05481l15666o0997o17791p4272m85115Q6022M3716K46620K53792
2010.7F11591301p35436k8724m29459l25966n33104l26080j80817p1716M81491m94995
$$ plain form
1943.2 615471573 616430931 617044563 617124367 616487579 616320686 615828514 615813713 616010742 616039581 616568031
1952.9 616568031 616377678 616395416 615999680 615857773 615533257 615473671 615684052 615245705 615696869 615730820
1962.5 615730820 616109238 616179504 615886993 615591393 614854279 614904137 614804306 615170937 615080032 615168304
1972.2 615168304 615435104 615297890 615228424 614856262 615032578 614730453 614801483 614751587 614900131 615422287
1981.8 615422287 615291557 615303802 614578781 614422302 613876419 613560753 613741951 613570862 614327812 614147720
1991.5 614147720 613656502 613286247 613516045 613379631 612746391 612863655 612616844 613014107 612969093 612820473
2001.1 612820473 612514992 612199326 612138329 611520538 611446266 610961151 611047173 611090889 611337509 611591301
2010.7 611591301 610855865 610827141 610397682 610071716 609538612 609212532 609031715 608959999 609441490 608946495
2020.4F08946495O1264l01132o41632p46918l58238K54478j30806N61486l16620o9580
2030F07258797n7984n37452m57268n54657L26500n63584l86467m2877K40097M5739
2039.7F05270844m77906j5182p90406k50587n57976l7880O24695M9934m0245n53016
2049.3F03222275L7536n59272j60752j61934m53033N06630M20m9820m68560N3597J1139
2059.9F01978226k60124k45247m52195L24593j65215J91155j45683k49443p0687k14767
2069.6F00690613J92947n17616M3869j33171j2322J44349o8512J16844o32592j03645
2079.2E99720764k28462k17514l10745p0916K30713j83105L30582l79143m50173n21812
2088.9E97920189j81465r4795n49431K58407O1455q2130m99764p9651k80685n91393
$$ plain form
2020.4 608946495 609007759 608706627 608064995 607318077 606959839 607214317 607083511 607644997 607328377 607258797
2030 607258797 607200813 606663361 606206093 605651436 605977936 605414352 605027885 604985008 605225105 605270844
2039.7 605270844 604792938 604777756 603987350 603736763 603178787 603140907 603765602 603815536 603775291 603222275
2049.3 603222275 603259811 602700539 602539787 602377853 601924820 602431450 602431870 602382050 601913490 601967087 601978226
2059.9 601978226 601718102 601472855 601020660 601345253 601180038 601371193 601225510 600976067 600905380 600690613
2069.6 600690613 600883560 600365944 600409813 600276642 600264320 600408669 600340157 600457001 599824409 599720764
2079.2 599720764 599492302 599274788 598964043 598893127 599123840 598940735 599271317 598892174 598442001 597920189
2088.9 597920189 597738724 597643929 597094498 597352905 597414360 597332230 596832466 596752815 596472130 595880737
2098.5E95880737k87513p21093K03820J02119L43475j39312n65071q7853n57289J04599
2108.1E94276619j19209o4240l58543l38898p133l67623m0779n55000k93274k72179
2117.8E91859741K14424J33477k39563J48468m55056r1476p11517k11792L22113j20926
2127.4E90847893O3705k37961L32909j51749m5051p4959k61230m3641n32112j25999
2137.1E89771805P4310M64592l43246j36261K23693n54962k2773J28250M21600j16196
2146.7E89910812r8800l18871k86102L76282k66076L5325k31133J10397j19438j62239
2156.4E88950157M30451J0604L23639l96690l0098k09007l39127K87857l49579k42729
2166E88435478j4534P42645J47896K09770K00692q12836j89857j29738K32162J88828
$$ plain form
2098.5 595880737 595593224 594872131 595075951 595178070 595521545 595382233 594817162 594729309 594172020 594276619
2108.1 594276619 594157410 594093170 593734627 593395729 593388596 593020973 592980194 592425194 592131920 591859741
2117.8 591859741 592074165 592207642 591968079 592116547 591661491 591570015 590858498 590646706 590968819 590847893
2127.4 590847893 590911598 590673637 591006546 590854797 590809746 590734787 590473557 590429916 589897804 589771805
2137.1 589771805 589846115 590310707 589967461 589831200 590054893 589499931 589477158 589605408 590027008 589910812
2146.7 589910812 589812012 589493141 589207039 589583321 589317245 589352570 589121437 589231834 589112396 588950157
2156.4 588950157 589380608 589391212 589714851 589318161 589288063 589079056 588739929 589027786 588678207 588435478
2166 588435478 588420944 589163589 589311485 589521255 589721947 588909111 588719254 588589516 588821678 589010506
2175.6E89010506M53224J56479j65558K09160l57933k7085n20935k51808P1716J92681
2185.3E88770447N16891o6604Q4114k70386K09846J60828N6801P6256l88527J97410
2194.9E89347076J46714L72696j98288k90871j05133j56136K94114J4801L64913L8872
2204.6E89828758J00022m2115o6757N1766m69552J33591L0632L76778p973j55907K75155
2215.2E90054398O3858L76167l31841k62642l60870K3384M91295J60141J88980j97563
2224.8E90205307J48315l13072k39296j74980r8991K44636j34582L67241k52915j79481
2234.5E89572182q2245j14060P9537k85568N4893M0474O31256j00365l14216j8921
2244.1E89462967k27928J32446m30603K42996J03493J87798Q5983l91998Q7318l82576
$$ plain form
2175.6 589010506 589463730 589620209 589454651 589663811 589305878 589278793 588757858 588506050 588577766 588770447
2185.3 588770447 589287338 589220734 589304848 589034462 589244308 589405136 589461937 589538193 589149666 589347076
2194.9 589347076 589493790 589866486 589668198 589377327 589272194 589116058 589410172 589424973 589789886 589828758
2204.6 589828758 589928780 589886665 589819908 589871674 589402122 589535713 589566345 589943123 589935150 589779243 590054398
2215.2 590054398 590118256 590494423 590162582 589899940 589539070 589562454 590053749 590213890 590402870 590205307
2224.8 590205307 590353622 590040550 589801254 589626274 589527283 589771919 589637337 590004578 589751663 589572182
2234.5 589572182 589489937 589375877 589455414 589169846 589224739 589265213 589896469 589796104 589481888 589462967
2244.1 589462967 589235039 589367485 588936882 589179878 589283371 589471169 589557152 589165154 589252472 588869896
2253.8E88869896Q1444m66156k40326J76582J05782N53398l31917J57318L29666M1313
2263.4E89277000m35714l94440P8774m9553L84788o2866K70958r8381m65050o9847
2273E88435669j43738L8719l96614m51889p12967L63503L52135k87819J71585n19829
2282.7E86848755j62621m25720J75133M78439k26288j44004k98653O11420j99318k86904
2292.3E86370239L17536J23748J44272l63083N03846j0071m13628O2447O7596K36016
2302E87038918k88125K9831L54386M29916J50452J72882N29022J64757P6K57797P28760
2312.6E89568672n073m57383K57149N11818l34129l74756K10609N76020J892662Q59222
2322.2E92704811k14920n86700N1307R95140k56614o4240J8082N31044M37660j01662
$$ plain form
2253.8 588869896 588951340 588485184 588244858 588421440 588527222 589080620 588748703 588906021 589235687 589277000
2263.4 589277000 588841286 588446846 588525620 588476067 588860855 588797989 589068947 588970566 588505516 588435669
2273 588435669 588291931 588330650 587934036 587482147 586769180 587132683 587484818 587196999 587368584 586848755
2282.7 586848755 586686134 586260414 586435547 586913986 586687698 586543694 586245041 586856461 586657143 586370239
2292.3 586370239 586687775 586811523 586955795 586592712 587096558 587086487 586672859 586735306 586802902 587038918
2302 587038918 586750793 586780624 587135010 587564926 587715378 587888260 588417282 588582039 588582115 588839912 589568672
2312.6 589568672 589563599 589106216 589363365 589875183 589541054 589166298 589376907 589952927 591845589 592704811
2322.2 592704811 592489891 591903191 591954498 592949638 592693024 592628784 592646866 593177910 593615570 593513908
2331.9E93513908J66245m45252j15966L94210N94559l95355m39148p79228j08452P60498
2341.5E93146019l8986N26123m74816j152420k639885l127059k567215k16980K903213
2350.2E86357994J354942J087761J268654J103516K050667R05838J676559j244354
2357.9E94561577N92270O72798l66821l87307j982803N23567j171379p06596j291466
2366.6E90443840j546249j091729j360282j359978k547493o09703j540871j785278
2374.3E78602257j257477j622047j362610j860276j184501j304016j129036j169892
2382E67712402r50622q16269j325112q04824p54738O103o1531l41339o25381o74095
2391.7E61364594K01301n94215m88892n60799l29704j33896n30929j73836o39267q3542
$$ plain form
2331.9 593513908 593680153 593234901 593118935 593513145 594107704 593712349 593273201 592493973 592385521 593146019
2341.5 593146019 593107033 593633156 593158340 592005920 589366035 586238976 583671761 583454781 586357994
2350.2 586357994 587712936 588800697 590069351 591172867 593223534 594129372 595805931 594561577
2357.9 594561577 595153847 595826645 595459824 595072517 593089714 593613281 592441902 591735306 590443840
2366.6 590443840 588897591 587805862 586445580 585085602 582538109 581928406 580387535 578602257
2374.3 578602257 577344780 575722733 574360123 572499847 571315346 570011330 568882294 567712402
2382 567712402 566761780 565945511 564620399 563815575 563060837 563066940 563005409 562664070 562038689 561364594
2391.7 561364594 561565895 560971680 560482788 559921989 559592285 559458389 558927460 558753624 558114357 558030815
2401.3E58030815l82805o28700k35252q1673n6725p71522l11165m30984l28675o49795
2410.9E54153519q25157j30082k03170k5254o54258m81873m49295l86925k89688m68330
2420.6E50239487j44844r62258m14009m13017m76952L0594k53868k77138q82187m41131
2430.2E46004677n34363n08842l20206n39856k53220n12809o8665m31786o76384n54504
2439.9E41604042m60854l69949q51402l44505k11068j40457k36435l83796p66068r01451
2449.5E36938057m22974q75358o94809n96085k78396j86387r2697r8533r14040m50706
2459.2E32328072n45998l75671m21067o68602m62837p48176m35029p03926l87077l62625
2468.8E27217064m74968n17616q58040m58946o03295n6839k58102o69403q21572p88421
$$ plain form
2401.3 558030815 557648010 557019310 556784058 556702385 556645660 555874138 555562973 555131989 554803314 554153519
2410.9 554153519 553328362 553198280 552995110 552969856 552315598 551833725 551384430 550997505 550707817 550239487
2420.6 550239487 550094643 549132385 548718376 548305359 547828407 547859001 547605133 547327995 546445808 546004677
2430.2 546004677 545470314 544961472 544641266 544101410 543848190 543335381 543266716 542834930 542158546 541604042
2439.9 541604042 541143188 540773239 539921837 539577332 539366264 539225807 538989372 538605576 537839508 536938057
2449.5 536938057 536515083 535639725 534944916 534348831 534070435 533884048 533791351 533692818 532778778 532328072
2459.2 532328072 531782074 531406403 530985336 530316734 529853897 529105721 528670692 527966766 527579689 527217064
2468.8 527217064 526742096 526224480 525366440 524907494 524304199 524247360 523989258 523319855 522498283 521709862
2478.5E21709862k24114p54127m43154n50270q04786p71866m49982J8959p38411q75168
2488.1E16116943j000175o16684l27034k81944m18358p93953l34435p16209p54662
2496.8E10873489o19468m30451p06177p85942k3498m08325n84717r96399o34766o16836
2506.4E05066910r78661m73404m96788j35040p85790q91609n63163l54004l30468q57238
2516.1D99200745l41912o61392n55458n71594n62172k36702n51338m98619p03011j70975
2525.7D94347572p46078p35054l05481o68106r6779p36847n11169j65253k52724k48527
2535.4D89881554q56362p67898m11492M1123m52118n99632n88265n26161k56004n66445
2545D84898300l73421o79397n11170k17285k99988p30209o86455k41737q45718l75100
$$ plain form
2478.5 521709862 521485748 520731621 520288467 519738197 518933411 518161545 517711563 517730522 516992111 516116943
2488.1 516116943 515116768 514500084 514173050 513891106 513472748 512678795 512344360 511628151 510873489
2496.8 510873489 510254021 509823570 509117393 508331451 508307953 507899628 507314911 506318512 505683746 505066910
2506.4 505066910 504088249 503614845 503118057 502983017 502197227 501305618 500742455 500388451 500057983 499200745
2516.1 499200745 498858833 498197441 497641983 497070389 496508217 496271515 495720177 495221558 494518547 494347572
2525.7 494347572 493601494 492866440 492560959 491892853 491796074 491059227 490548058 490382805 490130081 489881554
2535.4 489881554 489025192 488257294 487845802 487886925 487434807 486835175 486246910 485720749 485464745 484898300
2545 484898300 484524879 483845482 483334312 483117027 482817039 482086830 481400375 481158638 480312920 479937820
2554.6D79937820l11698m11644o13938q17795j58691m59099n02167o71730k43072l29895
2564.3D75418091q44650m01497m97322k36130m72069n35622m63905m33044n02701o19316
2573.9D70411835k59362p63549l97225j41601m60167p38564l75862O5537n66521l98140
2583.6D66376381j050606q98819m41780m67720J62544m41780n91659o81877m16184
2592.2D61548500l56560o11763o30150p96966k7351l34931n98984o64405o81839n36995
2601.9D56308556m80233o4163o74400n97077o83136o39572m67109m37317n0927r22088
2611.5D51292534p44896m94347n04646n34210p70645n73311o32477j82877o16302p90711
2621.2D45448112o62727m87709k12288n26504m82865j057892o84280m47693n99327
$$ plain form
2554.6 479937820 479626122 479214478 478600540 477782745 477624054 477164955 476662788 475991058 475747986 475418091
2564.3 475418091 474573441 474171944 473674622 473438492 472966423 472430801 471966896 471533852 471031151 470411835
2573.9 470411835 470152473 469388924 468991699 468850098 468389931 467651367 467275505 467341042 466774521 466376381
2583.6 466376381 465325775 464426956 463985176 463517456 463680000 463238220 462646561 461964684 461548500
2592.2 461548500 461191940 460580177 459950027 459153061 459125710 458790779 458191795 457527390 456845551 456308556
2601.9 456308556 455828323 455764160 455089760 454492683 453809547 453169975 452702866 452265549 452214622 451292534
2611.5 451292534 450547638 450053291 449548645 449014435 448243790 447670479 447038002 446855125 446238823 445448112
2621.2 445448112 444785385 444297676 444085388 443558884 443076019 442018127 441333847 440886154 440286827
2629.9D40286827l95965l92571k43797r33991m45823k88811o06613m02642p84988q25653
2639.5D34965973p74689m35600m39148j62544l45497p79839o18286o99921m20646p14417
2649.1D29575386n22308k54937L2731j52207r50775o13747q51364n60875k12173j61324
2658.8D25328407k75230o18858m38195n64995J04027l31611q95234o39915n79872l04489
2668.4D20784035m18816L5896k79426k81105l64647r03206n69916n97458K1973j1673
2678.1D17415657k44255l08762l99360j76621o87294n90400n02892l76396k70920n45845
2687.7D13312912o26297k60582R5482l03574l68385p52106o97899k78549k44903j57853
2697.4D09718246m99496l98941l32108m13284l77006J564k18239o48232l53279o20498
$$ plain form
2629.9 440286827 439890862 439498291 439254494 438320503 437874680 437585869 436979256 436576614 435791626 434965973
2639.5 434965973 434191284 433755684 433316536 433153992 432808495 432028656 431410370 430710449 430289803 429575386
2649.1 429575386 429053078 428798141 428830872 428678665 427727890 427114143 426262779 425701904 425489731 425328407
2658.8 425328407 425053177 424434319 423996124 423431129 423535156 423203545 422308311 421668396 421088524 420784035
2668.4 420784035 420365219 420401115 420121689 419840584 419475937 418572731 418002815 417405357 417427330 417415657
2678.1 417415657 417171402 416862640 416463280 416286659 415599365 415008965 414506073 414129677 413858757 413312912
2687.7 413312912 412686615 412426033 412521515 412217941 411849556 411097450 410399551 410121002 409876099 409718246
2697.4 409718246 409218750 408819809 408487701 408074417 407697411 407698975 407480736 406832504 406479225 405858727
2707D05858727l03002j36681k63328m12979n17578m20113m96674J52741l74870o50978
2716.6D02435265m03481m70619j27411l79410r9068l24249m92439q6899m5662j96533
2726.3C99809494m09317m30984p31965j66015j0643j67656k38190m56123j00250j64299
2735.9C96934052o7177p14798m53759J68343m65927k31094o295j21498n80253k21100
2745.6C94240494j19324l80440k784l68233l58849p40585n10559J68075K01645J92604
2755.2C92322044l70445k80151j37177l04756n51338n24178m47120l23944k52533n89257
2764.9C88541145j90887k83432o5193j58081r58748r59435m29115L47099j41105j62468
2774.5C85539780l60337o07528m80271q90388k47765q17108m87328M69742m33540r96857
$$ plain form
2707 405858727 405555725 405419044 405155716 404742737 404225159 403805046 403308372 403461113 403086243 402435265
2716.6 402435265 402031784 401561165 401433754 401054344 400955276 400631027 400138588 400051689 400006027 399809494
2726.3 399809494 399400177 398969193 398237228 398071213 398060570 397892914 397654724 397198601 397098351 396934052
2735.9 396934052 396866875 396152077 395698318 395866661 395400734 395169640 395163345 395041847 394461594 394240494
2745.6 394240494 394121170 393740730 393737946 393369713 393010864 392270279 391759720 391927795 392129440 392322044
2755.2 392322044 391951599 391671448 391534271 391229515 390678177 390153999 389706879 389382935 389130402 388541145
2764.9 388541145 388350258 388066826 388001633 387843552 386884804 385925369 385496254 385843353 385702248 385539780
2774.5 385539780 385179443 384571915 384091644 383201256 382953491 382136383 381649055 382118797 381685257 380688400
2784.2C80688400p03354J58959j90811o33812n67208n13649n54580o22254l85894n60074
2793.8C76115723l17192q49228p87850l33252p71560n01442n56717l98102o27861q03566
2803.4C70168953n98831o96907o74057r63669n83878m20456n85556r47075j048278
2812.1C63650246n61371p11670j000214r47151k16408m77981j157341j005554p50161
2820.8C56822395o98585r80568l99552o05850j318283r03358m89083q83865j214638
2829.5C49328613q71086j135750j007499j071930j384468j286507j232605j001816
2837.2C40336952j618805j624374j590576j785622k008781k817307k420235k056579
2844.9C24414673k212029k442989k498569k553978k538434k186412k178421j495438
$$ plain form
2784.2 380688400 379985046 380144005 379953194 379319382 378752174 378238525 377683945 377061691 376675797 376115723
2793.8 376115723 375798531 374949303 374161453 373828201 373056641 372555199 371998482 371600380 370972519 370168953
2803.4 370168953 369570122 368873215 368199158 367235489 366651611 366231155 365645599 364698524 363650246
2812.1 363650246 363088875 362377205 361376991 360429840 360213432 359735451 358578110 357572556 356822395
2820.8 356822395 356123810 355143242 354743690 354137840 352819557 351916199 351427116 350543251 349328613
2829.5 349328613 348457527 347321777 346314278 345242348 343857880 342571373 341338768 340336952
2837.2 340336952 338718147 337093773 335503197 333717575 331708794 328891487 326471252 324414673
2844.9 324414673 322202644 319759655 317261086 314707108 312168674 309982262 307803841 306308403
2852.6C06308403q72288l86467j58443J7605L84006P1869K22015J27297J13125L2406
2862.3C05859528l01323l93792n95226l30734n59330p40318q33683q38700o20823n97477
2871.9C00048122m21848m51298j99432m03004l06396l38478j110478q05950l31020
2880.6B95680218m18759q72478o57444m98409r11389j118698r02309m01783j202469
2889.3B88696480j351414p80067r82094j100273r86862n63584q75091j156102q90617
2897.9B80010376p80315q43430n10311n52330j515713j295109j051139j144200j197300
2906.6B71120529j304951j017627j305104j111583j184883j884880j811944j447029
2914.3B60052528j849899k487678k042294j624565j601486j603031j195069p52830
$$ plain form
2852.6 306308403 305436115 305049648 304891205 304908810 305292816 305364685 305586700 305713997 305827122 305859528
2862.3 305859528 305558205 305164413 304569187 304238453 303679123 302938805 302105122 301266422 300645599 300048122
2871.9 300048122 299626274 299174976 298975544 298572540 298266144 297927666 296817188 296011238 295680218
2880.6 295680218 295261459 294388981 293731537 293233128 292321739 291203041 290300732 289898949 288696480
2889.3 288696480 287345066 286564999 285582905 284482632 283495770 282932186 282057095 280900993 280010376
2897.9 280010376 279230061 278386631 277876320 277323990 275808277 274513168 273462029 272317829 271120529
2906.6 271120529 269815578 268797951 267492847 266381264 265196381 263311501 261499557 260052528
2914.3 260052528 258202629 255714951 253672657 252048092 250446606 248843575 247648506 246895676
2922.1B46895676q24986n79681j22433Q7185l17287N9909P59831P47108O03256N58320
2931.7B47866898Q77761P10431Q60366Q59833Q93459J185246N49412N13344Q46633
2940.4B55163383J328240J399727Q83083O13156N38063Q41617Q89340P23610K40764
2949.1B62620983J94893m5109n5961Q35456M74797L57456N36365M96407N72815N53989
2958.7B66542091O17237M40712Q62580P92637N60665Q76522J129932J094342Q25424
2967.4B73742142J090221R36413O68793P67727J213016J335259R19284O30551J99528
2976.1B81502934P22007R88579N65605M39015L07712L72429N17483M67682M6425K99739
2985.7B86229610M58851L63312M61426K51083L05729K59781J36509k67353J44806N87711
$$ plain form
2922.1 246895676 246070690 245491009 245368576 245455761 245138474 245198383 245958214 246705322 247308578 247866898
2931.7 247866898 248744659 249455090 250315456 251175289 252068748 253253994 253803406 254316750 255163383
2940.4 255163383 256491623 257891350 258774433 259387589 259925652 260767269 261656609 262380219 262620983
2949.1 262620983 262815876 262770767 262714806 263550262 264025059 264382515 264918880 265415287 265988102 266542091
2958.7 266542091 267159328 267600040 268462620 269255257 269815922 270692444 271822376 272916718 273742142
2967.4 273742142 274832363 275768776 276437569 277205296 278418312 279753571 280672855 281303406 281502934
2976.1 281502934 282224941 283213520 283779125 284218140 284525852 284898281 285415764 285883446 285929871 286229610
2985.7 286229610 286688461 287051773 287513199 287764282 288070011 288329792 288466301 288198948 288343754 288931465
2995.3B88931465N9910k26955m20437j18561p14874o55880M22058q1311q28037p07321
3005B85660057k25048l56712O1779L3397n89637l74146o16245l54996k35252o87676
3014.6B82315521p72686k88944p3204n95703q11424q10090k79884n61581o94084l43666
3024.3B77084255p31125o51607q74825n19142l08552r86595j178512m64745J89495
3033B71558647n97172r20696r82265q81825m77161o52886p56893r25751r12532q12245
3042.6B63639221l96709m09088n71061n71727q34885p06081r41410m64116m79354r35765
3052.2B57329025o63109r46865q62198j044826p81460l29399m98772m79564r24893
3060.9B50797939p73315l73669m22230m20055l76530o47735p95937o70185p65457l91369
$$ plain form
2995.3 288931465 288991375 288764420 288343983 288225422 287510548 286854668 287276726 287195415 286367378 285660057
3005 285660057 285435009 285078297 285140076 285173473 284583836 284209690 283593445 283238449 283003197 282315521
3014.6 282315521 281542835 281253891 281180687 280584984 279773560 278963470 278683586 278122005 277427921 277084255
3024.3 277084255 276353130 275701523 274826698 274307556 273999004 273012409 271833897 271369152 271558647
3033 271558647 270961475 270040779 269058514 268176689 267699528 267046642 266289749 265363998 264451466 263639221
3042.6 263639221 263242512 262833424 262262363 261690636 260855751 260149670 259208260 258744144 258264790 257329025
3052.2 257329025 256665916 255719051 254856853 253812027 253030567 252701168 252202396 251722832 250797939
3060.9 250797939 250024624 249650955 249228725 248808670 248432140 247784405 246988468 246318283 245552826 245161457
3070.6B45161457m65851p02362n53093m08287l58391o58378o91281p94887m34780l51639
3080.2B39742508p77607n18799k84347k29988p03087q14267m66747k82554l18757p80315
3089.9B34566040n86319l33099m43611q21839q36620N4931j4362p32841p51057n39894
3099.5B29561329n71518q11348p13654l18203k27870m07334p86114p77340k66590l48186
3109.1B24333172m75121m16736n32761n62172n21965o16169p36542m12845l72811n82332
3118.8B19103718q06179q09307o11077p72495n34458k80609k05689m77676r10435q10013
3128.4B12885780m25129l05900j002159p69158m80900n56392j88866p09953l87364
3137.1B08059959m2266n32341p96471j228256q29449l46775m09260l68576o64673r30977
$$ plain form
3070.6 245161457 244695606 243993244 243440151 243031864 242673473 242015095 241323814 240528927 240094147 239742508
3080.2 239742508 238964901 238446102 238161755 237931767 237228680 236414413 235947666 235665112 235346355 234566040
3089.9 234566040 233979721 233646622 233203011 232381172 231544552 231599483 231585121 230852280 230101223 229561329
3099.5 229561329 228989811 228178463 227464809 227146606 226918736 226511402 225725288 224947948 224681358 224333172
3109.1 224333172 223858051 223441315 222908554 222346382 221824417 221208248 220471706 220058861 219686050 219103718
3118.8 219103718 218297539 217488232 216877155 216104660 215570202 215289593 215083904 214606228 213695793 212885780
3128.4 212885780 212460651 212154751 211152592 210383434 209902534 209346142 209157276 208447323 208059959
3137.1 208059959 208017693 207485352 206688881 205460625 204631176 204284401 203875141 203506565 202841892 201910915
3146.8B01910915m34036j10435m17138p50331p37553m35085o92253q30250m34857j39160
3156.4A96929817n22461j023903o00357l97377o88667j064320n91888n7011o08139
3165.1A91375694m91600j32332l19213p55120o31351k75593q77476j208992m89158
3173.8A86194859j26267n81722l52307m73690o54735l70541p44457o12106n50900j53293
3183.4A81574841L2177n85175o96106m67434m74892j198787p10545k21310m24213m42600
3193A76385956o75221q545j85508l97988n32570j007690o28910n56126r6454l71056
3202.7A71925888p76367m31404l37334j65119m74606o86435n41783k51503l02391k78148
3212.3A67680798j75553m69551n63087q19130m52194j0262l08571o70719l31898p8697
$$ plain form
3146.8 201910915 201476879 201366444 200949306 200198975 199461422 199026337 198334084 197503834 197068977 196929817
3156.4 196929817 196407356 195383453 194783096 194385719 193697052 192632732 192040844 191983833 191375694
3165.1 191375694 190884094 190751762 190432549 189677429 189046078 188770485 187893009 186684017 186194859
3173.8 186194859 186068592 185486870 185134563 184660873 184006138 183635597 182891140 182279034 181728134 181574841
3183.4 181574841 181607018 181021843 180325737 179858303 179383411 178184624 177474079 177252769 176828556 176385956
3193 176385956 175710735 175702190 175516682 175118694 174586124 173578434 172949524 172393398 172296944 171925888
3202.7 171925888 171149521 170718117 170380783 170215664 169741058 169054623 168512840 168261337 167958946 167680798
3212.3 167680798 167505245 167035694 166472607 165653477 165201283 165191021 164882450 164211731 163879833 163801136
3222A63801136p01866o02036m39510k87018q6956j78623k98977o32267l66020m29039
3231.6A59778824l09353j69477m90571l09181n24053n12839o5536K16141j31484n92842
3241.3A56889629n84135o77519k94504j62019n25437k69995k13975p05929j84250J28774
3250.9A53400640k62146J0243l17154m56152m30307m75445l44925o53076l67947k53467
3260.5A49850264j78662k91757k69461k4443m56838m13428n96876k11649j19438n89838
3270.2A46697874J50719L0584k06394j23301l65314l77064n20372l62950j58662j85719
3279.8A44579401l82929l43532J6079L9272l38068k98481o2637k65360n9634r5548
3289.5A42788563n31740l99704k96698k67258k12698k08893J73989n9977r32340l84474
$$ plain form
3222 163801136 163099270 162497234 162057724 161770706 161683750 161505127 161206150 160573883 160207863 159778824
3231.6 159778824 159469471 159299994 158809423 158500242 157976189 157463350 157397814 157613955 157482471 156889629
3241.3 156889629 156305494 155627975 155333471 155171452 154646015 154376020 154162045 153456116 153271866 153400640
3250.9 153400640 153138494 153148737 152831583 152375431 151945124 151469679 151124754 150471678 150103731 149850264
3260.5 149850264 149671602 149379845 149110384 149085941 148629103 148215675 147618799 147407150 147287712 146697874
3270.2 146697874 146848593 146879177 146672783 146549482 146184168 145807104 145286732 144923782 144765120 144579401
3279.8 144579401 144196472 143852940 143869019 143908291 143570223 143271742 143209105 142943745 142884111 142788563
3289.5 142788563 142256823 141857119 141560421 141293163 141080465 140871572 141045561 140985584 140053244 139668770
3299.1A39668770N37948J13917n25351J5545M09317l25985n48906m94518j12715Q0509
3308.8A38818531k64673k0790m41456p60298j50652L62435q736n52778l66431l42550
3318.4A36272602k36311k93693K4585J92099m57430m42314n93767l67146l1328m48341
3328.1A33618956n41726k48918L8185m51260o68859k94437k42310j60818j39561k68936
3337.7A30640316k52562p5674m2743k26403l98712j58500r1486l50037n88217m49314
3347.3A28006668K56672j17521n71480l00493o0072K72360k10K0342j48812p30514
3357A26626940m50659L6364j8387j43528M10156J67484k88028j08262l28788J65138
3366.6A26068430N94749o8369m10556l11537n35355l35998K43473K3727m48389k71730
$$ plain form
3299.1 139668770 140206718 140320635 139795284 139810829 140220146 139894161 139345255 138850737 138738022 138818531
3308.8 138818531 138553858 138533068 138091612 137331314 137180662 137543097 137534361 136981583 136615152 136272602
3318.4 136272602 136036291 135742598 135767183 135959282 135501852 135059538 134465771 134098625 134067297 133618956
3328.1 133618956 133077230 132828312 132866497 132415237 131746378 131451941 131209631 131048813 130909252 130640316
3337.7 130640316 130387754 130312080 130269337 130042934 129644222 129485722 129394236 129044199 128455982 128006668
3347.3 128006668 128263340 128145819 127574339 127273846 127213774 127486134 127485924 127506266 127357454 126626940
3357 126626940 126176281 126212645 126194258 126050730 126460886 126628370 126340342 126232080 125903292 126068430
3366.6 126068430 126663179 126594810 126184254 125872717 125337362 125001364 125244837 125268564 124820175 124548445
3376.3A24548445J25999J4000p3995R6082n0554l14312j35145J95722O361j92165o6080
3386.9A24154358J69039J10159O3610r0943l50151J85118J82028Q9836J87292j28727
3396.5A24571619n2204k84577k22339K10152J84040j85767k18706k31161P2966R13143
3406.2A24757166N1422k37226K54373j01499L271l02039J68152M36507q5631J53666
3415.8A25098162J19514m5881J3685L44706J86224j87006k80600L44744Q27160l50476
3425.5A26070232k24599L36589J44539O23713L95002j32408J50232Q17509K02980n13983
3435.1A27869806N4817J87188O3867J08042K66342L91855j8415j10807P64141J099853
3444.7A30676689O39258J97420l31765j12934K99740L66602K85034N88093O94447j9827
$$ plain form
3376.3 124548445 124674444 124688444 124614449 124710531 124659977 124345665 124210520 124406242 124412603 124220438 124154358
3386.9 124154358 124323397 124433556 124497166 124406223 124056072 124241190 124423218 124513054 124700346 124571619
3396.5 124571619 124519415 124234838 124012499 124222651 124406691 124220924 124002218 123771057 123844023 124757166
3406.2 124757166 124808588 124571362 124825735 124724236 124727507 124425468 124593620 125030127 124944496 125098162
3415.8 125098162 125217676 125171795 125185480 125530186 125716410 125529404 125248804 125593548 126420708 126070232
3425.5 126070232 125845633 126182222 126326761 126950474 127345476 127213068 127363300 128180809 128383789 127869806
3435.1 127869806 127924623 128111811 128175678 128283720 128550062 128941917 128923502 128812695 129576836 130676689
3444.7 130676689 131315947 131513367 131181602 131068668 131368408 131735010 132020044 132608137 133302584 133282757
3454.4A33282757J49345L39604M93812P22571J43804J94750O29921Q29477M10252L2272
3464A37228565k78435j17616J039047O69327K99530M27770K10982P22160J043530P51095
3473.7A41995955k06767j64041N46360P59439J244994N74855k36139K62566P28588
3482.3A45505810M48246M66051R51261O40927q8787K43196J275540R96885N29804N52359
3492A51521292J49717M61216Q36277O18000Q78906P73707J61781K87829Q43162P47757
3501.6A57279644N27763O22912O77042J047573O15215J06564J132240R67426J63136
3510.3A63139515O40011O28128J218567J263065N28011K15302K60811P72991Q28361
3519A69494762Q43716O58932R98096R04579k880J030007R66491O93531J125794L78685
$$ plain form
3454.4 133282757 133432102 133771706 134265518 134988089 135131893 135326643 135956564 136786041 137196293 137228565
3464 137228565 136950130 136832514 137871561 138540888 138840418 139268188 139479170 140201330 141244860 141995955
3473.7 141995955 141789188 141625147 142171507 142930946 144175940 144750795 144514656 144777222 145505810
3482.3 145505810 145954056 146420107 147371368 148012295 147923508 148166704 149442244 150439129 150968933 151521292
3492 151521292 151671009 152132225 152968502 153586502 154465408 155239115 155400896 155688725 156531887 157279644
3501.6 157279644 157807407 158430319 159107361 160154934 160770149 160876713 162008953 162976379 163139515
3510.3 163139515 163779526 164407654 165626221 166889286 167417297 167632599 167893410 168666401 169494762
3519 169494762 170338478 170997410 171995506 172900085 172897205 173927212 174893703 175587234 176713028 177091713
3528.6A77091713N52673J485234J196594O35357J006126R07288Q39348O76956N88035
3537.3A84979324J424675R47666q6631L61995J791611J361389O88210J130142O37245
3546A93235626R40762J097736J509915J084938J109142J754208M18014J102467J574268
3554.7B03827076J590614J205693N25913J281528J131821J291618R63612J639099J456928
3563.4B14913902Q54969K707196R41143L08780J349297J130257J979560J067181R94415
3572B26246700J338024K148056J911011R07955Q29735J217327K263432J761741J648064
3580.7B40272045J908302J918850J285839Q41237K206249J571846J136684J117554
3588.4B52258606R82475K531739K403736K596988J293965J015987K587662N85155J610298
$$ plain form
3528.6 177091713 177644386 179129620 180326214 180961571 181967697 182874985 183714333 184391289 184979324
3537.3 184979324 186403999 187351665 187265034 187627029 189418640 190780029 191468239 192598381 193235626
3546 193235626 194176388 195274124 196784039 197868977 198978119 200732327 201150341 202252808 203827076
3554.7 203827076 205417690 206623383 207149296 208430824 209562645 210854263 211817875 213456974 214913902
3563.4 214913902 215768871 218476067 219417210 219725990 221075287 222205544 224185104 225252285 226246700
3572 226246700 227584724 229732780 231643791 232551746 233381481 234598808 236862240 238623981 240272045
3580.7 240272045 242180347 244099197 245385036 246226273 248432522 250004368 251141052 252258606
3588.4 252258606 253241081 255772820 258176556 260773544 262067509 263083496 265671158 266256313 267866611
3597.1B67866611K937031J908360K105064J725674K068291K068214J370430K161961
3604.8B84211636K685451K440205P46784K254753J099625P35473N135117K843952M45423
3613.5C02598419K283344K37446L268605L155593J804200K797546J901665K495937
3621.2C20542755K615662K902527K707901K716903K838631L197746M874649J763153
3628.9C44159927k301216L569527L970604M239616K222901N53894L214492L966828
3636.6C63596573L481903K332535K390098K943764L290291L763924J933746K553940
3644.4C86286774M235229M242249J726837J579475N738182J426125J68838K590104
3652.1D07993813M819946M317474L471642M421882j813087L964081N434799K284584
$$ plain form
3597.1 267866611 270803642 272712002 274817066 276542740 278611031 280679245 282049675 284211636
3604.8 284211636 286897087 289337292 290084076 292338829 293438454 294173927 299309044 302152996 302598419
3613.5 302598419 304881763 305119209 308387814 311543407 313347607 316145153 318046818 320542755
3621.2 320542755 323158417 326060944 328768845 331485748 334324379 337522125 342396774 344159927
3628.9 344159927 341858711 345428238 349398842 353638458 355861359 356415253 359629745 363596573
3636.6 363596573 367078476 369411011 371801109 374744873 378035164 381799088 383732834 386286774
3644.4 386286774 390522003 394764252 396491089 398070564 403808746 405234871 405403709 407993813
3652.1 407993813 412813759 417131233 420602875 425024757 423211670 427175751 432610550 434895134
3659.8D34895134K931671K179146L585396K195244K321128L562622K167550M359932
3667.5D58197823K546463J246490J293449k574844M457474O809654O855202j445465
3675.2D77386246r723168N908470P192994L971824k83127K111245K930297K441979
3682.9D91936760K414818J678772J201744L453140N123291n165634m61235O062279
3690.6E06243935l297425J046868M694862J445160J671410Q94241k52876J418533J497498
3699.3E15362206J987762J766128k096405J5755L330612J648903Q13217J139946K363816
3708E26331940K114563n424652L750572M872246q478508L345108L508682J245308J199150
3716.7E32464409J261291Q44269j377754K233353L785400l123932k099495M656334
$$ plain form
3659.8 434895134 437826805 440005951 443591347 445786591 448107719 451670341 453837891 458197823
3667.5 458197823 460744286 461990776 463284225 460709381 465166855 471976509 478831711 477386246
3675.2 477386246 467663078 473571548 480764542 484736366 484453239 486564484 489494781 491936760
3682.9 491936760 494351578 496030350 497232094 500685234 505808525 500642891 500181656 506243935
3690.6 506243935 502946510 503993378 508688240 510133400 511804810 512699051 512446175 513864708 515362206
3699.3 515362206 517349968 519116096 517019691 517035446 520366058 522014961 522828178 523968124 526331940
3708 526331940 528446503 523021851 526772423 531644669 523166161 526511269 530019951 531265259 532464409
3716.7 532464409 533725700 534569969 533192215 535425568 539210968 536087036 533987541 538643875
3724.4E38643875J926918l37982j251030N42488K948952Q68606L587990k877312n706253
3733.1E38346252P277489L9597n558014J772804J844025Q85391J687660J542282l636780
3741.8E44200706K436219Q092842r645462r411583Q622093M586220L749122j318359
3749.5E51311798o516151O790313n647354m186859N927391M047661K783585l138657
3757.2E51371727K168045M291649n575028j600265K694168J014442K70844K894554
3764.9E57530136k259636k790870L409118L138428k32353o178894J602173K109527
3772.6E56327629N43442J244774J03416J109276K4185J950607o76422o044120K036018
3781.3E56618805J663895J643982K068099j523857r36393L45039Q41179J048279K39219
$$ plain form
3724.4 538643875 540570793 540232811 538981781 539524269 542473221 543341827 546929817 544052505 538346252
3733.1 538346252 545623741 545663338 540105324 541878128 543722153 544607544 546295204 547837486 544200706
3741.8 544200706 546636925 554729767 545084305 535672722 544294815 548881035 552630157 551311798
3749.5 551311798 544795647 551585960 545938606 541751747 547679138 551726799 554510384 551371727
3757.2 551371727 553539772 557831421 552256393 550656128 553350296 554364738 554635582 557530136
3764.9 557530136 555270500 552479630 555888748 559027176 558794823 552615929 554218102 556327629
3772.6 556327629 556871071 558115845 558219261 559328537 559352722 561303329 560626907 554582787 556618805
3781.3 556618805 558282700 559926682 561994781 560470924 559534531 559879570 560720749 561769028 562008247
3790E62008247l9329P324k16179k2392J422233K293435k080231k747040J680527K743721
3799.6E65050316L193817p481422o601143N420570K901993L035622K188720p143631
3807.3E60564842j085357M036331J067810k82746O82488K43568Q69980K793083k283859
3816E66606140q118439M696732N396233K955551j69297j1974525J936989L641319Q50220
3824.7E65820923J699715P1182k619248J64681J740455K113228K35443n984726J925774
3833.4E65167427N239754m394837K33956O019821q279877l380241O757355k077446
3841.1E65285912j54763M175225k133789j957741K153320R10568L6583Q76656l66593
3849.8E68825378J376839L689499n526619j681900r763451K851029Q420410q52776
$$ plain form
3790 562008247 561968918 561976242 561760063 561737671 563159904 565453339 563373108 560626068 562306595 565050316
3799.6 565050316 568244133 560762711 554161568 559582138 562484131 565519753 567708473 560564842
3807.3 560564842 559479485 563515816 564583626 564300880 564983368 565226936 566096916 568889999 566606140
3816 566606140 558487701 563184433 568580666 571536217 571366920 559392395 561329384 564970703 565820923
3824.7 565820923 567520638 567591820 564972572 565137253 566877708 568990936 569226379 563241653 565167427
3833.4 565167427 570407181 566012344 566246300 572266121 563986244 560606003 567363358 565285912
3841.1 565285912 565131149 569306374 567172585 565214844 567368164 568278732 568315315 569191971 568825378
3849.8 568825378 570202217 573891716 568365097 566683197 556919746 559770775 568191185 567338409
3857.5E67338409r01489J746597R26133N28183m497147J914825M489403m900932k374687
3866.2E64269295L024177L604126K237168q834458m408378M591331M494248J376342
3873.9E70353851o331062J205482K689972J12725J956863K254868n411148m105874
3881.6E62725677M768639J126404N91278K403984q567047J207504L096047J069107
3889.3E68421593L003196j296806n770035J334801J699867j381340J195259Q46100
3897E68052635J811981J398011o371079L667450R90944m708862J301269j646843L24250
3905.7E64819756O42585N98641M68216M35867O78902q19512o8283K20909L97759O56242
3915.3E68031082L59078k787934j568947L083992l08342j774139J375465J015130M29573
$$ plain form
3857.5 567338409 566436920 568183517 569109650 569637833 565140686 567055511 571544914 566643982 564269295
3866.2 564269295 567293472 570897598 573134766 564300308 559891930 564483261 568977509 570353851
3873.9 570353851 564022789 565228271 567918243 568030968 569987831 572242699 566831551 562725677
3881.6 562725677 567494316 568620720 569211998 571615982 563048935 564256439 567352486 568421593
3889.3 568421593 571424789 570127983 564357948 565692749 567392616 566011276 567206535 568052635
3897 568052635 569864616 571262627 564891548 568558998 569549942 564841080 566142349 564495506 564819756
3905.7 564819756 565462341 566060982 566529198 566965065 567643967 566824455 566756172 566977081 567374840 568031082
3915.3 568031082 568390160 565602226 564033279 567117271 566808929 565034790 566410255 567425385 567854958
3924E67854958j482773j675873P74040J453209N64118j694718q16727J474228j679191
3932.7E64771271r78623J810532l18871n88607M57801J77536m56428k00234J495362
3941.4E66169739J052933j823731k08893R19342j52244k74620j406136M38194L20664
3950.1E65035248j641541Q44498K62794l77578L5515K20527M67720n9166O14434l8109
3959.7E65364342q3847r31015j024361N03311k7313M04396n0735L0212P4882l92570
3969.3E63867302J47667L9101K36053n24788k82440L94401J69220J93978L30314K75193
3979E64846001p99065l48091O84318J31264m99229O561k53944o73333Q8921L83415
3988.6E63566818P36885k93121j81236M61769m20380L1929j10054o5880L07694M67033
$$ plain form
3924 567854958 566372185 564696312 565470352 566923561 567487679 565792961 564976234 566450462 564771271
3932.7 564771271 563792648 565603180 565284309 564695702 565153503 565331039 564874611 564674377 566169739
3941.4 566169739 567222672 565398941 565190048 566109390 565957146 565682526 564276390 564714584 565035248
3950.1 565035248 563393707 564238205 564500999 564123421 564158936 564379463 564847183 564788017 565402451 565364342
3959.7 565364342 565280495 564349480 563325119 563828430 563801117 564205513 564154778 564184990 564259872 563867302
3969.3 563867302 564014969 564054070 564290123 563765335 563482895 563877296 564046516 564240494 564570808 564846001
3979 564846001 564046936 563698845 564383163 564514427 564015198 564021759 563767815 563094482 563183403 563566818
3988.6 563566818 564303703 564010582 563829346 564291115 563870735 563902664 563792610 563726730 564034424 564501457
3998.3E64501457Q0528m85153
4000.2E64096832
$$ plain form
3998.3 564501457 564581985 564096832
4000.2 564096832
##END=$$ End of the data block
