##TITLE=$$ Begin of the data block
##JCAMP-DX=5.00 $$ ACD/SpecManager v 10.08
##SPECTROMETER/DATA SYSTEM=Varian
##DATE=15 Jan 2013 15:39:52
##DATA TYPE=INFRARED SPECTRUM
##DATA CLASS=XYDATA
##ORIGIN=
##OWNER=
##NPOINTS=3735
##FIRSTX=399.26403809
##LASTX=4000.35498047
##MAXX=4000.35498047
##MINX=399.26403809
##MAXY=61.93020248
##MINY=12.38205624
##XFACTOR=1.0000000000
##YFACTOR=0.000000100000000
##FIRSTY=25.56997490
##DELTAX=0.96440572
##XUNITS=1/CM
##YUNITS=TRANSMITTANCE
##XYDATA=(X++(Y..Y))
399.3B55699749J074791J2608490O548576q726921K99301l77922j59836J911202j259613
407.9B67617817l322315l71018O239224l337136p086906n947304j152172L370800K400971
416.6B58411961k423954q172608J0428791n645752J175537O992188J31645m40273m4193
425.3B60413342j924115j718654K829647J848469L668174J396275n816498l39069Q7585
434B60445156J429577q27866k275180R42802J150036L744221J027317j381798m863682
442.7B59390583j089249J003399j16443O64806k207394L698502L836899J488971p24010
451.3B65946064k425671k016277m514255l80307m282970m254818L524952K42042K4872
460B51863632K46639P14531k898426J877842M718190k696381m847260j072483K447167
$$ plain form
399.3 255699749 256774540 269383030 275931606 267204685 267503986 267126064 266966228 268877430 267617817
407.9 267617817 264295502 263924484 270163708 266826572 259739666 253792362 252640190 256010990 258411961
416.6 258411961 255988007 247815399 258244190 252598438 253773975 260766163 260897808 260457535 260413342
425.3 260413342 258489227 256770573 259600220 261448689 265116863 266513138 260696640 260357571 260445156
434 260445156 261874733 261046867 258771687 259714489 260864525 264608746 265636063 264254265 259390583
442.7 259390583 258301334 259304733 259188290 259853096 257645702 261344204 265181103 266670074 265946064
451.3 265946064 263520393 261504116 256989861 256609554 252326584 248071766 251596718 251838760 251863632
460 251863632 252110271 252824802 249926376 251804218 256522408 253826027 248978767 247906284 250353451
468.7B50353451q5583J689987p44915k208805K094402j157798J866493J034317k742138
477.4B50099411k477798j429425j494484n40447K21443k585926R55124M471264J620960
486.1B48840122J78776o55422r94892k56634k289944k616253K575054L03917O85597
494.7B45770321m38938k940808J982651J56689n96543O99711O7330Q89129l090038
503.4B42499504m081001Q47473L575897j352844k809429o71883K214413K323818k413483
512.1B40132465j481800j611614k072792K269802K525520k402229k214355J008815
519.8B36153812p16457l101082m47311K429428k33669j530362Q62484J43433j718883
528.5B31841393j298619J714478J083488r22355k56367n79586j382466p57885K91844
$$ plain form
468.7 250353451 250267868 251957855 251212940 249004135 251098537 249940739 251807232 252841549 250099411
477.4 250099411 247621613 246192188 244697704 244157257 244378700 241792774 242747898 247219162 248840122
486.1 248840122 249018898 248363476 247368584 247111950 244822006 242205753 244780807 245084724 245770321
494.7 245770321 245331383 242390575 244373226 244529915 243933372 244633083 244700413 245589542 242499504
503.4 242499504 238418503 239265976 242841873 241489029 238679600 238007717 240222130 242545948 240132465
512.1 240132465 238650665 237039051 234966259 237236061 239761581 237359352 235144997 236153812
519.8 236153812 235437355 232336273 231888962 234318390 234084721 232554359 233416843 233560276 231841393
528.5 231841393 230542774 232257252 233340740 232418385 232162018 231582432 230199966 229442081 229733925
537.2B29733925n1651P58171Q18443q48446j184883m72622K34566j28231r45759j660423
546.8B26253090P03888P29236j458339J011028J124744q13083j506424o47621J059761
555.5B26456280N52311j321926k468987n26752J98192k87247N43290J065902Q34446
564.2B25045509M64344m22916k281494J16787J597118n93033l80306o67229p76939
572.9B22101841o97384q25767P14893J573887n49889q49171O23742p07016p28093J041108
582.5B21698151J411514Q6880j561585m23488R48066J477452J093959M07372L80077
591.2B25518398K76528L06949k13699q75282n7068J504879J109981P19166R32503l6945
600.8B29185410j11237r63459j032162j793n99498k24896j26018j003151k71950L31249
$$ plain form
537.2 229733925 229682274 230440445 231258888 230410442 229225559 228752937 228987503 228859272 227913513 226253090
546.8 226253090 226956978 227686214 226227875 227238903 228363647 227550564 226044140 225396519 226456280
555.5 226456280 227008591 225686665 223217678 222690926 222889118 222601871 223145161 224211063 225045509
564.2 225045509 225509853 225086937 222805443 222922230 224519348 223926315 223546009 222878780 222101841
572.9 222101841 221404457 220578690 221293583 222867470 222317581 221468410 222092152 221385136 220657043 221698151
582.5 221698151 223109665 223196545 221634960 221211472 222159538 223636990 224730949 225138321 225518398
591.2 225518398 225794926 226101875 225888176 225012894 224955826 226460705 227570686 228289852 229222355 229185410
600.8 229185410 229074173 228110714 227078552 227076759 226477261 226252365 226126347 225123196 224851246 225182495
610.5B25182495m15954L68976N75638p06062K32772M61750j233215j099510N55954
619.2B23922844J480408N76400n66139M43726R25903K35806l31860k17209J970921
627.8B28440800K299747J215306J041107Q01849J561279Q62713O37493J355229M06399
636.5B38621922Q17203Q90274J97353R97963J433831N13420R45816K130546J109715
645.2B47658043M05064O21509J014519Q06675j41468N61599Q76465N22404J72367M7073
654.8B52544250P19281R95807j49517j248130l96348m53414N7506R26895k61020j157093
664.5B51578217l23792R56535N10426L742943P64560j339321o0501J53389O19507M09107
674.1B57011070N15671J319008R12323Q07304Q00362J671162J197357M19197J077289
$$ plain form
610.5 225182495 224766541 225135517 225711155 225005093 225237865 225699615 224466400 223366890 223922844
619.2 223922844 225403252 225979652 225413513 225857239 226783142 227018948 226687088 226469879 228440800
627.8 228440800 230740547 231955853 232996960 233798809 235360088 236222801 236860294 238215523 238621922
636.5 238621922 239439125 240329399 240526752 241524715 242958546 243471966 244417782 246548328 247658043
645.2 247658043 248063107 248684616 249699135 250505810 250364342 250925941 251802406 252324810 252497177 252544250
654.8 252544250 253263531 254259338 254109821 252861691 252465343 252011929 252069435 252996330 252735310 251578217
664.5 251578217 251254425 252210960 252721386 256464329 257228889 255889568 255829067 255982456 256601963 257011070
674.1 257011070 257526741 258845749 259758072 260565376 261365738 263036900 264234257 264653454 265730743
682.8B65730743J073075J090355Q86097P21988O07720N0144k91252M09832M08993P11803
692.4B71399498R39236n47009M68979O23550r5367R92489N39303Q0147o047M69361
702.1B74864140J275920J409970J266327J069183R12094K0771k87876N54562R17472
710.8B82002563N83821R36050K99149P00187K136269M27075l05825N10025J548157
719.5B88837471P09457n87616P06997N47428R57146P65553N28297N82924k75135R85126
729.1B93757648J537648J161308O01234R39999L24211m90837O27556J19114N18474
737.8B99096355Q17013N58167K65693P08943J713352L87459P5855J61209K68097J82686
747.4C04234829O52828Q85811L56369J200905K50702M41055P85618R25827J385117
$$ plain form
682.8 265730743 266803818 267894173 268780270 269502258 270109978 270160122 269868870 270278702 270687695 271399498
692.4 271399498 272338734 271791725 272260704 272884254 272788887 273781376 274320679 274400826 274394779 274864140
702.1 274864140 276140060 277550030 278816357 279885540 280797634 280818405 280530529 281085091 282002563
710.8 282002563 282586384 283522434 283821583 284521770 286658039 287085114 286779289 287289314 288837471
719.5 288837471 289546928 288959312 289666309 290213737 291170883 291936436 292464733 293047657 292772522 293757648
729.1 293757648 295295296 296456604 297057838 297997837 298322048 297831211 298458767 298577881 299096355
737.8 299096355 299913368 300471535 300737228 301446171 303159523 303546982 303622837 303784046 304052143 304234829
747.4 304234829 304887657 305773468 306129837 307330742 307581444 308022499 308808117 309733944 311119061
756.1C11119061N64212J421604J601201J338272K32010K91900O66714L36590J001720
764.8C18573284k89192P02915J538162Q54874L43475K52762M41323q90618N2605l83721
774.4C21195869k94075J175423Q00705j69258j054192O91529O45828R689m5852M30679
784.1C23386345J131325O37283J645470L41262J59874k59780j847001Q9875N74074
792.7C25858727j42212j13602M96p83158p11441l70788r27544j606598k423229j497097
802.4C17283554q78220j175079k092037j524868j113110k035331k092057k507286j212501
811.1C02653065j399937j813679q73146j222534j035423r70249n95398j098461p87545
819.7B92856693o6032q52490R0695J424866J022357J02616J277942K169953J769047
$$ plain form
756.1 311119061 311683273 313104877 314706078 316044350 316276360 316568260 317234974 317571564 318573284
764.8 318573284 318284092 318987007 320525169 321380043 321723518 321976280 322417603 321526985 321579590 321195869
774.4 321195869 320901794 322077217 322877922 322708664 321654472 322346001 322991829 323001518 322955666 323386345
784.1 323386345 324517670 325154953 326800423 327141685 327301559 327041779 325194778 325284653 325858727
792.7 325858727 325716515 325602913 325603409 324820251 324108810 323738022 322810478 321203880 318780651 317283554
802.4 317283554 316405334 315230255 313138218 311613350 310500240 308464909 306372852 303865566 302653065
811.1 302653065 301253128 299439449 298566303 297343769 296308346 295338097 294742699 293644238 292856693
819.7 292856693 292790661 291938171 292028866 293453732 294476089 294578705 295856647 298026600 299795647
828.4B99795647J746788K380333L001327J583061K139035K895870J590862P12319J554355
837.1C17399597L038025K135735K335510K510223K082329J343575J515350K496338
844.8C34856682O74057R25827K022323L198777K750511J249122K200356K418556K561035
853.5C52857246J526604J351967J273651K207146L088798K096520K661247J071548
861.2C68134727J313057J831856J408158P76901m32701M53376r1323N56526m57382
869.9C73493195j803818k236939k103767n63507j120491L5324k99797n70831j84403
878.6C64644966q39310j54228k2316n93490j910401o27403p70569r26933J26762q48732
888.2C58078346l8757L12843j0299j123887p54814Q4954N68313R44405m35906M71535
$$ plain form
828.4 299795647 301542435 303922768 306924095 308507156 310646191 313542061 315132923 315845242 317399597
837.1 317399597 320437622 322573357 324908867 327419090 329501419 330844994 332360344 334856682
844.8 334856682 335530739 336456566 338478889 341677666 344428177 345677299 347877655 350296211 352857246
853.5 352857246 354383850 355735817 357009468 359216614 362305412 364401932 367063179 368134727
861.2 368134727 369447784 371279640 372687798 373464699 373031998 373485374 373394051 373950577 373493195
869.9 373493195 371689377 369452438 367348671 366785164 365664673 365699997 365400200 364829369 364644966
878.6 364644966 363805656 363651428 363629112 363035622 361125221 360497818 359727249 358800316 358927078 358078346
888.2 358078346 358039589 358352432 358342133 357218246 356463432 356548386 357116699 358061104 357625198 358096733
897.9C58096733J16882N09835N77926r44214p09228r10111O15769J362533J600686
906.5C60316811J418075J413498Q32024r08165j79024m65622k74200m24805o80657
915.2C61047935j729583k692032j815148k582397j742401k272911k438660k071800
922.9C43703003k675781k225762k931099k447357k925186l031921k330666j817703
930.7C23317528j449929j823234j249218j453438r75666j511078j001034k51846j125584
939.3C12476501n7029j345368j465473o66160j425572j438255j802120j305485r43814
948C02027225o71730j095104j269245j006603j090031r97715k110348k233848j982155
956.7B89570446k341022k475319k487412k312775j688995j677132k366962j803837
$$ plain form
897.9 358096733 358213615 358723450 359301376 358357162 357647934 356737823 357353592 358716125 360316811
906.5 360316811 361734886 363148384 363980408 363072243 362893219 362427597 362153397 361728592 361047935
915.2 361047935 359318352 356626320 354811172 352228775 350486374 348213463 345774803 343703003
922.9 343703003 341027222 338801460 335870361 333423004 330497818 327465897 325135231 323317528
930.7 323317528 321867599 320044365 318795147 317341709 316366043 314854965 313853931 313602085 312476501
939.3 312476501 312419472 311074104 309608631 308942471 307516899 306078644 304276524 302971039 302027225
948 302027225 301355495 300260391 298991146 297984543 296894512 295896797 293786449 291552601 289570446
956.7 289570446 287229424 284754105 282266693 279953918 278264923 276587791 274220829 272416992
964.4B72416992j968441k214451k052879j961555j271744j510315j676960j867676
972.1B57892971k572117k685890k010174k225857k665424k341595k977771l212395
979.8B37201748l073406l102074l040123l220577l520794l597088l759556m055919
987.6B09832211l272477k854633k967987l254871l597317l533745l564835l172931
995.3A83613415k710991k682762k613411k170277k272301k248859j982746k081680
1003A64850388j751748r97867r52702j102295l45049p05165j019373j162272j326370
1011.7A55487547q12521p71265j283369k503319j273413j82752j190434k219200j861801
1020.3A43389473l27921j894789j851339j015043j377678r82313j320391j556501k106286
$$ plain form
964.4 272416992 270448551 268234100 266181221 264219666 262947922 261437607 259760647 257892971
972.1 257892971 255320854 252634964 250624790 248398933 245733509 243391914 240414143 237201748
979.8 237201748 234128342 231026268 227986145 224765568 221244774 217647686 213888130 209832211
987.6 209832211 206559734 203705101 200737114 197482243 193884926 190351181 186786346 183613415
995.3 183613415 180902424 178219662 175606251 173435974 171163673 168914814 166932068 164850388
1003 164850388 163098640 162100773 161148071 160045776 159700727 158995562 157976189 156813917 155487547
1011.7 155487547 154675026 153903761 152620392 150117073 148843660 148660908 147470474 145251274 143389473
1020.3 143389473 143061552 141166763 139315424 138300381 136922703 135940390 134619999 133063498 130957212
1029A30957212k33383l97873j377630o70938q33054M35514o7996N01451Q73585O35261
1038.7A29822149O89154J91431J070423K29502O98232N73617M6730O05096j4267n13057
1048.3A33399010j056605p9403j79205K7619K0676j42994N48009l70054j35622n33705
1058A31497726M40045R81560K70137R65100J375341K138062J437883J510944J493874
1066.6A42110672J315451J409979J016578J136351N32102J244917N65882j72234O55356
1075.3A49815054J219521J515140k7418L16973J530704J163407J81083J76230J021690
1084A56912384J004009J410141J737652J923599J361256R46102Q45394M76837J303578
1092.7A67920952J908913J517601R77420Q67615O17714Q54797J313038J600876J568470
$$ plain form
1029 130957212 130723829 130325956 128948326 128277388 127444334 127879848 127811852 128313303 129186888 129822149
1038.7 129822149 130511303 130702734 131773157 132002659 132700891 133274508 133321238 133926334 133912067 133399010
1048.3 133399010 132342405 132263002 132083797 132111416 132132092 131989098 132537107 132167053 132031431 131497726
1058 131497726 131937771 132919331 133189468 134154568 135529909 137667971 139105854 140616798 142110672
1066.6 142110672 143426123 144836102 145852680 146989031 147521133 148766050 149331932 149159698 149815054
1075.3 149815054 151034575 152549715 152522297 152839270 154369974 155533381 155714464 155890694 156912384
1084 156912384 157916393 159326534 161064186 162987785 164349041 165295143 166140537 166617374 167920952
1092.7 167920952 169829865 171347466 172324886 173192501 173810215 174665012 175978050 177578926 179147396
1101.4A79147396Q79402J314869J328945P92008M78935Q46519J182232M88453N68829
1110A87027588k86026l64151Q22620R30634R35364M96559P83004O37665n15175p11383
1119.7A89756699J64947P85084N78155L86296l93029N48001J867294Q55370K96402
1128.4A94845219J049823K012425J212463L40328J377430J592541J203690J445350
1136.1B05079269J478100J426926J286106J509838J285706M46491M43077K25773L14922
1144.8B13496208Q29125N50651J29490M11339J005211J67217o73885j00041k6760k19231
1154.4B15569324k28385n85251n95017n56412o37035n54352m57077k30789o3743j29815
1164B11531448q4972N12104J438313J934356K163792K026958J200753J297321K030811
$$ plain form
1101.4 179147396 180026798 181341667 182670612 183462620 183941555 184788074 185970306 186458759 187027588
1110 187027588 186741562 186377411 187200031 188130665 189066029 189562588 190345592 190983257 190468082 189756699
1119.7 189756699 189921646 190706730 191284885 191671181 191278152 191826153 193693447 194548817 194845219
1128.4 194845219 195895042 197907467 199119930 199460258 200837688 202430229 203633919 205079269
1136.1 205079269 206557369 207984295 209270401 210780239 212065945 212512436 212955513 213181286 213496208
1144.8 213496208 214325333 214875984 215005474 215416813 216422024 216589241 215915356 215815315 215788555 215569324
1154.4 215569324 215340939 214755688 214160671 213604259 212967224 212412872 211955795 211725006 211661263 211531448
1164 211531448 211446476 211958580 213396893 215331249 217495041 219521999 220722752 222020073 224050884
1172.7B24050884K487545K376461K001057J878471K053643K448387K164478J948109
1180.4B41409035J878509J293831R97563J666412J427212O14929M70562K81181M24900
1189.1B50464134j94015q56381n28564j6918p71218j479549j051941j139202j099739
1197.8B43326607j081524q32558j455269k161827j504154j527081j299819p27711j045513
1206.5B31691151j583577j024704q16688j102886n9338j32027o34861J37501n8403
1215.1B26416168p40356m99020J60961J53485k63596k86446q9798J87092J06278k14997
1224.8B24929771j73149j90181n16301n69877p00951o91757j16596q9512j64986k54135
1234.4B21462326r16538o81057l45307l25260L6907j93672j16462k81926n45044l2577
$$ plain form
1172.7 224050884 226538429 228914890 230915947 232794418 234848061 237296448 239460926 241409035
1180.4 241409035 243287544 244581375 245578938 247245350 248672562 249287491 249758053 250039234 250464134
1189.1 250464134 250270119 249413738 248885174 248868256 248097038 246617489 245565548 244426346 243326607
1197.8 243326607 242245083 241412525 239957256 237795429 236291275 234764194 233464375 232736664 231691151
1206.5 231691151 230107574 229082870 228266182 227163296 227103958 226971931 226337070 226474571 226416168
1215.1 226416168 225675812 225176792 225337753 225491238 225227642 224941196 224851398 225038490 225144768 224929771
1224.8 224929771 224756622 224566441 224050140 223480263 222779312 222087555 221970959 221881447 221716461 221462326
1234.4 221462326 220545788 219864731 219519424 219194164 219231071 219037399 218920937 218639011 218093967 218061390
1244.1B18061390k70672o46706q19454o13823j04580l43742m29153k04602k21309p8259
1253.7B14329090K899l76701n40638l69206L6889L70712K17800j14861j66053L35655
1263.4B13725586M11529K47441M86889Q15963Q00915N56889P13520P73182Q07209R11293
1273B20250416J146736R90295P06272J156407J514454J482258J009674Q78658J219444
1281.7B30354614J600991J560192R84382J499005J972808J078930J010228J463470
1289.4B41524620J392384J671886J044674P67250J058159O80103O08025O91185J260814
1298.1B50699100J155644N03616K35539J63135J85585L23277N32322K02560K67277
1306.8B54268055j08128j33934j12285p87163j36356j34907o74133J0433N18722J2055
$$ plain form
1244.1 218061390 217790718 217144012 216324558 215710735 215606155 215262413 214833260 214628658 214407349 214329090
1253.7 214329090 214331989 213955288 213414650 213045444 213082333 213453045 213670845 213555984 213389931 213725586
1263.4 213725586 214137115 214384556 214871445 215687408 216488323 217045212 217758732 218531914 219339123 220250416
1273 220250416 221397152 222387447 223093719 224250126 225764580 227246838 228256512 229135170 230354614
1281.7 230354614 231955605 233515797 234500179 235999184 237971992 239050922 240061150 241524620
1289.4 241524620 242917004 244588890 245633564 246400814 247458973 248139076 248747101 249438286 250699100
1298.1 250699100 251854744 252358360 252593899 252757034 252942619 253265896 253798218 254000778 254268055
1306.8 254268055 254159927 254025993 253913708 253126545 252990189 252855282 252181149 252191582 252710304 252722359
1316.4B52722359J98974P85981L98826M87557M60796L37944M10442R24836O35013o0425
1326B57302303P00989M28829k43797m30870j73950m11167p42665l21636n03674j94873
1335.7B55409489k50378o1340q8024n27325k57206j77155O25668L52936M36325O59237
1345.3B56122227M57668N43995k45609L6335O10j4019l51238p14360p5683q1692m9496
1355.9B55628738o89849n87979m11053k38742j53160p81327n60302j125470k97718
1364.6B50783138m20532p19700n87578j100292n76324m62532k30465j25141J2550l78304
1374.3B46194820p98339k44351m79679m09813o20861O9771O4411n56774n67017j006317
1383.9B41645851p68547r22756j081886j674977o75659k79865q87318o55670r97753
$$ plain form
1316.4 252722359 252921333 253707314 254106140 254593697 255054493 255392437 255802879 256727715 257362728 257302303
1326 257302303 258003292 258432121 258188324 257757454 257583504 257172337 256429672 256108036 255604362 255409489
1335.7 255409489 255159111 255097771 255009747 254482422 254225216 254048061 254673729 255026665 255462990 256122227
1345.3 256122227 256579895 257123890 256878281 256914616 256915226 256901207 256549969 255835609 255759926 255678234 255628738
1355.9 255628738 254938889 254350910 253939857 253701115 253547955 252766628 252206326 251080856 250783138
1364.6 250783138 250362606 249642906 249055328 247955036 247378712 246916180 246685715 246560574 246573124 246194820
1374.3 246194820 245396481 245152130 244672451 244262638 243641777 243711548 243775959 243219185 242652168 241645851
1383.9 241645851 240877304 239954548 238872662 237197685 236522026 236242161 235354843 234699173 233701420
1392.6B33701420p10316j176720k357234j360016p49169o97441j719227r24930q69808
1401.3B23136559j494294j546135j381244j764908j308632l19767q93021r50126p28531
1409.9B12749901q74710p40719j092110q00609q25920q80547m91047k60429J69181
1418.6B06952991q28838j17779N35717J75457M6063n92270L51734Q00114L35159J72176
1428.3B07830524J77288P41234K94419M41417M25663M71382J113968O51646Q58479
1437B13006020Q02116P06100P03850P44553O63051M02680P93934N12600M70314O37874
1446.6B19443092M07696k56481O16569J084404L97759K95296o8169L05367L30295M99001
1456.2B23054829P88688M16470J634788J21861J199608J016292Q80108J342240L89041
$$ plain form
1392.6 233701420 232991104 231814384 229457150 228097134 227347965 226650524 224931297 224006367 223136559
1401.3 223136559 221642265 220096130 218714886 216949978 215641346 215321579 214428558 213478432 212749901
1409.9 212749901 211875191 211134472 210042362 209241753 208415833 207535286 207044239 206783810 206952991
1418.6 206952991 206124153 206006374 206542091 206717548 206763611 206171341 206523075 207323189 207658348 207830524
1428.3 207830524 208007812 208749046 209043465 209484882 209910545 210381927 211495895 212147541 213006020
1437 213006020 213808136 214514236 215218086 215962639 216625690 217028370 217822304 218334904 218805218 219443092
1446.6 219443092 219850788 219594307 220210876 221295280 221693039 221988335 221920166 222225533 222555828 223054829
1456.2 223054829 223843517 224259987 225894775 226016636 227216244 228232536 229112644 230454884 230843925
1464.9B30843925J737462J431713J871013J837311K359905K679425J607895K933769
1472.6B47302418L074665L011780K184620K245903L121776K204380J538010J733436
1480.3B66416988J985073J869736J952439J548461J040001R99890R30137l3359N2070
1489B76761436q48751k77004M3850l17764o97670j165066j457863n071316j98135j153755
1498.7B65617962l115673n73311j339417j143531j078873j02367j025849n210647m61045
1507.3B51567249P16992N54886r00422M55094p32308j157512m58031j185417k01130
1516B48659401j164608j374302K76928R51309o17447j304722R43146M5605P66964k99454
1525.7B46882820R67770J078720Q41522P15885L69492Q22487O56643O95400j628418
$$ plain form
1464.9 230843925 232581387 234013100 235884113 237721424 240081329 242760754 244368649 247302418
1472.6 247302418 250377083 253388863 255573483 257819386 260941162 263145542 264683552 266416988
1480.3 266416988 268402061 270271797 272224236 273772697 274812698 275812588 276742725 276709366 276761436
1489 276761436 275912685 275635681 275679531 275361767 274664097 273499031 272041168 266969852 266771717 265617962
1498.7 265617962 262502289 261928978 260589561 259446030 258367157 258264790 257238941 252028294 251567249
1507.3 251567249 252284241 252839127 251938705 252393799 251661491 250503979 250045948 248860531 248659401
1516 248659401 247494793 246120491 246397419 247348728 246731281 245426559 246369705 246415310 247182274 246882820
1525.7 246882820 247850590 248929310 249770832 250486717 250856209 251678696 252335339 253030739 251402321
1534.3B51402321O36330R98287J033287K074470k370777j630497J872139N87673P12262
1543B55315495J401748J440144k03343J081906L58219P78007J008206K26326L72295
1551.7B61779003O7711R83620j328183M51966J317806M13704k160702r706459N274353
1560.4B57092819J976338R86690o20975o40526j317806j568337o60725j428718p23019
1569.1B53095741n070648j310196j714477k447281j418076j577682j064167r114151
1576.8B29379063J0681j545830k881165l082313m066067k182045l452511k234439l723202
1585.5B06222172l049088k818527l266125k128582m344005k240582l461303j858140
1593.2A83055820k450809l450699j766186l178501j671104l477707j476822k527637
$$ plain form
1534.3 251402321 252038651 253036938 254070225 256144695 253773918 252143421 254015560 254603233 255315495
1543 255315495 256717243 258157387 257954044 259035950 259394169 260172176 261180382 261406708 261779003
1551.7 261779003 261846714 262830334 261502151 261954117 263271923 263685627 261524925 251818466 257092819
1560.4 257092819 259069157 260055847 259434872 258794346 257476540 255908203 255247478 253818760 253095741
1569.1 253095741 248025093 246714897 245000420 242553139 241135063 239557381 238493214 229379063
1576.8 229379063 229389744 227843914 224962749 221880436 217814369 215632324 212179813 209945374 206222172
1585.5 206222172 203173084 200354557 197088432 194959850 190615845 188375263 184913960 183055820
1593.2 183055820 180605011 177154312 175388126 172209625 170538521 167060814 165583992 163056355
1600.9A63056355k517891j395817k607031o23064k541676o22968k301417j220579r24034
1609.6A48301878k051067J09472k040587P8612j668978k71454l09591l522024J240473
1618.2A39866734j036435R70002j112500O34547l80593q33540J423321o95171J503019
1626.9A40339384j008625Q66213L77064N72967P99484K02961K130194k12803J618910
1635.6A45685749j521130J674624J242714R44910J761246n1289J983242k6350J391773
1644.3A53085489J099520q48703K114734m66480K435780P6017K007284O60772l840770
1653A56323643L393650K38542K812720K10323J627884N50651J389390J577072Q22773
1661.6A68946648K111873J80054K994404J328983K043820J924877J813106L446026
$$ plain form
1600.9 163056355 160538464 159142647 156535616 155912552 153370876 152747908 150446491 149225912 148301878
1609.6 148301878 146250811 146360283 144319696 144398308 142729330 142457876 142148285 138626261 139866734
1618.2 139866734 138830299 139800301 138687801 139322348 138941755 138108215 139531536 138836365 140339384
1626.9 140339384 139330759 140196972 140574036 141147003 141946487 142149448 144279642 144066839 145685749
1635.6 145685749 144164619 145839243 147081957 148026867 149788113 149736824 151720066 151693716 153085489
1644.3 153085489 154185009 153336306 155451040 154984560 157420340 157496357 159503641 160164413 156323643
1653 156323643 159717293 159955835 162768555 162978878 164606762 165157413 166546803 168123875 168946648
1661.6 168946648 171058521 171238575 174232979 175561962 177605782 179530659 181343765 184789791
1669.4A84789791M61979L575821J732616L318215K497043K138691K705632K301597
1677.1B03521385M089699K357082L712216K678165L650933M206829J083068N248433
1684.8B30547810J943111N403366L628597M107628M614029L790150M372997L634243
1692.5B62041931M639549M171505M891777L764706M835835N471267M768009M295559
1700.2B98880138K020073O919003M653873L838158L644962M347878M318542L300553
1707.9C31923180M189033L361244L314476K967797L087043L485032K165298K180176
1715.6C56673279L181763L340148j134567L198013L285218K169342K064552J561890
1723.4C74339638J964531K148094K212906J858253K109604K539330O37893J487046
$$ plain form
1669.4 184789791 185251770 188827591 190560207 193878422 196375465 198514156 201219788 203521385
1677.1 203521385 207611084 209968166 213680382 216358547 220009480 224216309 225299377 230547810
1684.8 230547810 232490921 237894287 241522884 245630512 250244541 254034691 258407688 262041931
1692.5 262041931 266681480 270852985 275744762 279509468 284345303 289816570 294584579 298880138
1700.2 298880138 300900211 307819214 312473087 316311245 319956207 324304085 328622627 331923180
1707.9 331923180 336112213 339473457 342787933 345755730 348842773 352327805 354493103 356673279
1715.6 356673279 359855042 363195190 362060623 365258636 368543854 370713196 372777748 374339638
1723.4 374339638 376304169 378452263 380665169 382523422 384633026 387172356 387810249 389297295
1731.1C89297295L642730L831826R62295j971283L802605M000358K697678L069763
1738.8D09333267J852722N56794M277801L286324K127189L056031L854408L700638
1746.5D32045174K952079M224739K942696M860687M313012K502403M913368M019394
1754.2D62773552M351692L843727J983109L255386L629875L585129L899880J175918
1761.9D88498268J790505M063491K466889K349891K516518J960259l85552K815895
1769.7E06076164N088234J870766j194687j39656M752350K715454j28708K345200J321373
1778.3E22706490K351188J467552K70653J928635K472191K146454O103R02214J558304
1787E35809784J545181J348915J895600J480827J009445K07253L17611L641625J043701
$$ plain form
1731.1 389297295 392940025 396771851 397734146 395762863 399565468 403565826 406263504 409333267
1738.8 409333267 411185989 411742783 416020584 419306908 421434097 424490128 428344536 432045174
1746.5 432045174 434997253 439221992 442164688 447025375 451338387 453840790 458754158 462773552
1754.2 462773552 467125244 470968971 472952080 476207466 479837341 483422470 487322350 488498268
1761.9 488498268 490288773 494352264 496819153 499169044 501685562 503645821 503260269 506076164
1769.7 506076164 511164398 513035164 511840477 511700821 516453171 519168625 519039917 521385117 522706490
1778.3 522706490 525057678 526525230 526795883 528724518 531196709 533343163 533349266 534251480 535809784
1787 535809784 537354965 538703880 540599480 542080307 543089752 543297005 543614616 547256241 548299942
1795.7E48299942r1438J851845J987342R89914J01662L277702Q06427N66521J841087
1804.4E59631004J148491J310082M70886J183968J369628J420899l04756J390686K336540
1813E69957428N23796J130714M98200J161957L32412P06330J325302O50558J615372
1821.7E77902069K80876J525841J427383j284446N27534J787186J728363j42632j697006
1830.4E82055168J376610K608223O60705O56014O29654M05693R36203n9967J449509
1839.1E90717812N47027P53060P68585J082115J293907m245682J932907K149315O12488
1847.8E95611534L2692O22101J445274Q7700J030693L8719M25339N58205J5983P29599
1857.4F00597839J80092P92732R5826O93168K25449L65028P73011J16462Q21915m29230
$$ plain form
1795.7 548299942 548208504 550060349 552047691 553037605 553139267 556416969 557223396 557789917 559631004
1804.4 559631004 560779495 562089577 562560463 563744431 565114059 566534958 566230202 567620888 569957428
1813 569957428 570481224 571611938 572110138 573272095 573604507 574310837 575636139 576286697 577902069
1821.7 577902069 578182945 579708786 581136169 579851723 580379257 582166443 583894806 583752174 582055168
1830.4 582055168 583431778 586040001 586700706 587356720 587986374 588392067 589328270 589268303 590717812
1839.1 590717812 591264839 592017899 592786484 593868599 595162506 590916824 592849731 594999046 595611534
1847.8 595611534 595644226 596266327 597711601 597799301 598829994 598868713 599294052 599852257 599868240 600597839
1857.4 600597839 600777931 601570663 601666489 602359657 602585106 602950134 603723145 603839607 604661522 604232292
1867.1F04232292P79114m46167q83942J360779J225128Q92182k26784L15437j12533
1875.7F07135506O38847O12068L53508M60854m13475P40013j09902L16201J34964J22718
1885.4F09991302Q65708J59531J229133j69678j211967M03557J087646q7166r0255
1894.1F12177811O43501m72870Q76961K33383O53229N19409l93944L2578o17371M58260
1903.7F14110947K87704Q36830K94342k04048M07295P5112K86293q27484O11877L12653
1913.3F16191521K68745M82674P4997J402397j522484n98984Q48007O21644N64117
1922F18332634r66911k55738J71662O66122K65618M94689j46904o14013K66189j78451
1931.7F18034897P1792l66859K96783J53237L64189M54597o69441M1237l00979K11982
$$ plain form
1867.1 604232292 605011406 604565239 603681297 605042076 606267204 607159386 606932602 607248039 607135506
1875.7 607135506 607774353 608386421 608739929 609200783 608787308 609527321 609417419 609733620 609868584 609991302
1885.4 609991302 610857010 611016541 612245674 612075996 610864029 611267586 612355232 612268066 612177811
1894.1 612177811 612821312 612348442 613225403 613458786 614112015 614631424 614237480 614270058 613652687 614110947
1903.7 614110947 614398651 615235481 615529823 615325775 615733070 615808182 616094475 615266991 615878868 616191521
1913.3 616191521 616460266 616942940 617017937 618420334 616897850 616298866 617146873 617768517 618332634
1922 618332634 617365723 617109985 617281647 617947769 618213387 618708076 618561172 617947159 618213348 618034897
1931.7 618034897 618106689 617739830 618036613 618189850 618554039 619008636 618339195 618380432 618079453 618291435
1941.3F18291435n68237k47765J260796N48019J7777q50258n8899k53410j27831k37350
1951F17774277k65160M50249J9760L84674o22024m07258j84173J58539M32167m99916
1960.6F17241135J13639J25123Q48045j23291o07796l32413q60405K79618J9951N54695
1970.2F17258301M3373j10779J35880j22948J52283o54793j35422k01111K10915J45187
1979.9F16720886l3569M33731k91901K976m01383l53355n54428l5057N86700m3678
1989.5F16030922L94249k79083l59040j66397m4021m98810m82330J68304k53296L13301
1999.2F14823799j2970R54m56391l62281K9792o44302m4289m88014J1330K18162L37334
2009.8F13413124K17934m91715q4419q63647m96636m55284k85263l9711K81105N69687
$$ plain form
1941.3 618291435 617723198 617475433 618736229 619284248 619302025 618451767 618392868 618139458 618011627 617774277
1951 617774277 617509117 617959366 617979126 618363800 617741776 617334518 617150345 617308884 617741051 617241135
1960.6 617241135 617354774 617479897 618327942 618204651 617596855 617264442 616404037 616683655 616703606 617258301
1970.2 617258301 617301674 617190895 617326775 617203827 617356110 616701317 616565895 616364784 616575699 616720886
1979.9 616720886 616687317 617121048 616829147 616832123 616430740 616077385 615522957 615487900 616074600 616030922
1989.5 616030922 616425171 616146088 615787048 615620651 615576630 615077820 614595490 614763794 614510498 614823799
1999.2 614823799 614810829 614811783 614355392 613993111 614022903 613378601 613334312 612846298 612857628 613075790 613413124
2009.8 613413124 613631058 613139343 613054924 612191277 611694641 611239357 610954094 610914383 611195488 611765175
2019.4F11765175p08809m1504k78130n60684p90481l93944M45137j75705L25928l34358
2029.1F09252625j00289k18315n21126k94914o89392J20773k63901J72310j26877k66380
2038.7F07064514K47498m80080p69997p49969N00679P5264n4703k61001m56849N26276
2048.4F05641632j01623j33019p12624j05667m4059m44107L54232k40326j49078l04413
2058F03760948J52664j51100m56390p4539k26632M30718R54K7504k10686l5095l1510
2068.6F03186836l17802J67045m54597j91879j80855J07689m9057J2779J30997p29714
2078.2F01681442j39580m80270k708J2855q9569L77541k44026o142l54958j49841o89201
2088.9E99915543p23000j23711k24876L06435r92R2621l85743j16233j61095n89142
$$ plain form
2019.4 611765175 611056366 611014862 610736732 610176048 609385567 608991623 609436760 609261055 609586983 609252625
2029.1 609252625 609152336 608934021 608412895 608117981 607428589 607549362 607285461 607457771 607330894 607064514
2038.7 607064514 607312012 606831932 606061935 605311966 605812645 605887909 605833206 605572205 605115356 605641632
2048.4 605641632 605540009 605406990 604694366 604588699 604544640 604100533 604454765 604214439 604065361 603760948
2058 603760948 603913612 603762512 603306122 603231583 603004951 603435669 603436623 603464127 603253441 603218346 603186836
2068.6 603186836 602869034 603036079 602581482 602389603 602208748 602316437 602267380 602280159 602411156 601681442
2078.2 601681442 601541862 601061592 601058884 601071739 600982170 601359711 601115685 601109543 600754585 600604744 599915543
2088.9 599915543 599192543 599068832 598843956 599150391 599149399 599242020 598856277 598740044 598578949 597989807
2098.5E97989807j49383n31769k5749j24436Q5983l1700k26440j26000n11474o3400
2108.1E96285439l67394j49040k65732k0599l3112j48201Q6441r10568k86789l33443
2117.8E93857002l6239k5063j91765J69335n33867J66626m80309q7394K10647k37236
2127.4E92811737L32756l51181Q0795j01585k3155J8730j12076L8033k98195k26631
2137.1E92169228p20711K35672K09923J47133J82800m27284R9525k53334J18484j58424
2146.7E91603012j13907j70250k0523Q24623k47192l48816q09631l75405L65868K73323
2156.4E90981102M09889p8583K07482n9853K8725l62396m19236J0643p3661K43034
2166E90887146m1809N04684N1232J21536K19116n82771m36363k82669O62117J45454
$$ plain form
2098.5 597989807 597840424 597308655 597282906 597158470 597244453 597212753 596986313 596860313 596348839 596285439
2108.1 596285439 595918045 595769005 595503273 595482674 595449562 595301361 595387802 594477234 594190445 593857002
2117.8 593857002 593820763 593795700 593603935 593773270 593239403 593406029 592925720 592838326 593048973 592811737
2127.4 592811737 593144493 592793312 592874107 592772522 592749367 592768097 592656021 592694054 592395859 592169228
2137.1 592169228 591448517 591684189 591894112 592041245 592224045 591796761 591896286 591642952 591761436 591603012
2146.7 591603012 591489105 591318855 591298332 592122955 591875763 591526947 590717316 590341911 590707779 590981102
2156.4 590981102 591390991 591312408 591519890 591460037 591488762 591126366 590707130 590717773 590644112 590887146
2166 590887146 590845337 591350021 591401253 591522789 591741905 591159134 590722771 590440102 591102219 591247673
2175.6E91247673l6545O3858J56975L87611l86314j61552o61087j01052L23334L27530
2185.3E91160431M06074r2125K49558m90532j22452m0664k65580j4038K46773O34041
2194.9E91671486j58081K57797j94931p5035J95770k22778L33557l88870j75019K95945
2204.6E91539841N27763K3193j95655P6m38881J91917j11465K34222J05515o9542L19519
2215.2E92126503j20392J69106k88964j00250j2398K74659K78434k34947J85967q8807
2224.8E92188911K19956k13585k67296j24206k02332L46069Q7281K19917j74255k52152
2234.5E91828308m19884n1612L02085j89170Q3694m84581r5673L91083N53932o4811
2244.1E91853371r15451k36893Q1444L76968j37291K18773L03307J75209J01356o23436
$$ plain form
2175.6 591247673 591211128 591274986 591431961 591819572 591433258 591271706 590610619 590509567 590832901 591160431
2185.3 591160431 591566505 591474380 591723938 591233406 591110954 591070290 590804710 590790672 591037445 591671486
2194.9 591671486 591513405 591771202 591576271 591501236 591697006 591474228 591807785 591418915 591243896 591539841
2204.6 591539841 592067604 592090797 591895142 591895218 591456337 591648254 591536789 591771011 591876526 591806984 592126503
2215.2 592126503 592006111 592175217 591886253 591786003 591773605 592048264 592326698 592091751 592277718 592188911
2224.8 592188911 592408867 592195282 591927986 591803780 591601448 591947517 592034798 592254715 592080460 591828308
2234.5 591828308 591408424 591356812 591658897 591469727 591553421 591068840 590973167 591364250 591918182 591853371
2244.1 591853371 590937920 590701027 590782471 591159439 591022148 591240921 591544228 591719437 591820793 591197357
2253.8E91197357K41280l75405j12381J61248l80249R842K8877O24389j81770k60467
2263.4E90952721k73514k03056J74636j84021M31290k2774K7390l41377k57302J38817
2273E90442810k37999J99204m85001m20494m10080m311K05231j89133n5656l65448
2282.7E88679123K26364l82194k59362J9074k13967K13051r6397M17480q9912q01O6070
2293.3E88578529J41220Q66814m24194n14984l1357J96953P934j20697J31264j30615
2302.9E88700867J52282R0485L58582K51007J00975J95503M01230N87349j92757q2626
2312.6E90562897q087p8354M8561P94258M01230l09716J024476O71615L33481J72005
2322.2E93612366m2229j12572k08320N24406N68771N28985k92168J37634P01065M08898
$$ plain form
2253.8 591197357 591438637 591063232 590950851 591112099 590731850 590741692 590770569 591394958 591213188 590952721
2263.4 590952721 590679207 590476151 590650787 590466766 590898056 590875282 590902672 590561295 590303993 590442810
2273 590442810 590204811 590404015 589919014 589498520 589088440 589084129 589289360 589100227 589044571 588679123
2282.7 588679123 588905487 588523293 588263931 588283005 588069038 588282089 588185692 588603172 588513260 588512459 588578529
2293.3 588578529 588719749 589586563 589162369 588647385 588616028 588812981 588820915 588700218 588831482 588700867
2302.9 588700867 588853149 588943634 589302216 589553223 589654198 589849701 590250931 590838280 590645523 590562897
2312.6 590562897 590554810 590476456 590525017 591319275 591720505 591410789 592435265 593106880 593440361 593612366
2322.2 593612366 593570137 593457565 593249245 593773651 594342422 594871407 594579239 594716873 595417938 595826836
2331.9E95826836o16951q12073M23622J34506M82865o32477n112N55000j059303n26314
2341.5E93770599L27645O37436j217537p58248n64804k437629l344574p15943K930527
2350.2E88627472R93767K93846J630440J262092J508980M17252K042121K65809j50910
2358.9E96890869k72369P05299K36054k209320k24572j120948r8610k033348k095223
2367.6E89777832m13170j594314j944199k447815l32527q70781j632080j566200j699791
2376.2E77276955j376191j334304p19529j500129j269531j416321j461907q94203p83081
2384.9E66521759l01132r31778l85056l51791m35944j81541o92444k77252l57208k3652
2394.6E62583961o28662o61735j61514k93618N1689o70242m96635m80309j63650l42751
$$ plain form
2331.9 595826836 595209885 594397812 594821434 594955940 595438805 594806328 594801216 595356216 594296913 593770599
2341.5 593770599 594098244 594735680 593518143 592759895 592195091 589757462 586412888 585696945 588627472
2350.2 588627472 589621239 589915085 591545525 592807617 594316597 594733849 596775970 597041779 596890869
2358.9 596890869 596618500 597323799 597559853 595350533 595125961 594005013 593906403 591873055 589777832
2367.6 589777832 589364662 587770348 585826149 583378334 583045807 582175026 580542946 578976746 577276955
2376.2 577276955 575900764 574566460 573846931 572346802 571077271 569660950 568199043 567304840 566521759
2384.9 566521759 566220627 565288849 564903793 564552002 564116058 563934517 563242073 562964821 562607613 562583961
2394.6 562583961 561955299 561293564 561132050 560838432 560890121 560219879 559723244 559242935 559079285 558736534
2404.2E58736534q57696k86751m52156J38473m81300p84912l01819l73116l11660n36347
2413.8E54489250j64223p11708m67414j34850j03874J89361p09152q64601n15480k18964
2423.5E50788345n34172m59747o56357o19888K69661m80347p18002m90990k71377m25530
2433.1E46401596o10046m59977m48188O3095n35965o49262n99327l19175j02349q17528
2442.8E41922874n26771n08385l48396m04816l22227m71993p31010l08953q79287p31926
2452.4E36689110l17764l0365m30031o16646k68059p43675m44527o03409m89997m53568
2462.1E32291069o24733o47545p24678k09808l72658r613m17137q27828r45701q70095
2471.7E26641273j06544n35660j01051l86849n63240m33578r02252o21414j014061
$$ plain form
2404.2 558736534 557878838 557592087 557139931 557278404 556797104 556012192 555710373 555337257 555025597 554489250
2413.8 554489250 554325027 553613319 553145905 553011055 552907181 553096542 552387390 551522789 551007309 550788345
2423.5 550788345 550254173 549794426 549138069 548518181 548787842 548307495 547589493 547098503 546827126 546401596
2433.1 546401596 545791550 545331573 544883385 544946480 544410515 543761253 543161926 542842751 542740402 541922874
2442.8 541922874 541396103 540887718 540539322 540134506 539812279 539340286 538609276 538300323 537421036 536689110
2452.4 536689110 536371346 536340981 535910950 535294304 535026245 534282570 533838043 533234634 532744637 532291069
2462.1 532291069 531666336 531018791 530294113 530084305 529711647 529702034 529284897 528457069 527511368 526641273
2471.7 526641273 526534729 525999069 525898018 525511169 524947929 524514351 523612099 522990685 521976624
2480.4E21976624o15006m94080m52728m22478n52597m89921q03948k35290n20325n04341
2490E16885910o15158q27522o93779r96552l27339m06647k87895m87709q47015q09975
2499.7E10586319r41391l63884m51622m12064o55059n41344n46150j027947p02057
2508.3E04944801n22766l08037n17006r9754m92401r23843o24009q86688l45154p00035
2518D99525108n22422k80152m42276j94244n79453p86094q74672j48392m57153q95348
2527.6D94344902p23038m75311k4719o55976k25410j29662m28009n38177o52084m47045
2537.3D90045471p54852l68233n46989m88282l67927m08096m13742n81017l9597p47032
2546.9D85329704p38067m58374m72222l09181n93033l24020p15943l99093l22266n80940
$$ plain form
2480.4 521976624 521361618 520867538 520414810 519992332 519439735 518949814 518145866 517910576 517390251 516885910
2490 516885910 516270752 515443230 514749451 513752899 513425560 513018913 512731018 512243309 511396294 510586319
2499.7 510586319 509644928 509281044 508829422 508417358 507762299 507220955 506674805 505646858 504944801
2508.3 504944801 504422035 504113998 503596992 503497238 503004837 502080994 501456985 500570297 500225143 499525108
2518 499525108 499002686 498722534 498280258 498086014 497506561 496720467 495845795 495697403 495240250 494344902
2527.6 494344902 493621864 493146553 493121834 492465858 492240448 492110786 491682777 491144600 490492516 490045471
2537.3 490045471 489290619 488922386 488375397 487887115 487519188 487111092 486697350 486116333 486076736 485329704
2546.9 485329704 484591637 484133263 483661041 483351860 482758827 482434807 481718864 481319771 480997505 480416565
2556.6D80416565l66631l86963l25355o53267k98347n85556n93567m07219o26335k57607
2566.2D75915718n44968m08058n30357m81339m76989o84052l11622n02549n25398q78754
2575.9D70571632n04417K83318j78910q33206p36504l43055n29404n96237l86658j33247
2585.5D66613312o69365n95322m3716m17786o70051r92699m93393l63770l41224l51219
2595.1D61674767p67251k45552m12635m58641o89545q42056m70353m34341o11458r44633
2604.8D55798302k98043m33235m51813o7558l65372p67097j178360n58243k67219k04163
2614.4D51207199o76460p83920n33982q90541l59230n53474n12925n45463o47125m12064
2624.1D45292015o57387l42483n35507l84140o81916q65173m66576n56373l44391p00150
$$ plain form
2556.6 480416565 480049934 479662971 479337616 478684349 478386002 477800446 477206879 476799660 476173325 475915718
2566.2 475915718 475370750 474962692 474432335 473950996 473474007 472789955 472478333 471975784 471450386 470571632
2575.9 470571632 470067215 470350533 470171623 469338417 468601913 468258858 467729454 467133217 466746559 466613312
2585.5 466613312 465943947 465348625 465304909 464887123 464217072 463224373 462730980 462367210 462025986 461674767
2595.1 461674767 460907516 460661964 460249329 459790688 459101143 458259087 457788734 457354393 456742935 455798302
2604.8 455798302 455500259 455067024 454615211 454547653 454182281 453415184 452236824 451678581 451411362 451207199
2614.4 451207199 450530739 449746819 449212837 448322296 447963066 447409592 446896667 446351204 445704079 445292015
2624.1 445292015 444634628 444292145 443756638 443372498 442690582 441825409 441358833 440802460 440458069 439757919
2633.7D39757919m20532m28924q03948o00777m06799l59383p42378o53343o37741k80342
2643.4D34423752m59023o59485l66478p70721o83594n28564r5978n02167o24695o6070
2653D29666977n55687m63982n03769o27555n99709m10461m17748k77862o2485n98564
2662.6D25149155k26021n88036q19931n42450o01196k32697p31239n82466l1204J76697
2672.3D20970612j40763o48422m79927l95622k24457n18570n20210l04299l18756l93944
2681.9D17025642m98390l84788m91638k09580l30963n35507m33846k39944j51291m48952
2691.6D13300743k04735m26941n53627k59590j84936m42200o39725m20036o00624l76816
2701.2D09191513l83873l54004q5678k07825m56962n68733p8431l58619l29781l06206
$$ plain form
2633.7 439757919 439337387 438908463 438104515 437503738 437096939 436737556 435995178 435341835 434704094 434423752
2643.4 434423752 433964729 433305244 432938766 432168045 431484451 430955887 430859909 430357742 429733047 429666977
2653 429666977 429111290 428647308 428143539 427515984 426916275 426505814 426088066 425810204 425747719 425149155
2662.6 425149155 424923134 424335098 423515167 422972717 422371521 422138824 421407585 420825119 420793915 420970612
2672.3 420970612 420829849 420181427 419701500 419305878 419081421 418562851 418042641 417738342 417419586 417025642
2681.9 417025642 416527252 416142464 415650826 415441246 415110283 414574776 414140930 413900986 413749695 413300743
2691.6 413300743 413096008 412669067 412115440 411855850 411670914 411228714 410588989 410168953 409568329 409191513
2701.2 409191513 408807640 408453636 408367958 408160133 407703171 407134438 407056007 406697388 406367607 406061401
2710.9D06061401p78656o90574l21122P7820n44929m83055j77307j8349l1281n06401
2720.5D02587547j6555n6954k64320p91664n76134q4877m95300n0774m99153o86608
2730.2C99065208k87017n8899r5940m29916N2757n8365l92570o25573k32544M9324
2739.8C96986465j98631q5068m03595k91709l40081j94053Q3656j44920l26081l79753
2749.4C94706230m01306p04842l2882j19438n47486j65634j62201O5231l18298o19507
2759.1C91699867n67322k27851P324k89688k20185j29547k31476n71365l78227n47638
2768.7C88543892n45921k48299k78320N7373o46248n02167P6523k78015o88095q81005
2778.4C84609718m26788m80537l01667k39792m86908p51800o19965r040l48015l85514
$$ plain form
2710.9 406061401 405282745 404592171 404271049 404348869 403803940 403320885 403143578 403125229 403093948 402587547
2720.5 402587547 402570992 402514038 402249718 401458054 400881920 400797043 400301743 400250969 399751816 399065208
2730.2 399065208 398778191 398719292 398623352 398193436 398246193 398187828 397795258 397169685 396937141 396986465
2739.8 396986465 396787834 396702766 396299171 396007462 395667381 395473328 395556984 395412064 395085983 394706230
2749.4 394706230 394304924 393600082 393567200 393447762 392900276 392734642 392572441 392637672 392319374 391699867
2759.1 391699867 391132545 390904694 390912018 390622330 390402145 390272598 390041122 389469757 389091530 388543892
2768.7 388543892 387997971 387749672 387471352 387528725 386882477 386380310 386456833 386178818 385490723 384609718
2778.4 384609718 384182930 383702393 383400726 383160934 382674026 381922226 381302261 381293221 380945206 380559692
2788C80559692n00602p34597q74748n23948J6288m90226n04761n56870l72429n70602
2797.7C75447197j232910r59892p65458p01904m86641j15623o13060q44612q21953
2806.3C68905144r92279m58412k95945m11110r78241p32231n93719q89282p62825q44765
2816C61946335k99683r87816j130371o10199p90062n13076q73681r19952q12797o80504
2825.6C54328194j051865j352501j249542j268234m94767q70361j035385r59358j299782
2834.3C44746399j143723j320533j151047j320725j515464k071495k413712j925774
2842C31883926k079887k163124k130776k230339k667999k768268k613144k531853k041416
2850.7C10657120j641274j511593j501064o60210j53961J07403N78575K38476J12209
$$ plain form
2788 380559692 380059090 379324493 378449745 377925797 377942085 377451859 376947098 376390228 376017799 375447197
2797.7 375447197 374214287 373254395 372488937 371787033 371300392 371184769 370571709 369727097 368905144
2806.3 368905144 367912865 367454453 367158508 366747398 365769157 365036926 364443207 363553925 362791100 361946335
2816 361946335 361646652 360658836 359528465 358918266 358128204 357615128 356741447 355821495 355008698 354328194
2825.6 354328194 353276329 351923828 350674286 349406052 348911285 348040924 347005539 346046181 344746399
2834.3 344746399 343602676 342282143 341131096 339810371 338294907 336223412 333809700 331883926
2842 331883926 329804039 327640915 325510139 323279800 320611801 317843533 315230389 312698536 310657120
2850.7 310657120 309015846 307504253 306003189 305342979 305189018 305296421 305874996 306113472 306225681
2859.4C06225681J68953K57511J90449O8264l52802n77583m43230q81825p78732o24065
2869C03252621o86570r24472p01371l56006o78368m05369n39283n42069m05903m39510
2878.7B97573700l16525n88283n98736p19738q52203j055069p97730o70185q86516
2887.3B91088715n67398p67594j075611j321354r28020q47588j120567q48675j078205
2896B82533703q99220r59339j022281q77705p09000p17106j414909j215076q92811
2904.7B73826256o14224q24794j406479j066742q66566j390572k020912j740703j553173
2913.4B62342091j730423k019139j803207j580448k188473j742821j500168j507206
2921.1B48270206j206207p13901l21503o25668J6270L11031M24824O00491N79986Q10757
$$ plain form
2859.4 306225681 306394634 306652145 306842594 306910858 306558056 305980473 305537243 304655418 303876686 303252621
2869 303252621 302566051 301641579 300940208 300584202 299905834 299500465 298961182 298419113 298013210 297573700
2878.7 297573700 297257175 296668892 296070156 295350418 294498215 293443146 292645416 291975231 291088715
2887.3 291088715 290521317 289753723 288678112 287356758 286428738 285581150 284460583 283611908 282533703
2896 282533703 281634483 280675144 279652863 278775158 278066158 277349052 275934143 274719067 273826256
2904.7 273826256 273212032 272387238 270980759 269914017 269047451 267656879 265635967 263895264 262342091
2913.4 262342091 260611668 258592529 256789322 255208874 253020401 251277580 249777412 248270206
2921.1 248270206 247063999 246350098 246028595 245402927 245419197 245730228 246155052 246755543 247335529 248146286
2930.7B48146286N63145N93719N37586J006184J204262Q11271R58748P26033P83691
2939.4B55330925J345749J400204P49816N22404P10163Q65593P22046N52178M87938
2948.1B62687016J92756R24645O94370J32370O9084l52325L58047M98638P13082N89542
2957.7B66507225K61078R50870R84116P58934M96063R24130Q57067O64101J155338
2966.4B73558922J049537R84745N00756N53989J167088J261558R99565Q67367P26681
2975.1B81670208M09203Q02459J044064Q22296K96211L38497N33314M72660O98815
2983.8B87087727K81791K00844J22414M26712N75638N8651K95639M98085N01556p5092
2993.4B89973965l7175k68402l53164L18584n80120o17866n2624j1559l65524m47292
$$ plain form
2930.7 248146286 248709431 249303150 249840736 250846920 252051182 252862453 253821201 254547234 255330925
2939.4 255330925 256676674 258076878 258826694 259349098 260059261 260924854 261646900 262199078 262687016
2948.1 262687016 262879772 263804417 264498787 264631157 264700241 264347916 264705963 265204601 265917683 266507225
2957.7 266507225 266768303 267719173 268703289 269462223 269958286 270882416 271739483 272403584 273558922
2966.4 273558922 274608459 275593204 276093960 276647949 277815037 279076595 280076160 280943527 281670208
2975.1 281670208 282079411 282881870 283925934 284748230 285044441 285382938 285916252 286388912 287087727
2983.8 287087727 287369518 287570362 287692776 288119488 288695126 288753777 289049416 289547501 290049057 289973965
2993.4 289973965 289936790 289668388 289315224 289633808 289053688 288435822 288383198 288371639 288006115 287558823
3003.1B87558823o0406k86579j57318n62687m66805r0313j19037k70977o74687l88489
3012.7B84481525o46076n12714n66063q00972n66406n03388k48127o32725m31461l89404
3022.4B79184189m94728n90954r45358o82297o97022k91938m91734o14967o81534j155586
3032B72538071o23417n93090p28703q30250p10926p64961p80849n04628m88224l61538
3041.6B66151485q88137p18842p53231r84116m95929o00701p93266q16364m05045q24032
3051.3B58871822q74309n78842q75855m16622p29485r51004n30414n54810j057033
3060B52303448p50065k20471p29274n94712p99427n35545j2436o33182j209908j105747
3069.6B45712681k00806l06263m87480k96078o76975p98035k56424N5047o14701p06539
$$ plain form
3003.1 287558823 287498417 287211838 287054520 286491833 286025028 285934715 285815678 285544701 284870014 284481525
3012.7 284481525 283835449 283322735 282756672 281955700 281389294 280885906 280637779 280005054 279573593 279184189
3022.4 279184189 278689461 278098507 277153149 276470852 275773830 275481892 274990158 274375191 273693657 272538071
3032 272538071 271914654 271321564 270592861 269762611 269051685 268286724 267505875 267001247 266513023 266151485
3041.6 266151485 265263348 264544506 263791275 262807159 262311230 261710529 260917263 260100899 259695854 258871822
3051.3 258871822 257997513 257418671 256542816 256126194 255396709 254445705 253915291 253360481 252303448
3060 252303448 251553383 251332912 250603638 250008926 249209499 248673954 248661518 248028336 246818428 245712681
3069.6 245712681 245511875 245205612 244718132 244422054 243745079 242947044 242690620 242745667 242130966 241424427
3079.2B41424427o79626o90575o75926l15419j69677r28116k82765l10955p34748n33448
3088.9B36103172q22849n10368n42698o66466o67381l60127k55565o63681l99361j69525
3098.5B31045151k61498o06765p41425q69255o67057l91274l41205l50800p24621l04813
3108.2B25786438n91240p27253q0643n59539j081429r63097j33171j20754l12347l63579
3117.8B20853386r57813n66807m42238q64544j096935p54090l50647l46355j35136
3126.5B15338821n33027q46539n84869p43389q28591l80401q70095j191749r3918K02122
3136.1B09468365k46945q01639j022854o21700m43631n97553o64711n72376m90646
3144.8B04006310j24798m72126q35533k34910m66308j027527n58033l40443o77223
$$ plain form
3079.2 241424427 240744801 240054226 239378300 239062881 238893204 237965088 237682323 237371368 236636620 236103172
3088.9 236103172 235280323 234769955 234227257 233560791 232893410 232533283 232277718 231614037 231214676 231045151
3098.5 231045151 230783653 230176888 229435463 228566208 227899151 227507877 227166672 226815872 226091251 225786438
3108.2 225786438 225195198 224467945 224387302 223827763 222746334 221783237 221650066 221529312 221216965 220853386
3117.8 220853386 219895573 219328766 218886528 218021984 216925049 216170959 215820312 215473957 215338821
3126.5 215338821 214805794 213959255 213374386 212630997 211802406 211422005 210551910 209360161 209266243 209468365
3136.1 209468365 209221420 208419781 207396927 206775227 206331596 205734043 205069332 204496956 204006310
3144.8 204006310 203881512 203409386 202573853 202338943 201872635 200845108 200287075 199946632 199269409
3153.5A99269409k72713m83036j159744j135635r18904k84462Q717j09901m76056p26013
3163.1A93711662r19704o43902o1474r96265r58309n5523j46103n15747r93367n75904
3172.8A87845364r8000l97053j006660j024723m25740n3463m1255n77851j110496p92389
3182.4A82317734O4564j60542o36044n30910k74773l67088j182632q73528n91927k98061
3192.1A77466793M3240n66883m31290n17349n00813o32515q87394l51620k79426k22893
3201.7A73119850l13682p12243j027984l28045K27432m38175n40581k36530j36490
3210.4A69613552k00500l32814q94012o54640m29421j119537l82385o6090p01771q54683
3220A63977699j33495M65126p2250l49484m47693l81698n32513m87251m45080o45466
$$ plain form
3153.5 199269409 198996696 198513660 197353916 196218281 195299377 195014915 195023632 194913731 194437675 193711662
3163.1 193711662 192791958 192148056 192086582 191090317 190132008 190076485 189930382 189414635 188421268 187845364
3172.8 187845364 187747364 187350311 186343651 185318928 184893188 184839725 184798470 184220619 183110123 182317734
3182.4 182317734 182382298 182221756 181585712 181054802 180780029 180412941 179230309 178356781 177764854 177466793
3192.1 177466793 177510033 176943150 176511860 175994511 175493698 174861183 173973789 173622169 173342743 173119850
3201.7 173119850 172806168 172093925 171065941 170737896 170965328 170527153 169986572 169750042 169613552
3210.4 169613552 169413052 169080238 168186226 167531586 167102165 165982628 165600243 165534153 164832382 163977699
3220 163977699 163844204 164309330 164237080 163887596 163439903 163058205 162525692 162038441 161593361 160947895
3229.7A60947895r1972K2812j10341m99954n54037n51243o02169q268k33440n54276
3239.3A57765007o29444P896N6935p37477l13997Q154k64006o47602l52278l75556
3249A54517632l67070M5815n43137n54819n15518k5854N4483q83531l83072m9067m58240
3259.6A50837622p71008p59621j80759J51968k71721k44303K57874k27804o71330m87823
3269.2A47633095l081p6322k70758q0738k87342l66974p66029m34132M11492N8088
3278.9A45817299q15811q71420j8730m7016q7510M3993l28779m30145n16586k88525
3288.5A42456770K57912J73454l26710r546N3902m93517n86653j55459K44770j33752
3298.2A41481171l48330n60140k25869J35918k99683j64432J6165J98030k93665p56254
$$ plain form
3229.7 160947895 160855923 160878735 160768394 160268440 159714403 159163160 158560991 158552723 158319283 157765007
3239.3 157765007 157135563 157143459 157200394 156462917 156148920 156157074 155893068 155245466 154893188 154517632
3249 154517632 154150562 154196377 153653240 153098421 152582903 152557049 152611532 151728001 151344929 151295862 150837622
3259.6 150837622 150066614 149306993 149126234 149278202 149006481 148762178 149020052 148792248 148120918 147633095
3269.2 147633095 147630014 147553692 147282934 147202196 146914854 146547880 145781851 145347719 145759211 145817299
3278.9 145817299 145001488 144130068 144111338 144064322 143976812 144020805 143692026 143261881 142745295 142456770
3288.5 142456770 142714682 142888136 142561426 142551880 142605782 142112265 141525612 141370153 141614923 141481171
3298.2 141481171 141132841 140572701 140346832 140482750 140183067 140018635 140034800 140232830 139939165 139182911
3307.8A39182911o98671l62797L52583k938j08318N8518o3010m19988m16985q2693
3317.4A37438612n20706l05891m64630k73133J62382m16069k94303j0882K95267j20497
3327.1A35490150q92753q39977K2497J71757r83267q20561l64837l35513k58503j03797
3336.7A31085196p105k96278k42730l74002k68536l62920J4867L52803k51007l37029
3346.4A29313259p26433l29771J70374J02377J78909k34451m87442n27010j71871m75874
3356A26812067k29778N89075J53608j77250m0560L67451P0028r7723j88884m48065
3365.7A26809969o8274k82678k96097n30577n05504p8717n8326L43084r1867l79925
3375.3A24861088J35793j02138l97968J72147J46923j38940L13968J75000j13612l05977
$$ plain form
3307.8 139182911 138484240 138121443 138474026 138471088 138362770 138421288 138358278 137938290 137521305 137438612
3317.4 137438612 136917906 136612015 136147385 135874252 136036634 135620565 135326262 135315380 135610647 135490150
3327.1 135490150 134597397 133757420 133779917 133951674 132968407 132147846 131783009 131447496 131188993 131085196
3336.7 131085196 131078091 130781813 130539083 130165081 129896545 129533625 129548492 129901295 129650288 129313259
3346.4 129313259 128586826 128257055 128427429 128529806 128708715 128474264 127986822 127459812 127287941 126812067
3356 126812067 126582289 127171364 127324972 127147722 127107162 127474613 127544641 127446918 127258034 126809969
3365.7 126809969 126741695 126459017 126162920 125632343 125126839 125048122 124989796 125332880 125241013 124861088
3375.3 124861088 124996881 124894743 124496775 124668922 124815845 124676905 124990873 125165873 125052261 124746284
3384.9A24746284J8330K22159m1543K46706k2869r4013m1675l85561k98014M9639L6306
3395.6A24435749J5888N36766J23310l44610o21462l25079O64244N6229j87655K33097
3405.2A24586477K3804l17822j56440N48124L49188Q3027j707k00987r4605M6263L39174
3415.8A25204496M60711K92244M8780j41039j69515L27453M71793K50549J64947l42464
3425.5A26567955j79081M29468O10972L10554n0239L2663l08619k13432N31473M54731
3435.1A28186445L07980N20372j01681j0652Q99734L05691j94511r6197J84784N61771
3444.7A30563736L10936j99137m18873P19481R62438L57895M22860M60786M34637P7630
3454.4A33692389P2088K91939O28681J012754o7577n35317N77364P44181K03705P42636
$$ plain form
3384.9 124746284 124764614 124986773 124945230 125191936 125169067 125075054 125033379 124647818 124349804 124399443 124435749
3395.6 124435749 124451637 124988403 125111713 124767103 124145641 123820562 124484806 124541035 124353380 124586477
3405.2 124586477 124610281 124292459 124136019 124684143 125033331 125116358 125114651 124913664 124819059 124865322 125204496
3415.8 125204496 125665207 125957451 126006231 125865192 125695677 126023130 126494923 126745472 126910419 126567955
3425.5 126567955 126388874 126818342 127429314 127739868 127689629 127722292 127413673 127200241 127731714 128186445
3435.1 128186445 128494425 129014797 128913116 128902464 129802198 130107889 129913378 129817181 130001965 130563736
3444.7 130563736 130874672 130675535 130256662 130976143 131938581 132296476 132719336 133180122 133614759 133692389
3454.4 133692389 133764477 134056416 134685097 135697851 135630274 135094957 135672321 136416502 136620207 137362843
3464A37362843Q98294K93417M3774R021L00351L53412N61638L92380K72169J191349
3473.7A41678648R91707J33066L4227Q20151R27152k7418j18475J42937Q14571J016236
3483.3A46412802P81755P18699K76203L21359L95670R62067R92689N21918O72664J13440
3493A52169266J10368Q65231R78432Q02879N39894L74718O10742Q92163Q55560P20854
3502.6A58920107L51801K86522N58109P31831P87067P88422N09433M97990J001320
3511.3A64432602N14164N09319Q64449Q96568J101360N19028N98736P79781R38339
3520A71154346J262875P77264P04498R8972K74010J591263J279526J02558O05240J256961
3529.6A79107513P72572Q45642J206608J212635M83723L19233N04493P83043J723709
$$ plain form
3464 137362843 138261137 138554554 138598328 138607349 138907700 139261112 139822750 140215130 140487299 141678648
3473.7 141678648 142670355 142803421 142837648 143657799 144584951 144557533 144439058 144581995 145396566 146412802
3483.3 146412802 147194557 147913256 148189459 148510818 148906488 149868555 150861244 151383162 152055826 152169266
3493 152169266 152279634 153144865 154123297 154926176 155466070 155840788 156451530 157343693 158199253 158920107
3502.6 158920107 159271908 159558430 160116539 160848370 161635437 162423859 162933292 163431282 164432602
3511.3 164432602 164946766 165456085 166320534 167217102 168318462 168837490 169436226 170216007 171154346
3520 171154346 172417221 173194485 173898983 173997955 174271965 175863228 177142754 177245312 177850552 179107513
3529.6 179107513 179880085 180725727 181932335 183144970 183628693 183947926 184452419 185235462 186959171
3538.3A86959171J136875Q86651J339225Q95329L84292P56360J002044Q03127J935769
3547A96098843R98573P56721J205044J245976K049465J41945Q34007J616592O23131
3555.6B05570297J244602J460324J507835P91493J158943J520004J542969J328602
3563.4B16125069N92479J922226J232872J419297Q78372N98373K356549J460838J373043
3572B27959118J258945J481743J191769J158581K081794J524678J864051J277657J832733
3580.7B41631069K318878J248436J158619J554909L158093J668148p38831J058979
3588.4B53058300K047958K499466J768875K583619J864051J227894K046891M67033
3596.1B67564087K083912K656441K225513K358665J047593J575145K418023J860256
$$ plain form
3538.3 186959171 188096046 188982697 190321922 191217251 191601543 192357903 193359947 194163074 196098843
3547 196098843 197097416 197854137 199059181 200305157 202354622 202496567 203330574 204947166 205570297
3555.6 205570297 206814899 208275223 209783058 210574551 211733494 213253498 214796467 216125069
3563.4 216125069 216717548 218639774 219872646 221291943 222170315 222768688 225125237 226586075 227959118
3572 227959118 229218063 230699806 231891575 233050156 235131950 236656628 238520679 239798336 241631069
3580.7 241631069 243949947 245198383 246357002 247911911 251070004 252738152 251999321 253058300
3588.4 253058300 255106258 257605724 259374599 261958218 263822269 265050163 267097054 267564087
3596.1 267564087 269647999 272304440 274529953 276888618 277936211 279511356 281929379 283789635
3603.9B83789635J631584K624683K404099R84974L602161J176090M2439M395580K040901
3612.5C02692146N05429K998848J627597L966561L747024J630154J327190O36788K730789
3621.2C21862526K836571K895012L143768L223724L314629K824287L728028j30463
3628.9C43698082k544441M757423M497414M474640K942009J384010L322639L879128
3636.6C66410904L074379K135544K486648K906533L615264L374863J874657K928734
3644.4C88807526L956337M741897K145844J94282L920746P96471K028885L003883N048752
3653D14644623N230140M107819L646355k677422M209557O078720K958298K549171J775322
3661.7D42522583L267975K327690K526131L368492K523918M761276L141480M09431
$$ plain form
3603.9 283789635 285421219 288045902 290450001 291434975 295037136 296213226 296255665 300651245 302692146
3612.5 302692146 303197575 306196423 307824020 311790581 315537605 317167759 318494949 319131737 321862526
3621.2 321862526 324699097 327594109 330737877 333961601 337276230 340100517 343828545 343698082
3628.9 343698082 341153641 345911064 350408478 354883118 357825127 359209137 362531776 366410904
3636.6 366410904 369485283 371620827 374107475 377014008 380629272 384004135 385878792 388807526
3644.4 388807526 392763863 397505760 399651604 399845886 403766632 404563103 406591988 409595871 414644623
3653 414644623 419874763 423982582 427628937 424951515 429161072 435239792 438198090 440747261 442522583
3661.7 442522583 445790558 448118248 450644379 454012871 456536789 461298065 464439545 464848976
3669.4D64848976J99814r28650M599190O573219P017594J375122r814606L034782O701050
3678.1D83606491L487511n14717K274704L112793K496948K130432J815224J434288
3685.8D99843674L593330N288467n443611n13610O057014l274078R95788M900284J783752
3694.5E13231010J381760N51224O1569J899223J285439K047806K548446k756881k24572
3703.2E20025024L746911J752815J149902P22923K027436K877807n106010L413391
3710.9E30610199M592018r218712L819390M093399N27115N95550J694908J266060j417160
3719.6E36562767K097282M236985k287522k321777L987389J329612p91435j539841
3727.3E41273460R10607L309402J264801L929749k257080n537186O501694p15065o163559
$$ plain form
3669.4 464848976 465048790 464120140 468719330 475292549 482310143 483685265 473870659 476905441 483606491
3678.1 483606491 487094002 486579285 488853989 491966782 494463730 496594162 498409386 499843674
3685.8 499843674 503437004 508725471 503281860 502768250 508825264 505551186 506546974 511447258 513231010
3694.5 513231010 514612770 515163994 515225563 517124786 518410225 520458031 523006477 520249596 520025024
3703.2 520025024 523771935 525524750 526674652 527397575 529425011 532302818 527196808 530610199
3710.9 530610199 535202217 525983505 529802895 533896294 534423409 535018959 536713867 537979927 536562767
3719.6 536562767 538660049 542897034 540609512 538287735 542275124 543604736 542813301 541273460
3727.3 541273460 542184067 545493469 546758270 550688019 548430939 542893753 549395447 548680382 542516823
3736E42516823J972885K245521J00441J032906J962051k634925L387985R064979r765319
3744.7E49883347r750176Q065415M392128M801063k174988p858581P112884n525741
3752.4E48945351k425347O360550K998238J917381l473778J905060M712944n456810
3760.1E55483589j366691K895622R25751N17845K162933k562218k384872L187637L549309
3768.8E62408905k96631o389198K395058K650108j12267M14811L17459J438293K06337
3777.4E63032875J603508j171417m996491L017044J561470J081086J634292k635841
3785.2E63126526p90939J755332J387711M58489r55887j092263L76511J061554L72200
3793.8E65699234J203041J341934l726768k686424K546730L338241L250885o459617
$$ plain form
3736 542516823 544489708 546735229 546835670 547868576 549830627 547195702 550583687 559648666 549883347
3744.7 549883347 540133171 548198586 552590714 557391777 555216789 547358208 554471092 548945351
3752.4 548945351 546520004 552880554 555878792 557796173 554322395 556227455 560940399 555483589
3760.1 555483589 554116898 557012520 557938271 558456116 560619049 558056831 555671959 558859596 562408905
3768.8 562408905 562112274 555723076 558118134 560768242 560655975 561070786 561388245 562826538 563032875
3777.4 563032875 564636383 563464966 558468475 561485519 563046989 564128075 565762367 563126526
3785.2 563126526 562335587 564090919 565478630 565937119 564981232 563888969 564265480 565327034 565699234
3793.8 565699234 566902275 568244209 564517441 561831017 564377747 567715988 570966873 564507256
3801.5E64507256o312714M578361K536393L578682K983474q169326j317711L945694
3809.3E66330109J404075K68631O61888N95398P39060L414192j956558j0247803M733353
3817.9E65942345M832840K856369J505470j1648560Q75969L512688J113281J302223
3825.7E70292625r32846k806663O11687J830749K952690J116524o048012K484970N586167
3834.3E75087891m578896n42412N876541p347335l955079O034050k607536P0763M730682
3843E72768669j328087k660980J524429J312180l3379O90384k89116J162415L055382
3851.7E76201897n649262q16307p766762K483483P261543q31413j405945J221466J514015
3860.4E72212715J618157k945443N65110L570747m145622k966004L354493L855094
$$ plain form
3801.5 564507256 558194542 562772903 565309296 568887978 571871452 563702126 562384415 566330109
3809.3 566330109 567734184 568002815 568664703 569260101 569999161 573413353 571456795 561208992 565942345
3817.9 565942345 570775185 573631554 575137024 563488464 564364433 567877121 568990402 570292625
3825.7 570292625 569359779 566553116 567164803 568995552 571948242 573064766 567016754 569501724 575087891
3834.3 575087891 570508995 569966583 575843124 568495789 564540710 570574760 567967224 568037987 572768669
3843 572768669 571440582 568779602 570304031 571616211 571582832 572273216 571984100 573146515 576201897
3851.7 576201897 570552635 569736328 561969566 564453049 571714592 570883179 569477234 570698700 572212715
3860.4 572212715 573830872 570885429 571450539 575021286 570875664 567909660 571264153 575119247
3868.1E75119247L292237p814484o682091L911972M471589K178001o612473K88201
3875.8E68152199K343902Q8578K511367L108979m466439n304908L981170J507187J502571
3884.5E73424606L572998r447174J13373K856331P90596K518959j294174m587021J490936
3893.2E69439430J926613j258469J110611J121369J279220Q17337n829238L416748
3900.9E72023621m7989l616944K878800l200302n20592J152725J167145R66606l79105
3909.6E70423965O9428p27234M80347O01959n40581N11780J391945k710686k168197
3918.2E67332726L053894q55484k121048J882324J019935P12510m92859j533776j37825
3926.9E68860397N33486Q54187l98407J13868R02100k658882j418762J527328N03617
$$ plain form
3868.1 575119247 578411484 570597000 563914909 567826881 572298470 574476471 567863998 568152199
3875.8 568152199 570496101 570584679 573096046 576205025 571738586 566433678 570414848 571922035 573424606
3884.5 573424606 576997604 567550430 567663803 570520134 571310730 573829689 572535515 567948494 569439430
3893.2 569439430 571366043 570107574 571218185 572339554 573618774 574436111 568606873 572023621
3900.9 572023621 571975632 568358688 571237488 568037186 567516594 568669319 569836464 570803070 570423965
3909.6 570423965 570493393 569766159 570246506 570848465 570307884 570819664 572211609 569500923 567332726
3918.2 567332726 570386620 569531136 567410088 569292412 570312347 571024857 570531998 568998222 568860397
3926.9 568860397 569393883 570248070 569849663 569963531 570865631 568206749 566787987 568315315 568818932
3935.6E68818932J11618k56310m85229J69258J84135J456375J237984k910957j365280
3944.3E66960526J097030R91249L10784j865807M34227J037331q16002N46646l79143
3953E68316841l67889J00479L07274L56216l35312M59557o70891l58124J28365o98586
3962.6E67237930O01692N23453q65516p28112R09462O00090k79617n76935l51867L43437
3972.2E67414017p4425K89345l25432m33998J65901L59154N64537j060562m65241O17523
3981.9E67050819k37579l57056r1133q2130k7237N45883Q73985M87023n37720j21155
3991.5E67503700L77007M0550q5945q43086O2637J009674N02586p97424j287537
4000.2E66482162
$$ plain form
3935.6 568818932 568930550 568674240 568189011 568358269 568542404 569998779 571236763 568325806 566960526
3944.3 566960526 568057556 569048805 569359589 567493782 567928009 568965340 568149338 568695984 568316841
3953 568316841 567948952 568049431 568356705 568712921 568377609 568837166 568166275 567808151 567936516 567237930
3962.6 567237930 567839622 568363075 567497559 566769447 567678909 568278999 567999382 567422447 567070580 567414017
3972.2 567414017 567339592 567628937 567303505 566869507 567035408 567394562 567959099 566898537 566433296 567050819
3981.9 567050819 566813240 566456184 566365051 566282921 566255684 566801567 567675552 568162575 567624855 567503700
3991.5 567503700 567880707 567921257 567835312 566992226 567054863 568064537 568567123 567769699 566482162
4000.2 566482162
##END=$$ End of the data block
