##TITLE=$$ Begin of the data block
##JCAMP-DX=5.00 $$ ACD/SpecManager v 10.08
##SPECTROMETER/DATA SYSTEM=Varian
##DATE=15 Jan 2013 15:39:48
##DATA TYPE=INFRARED SPECTRUM
##DATA CLASS=XYDATA
##ORIGIN=
##OWNER=
##NPOINTS=3735
##FIRSTX=399.26403809
##LASTX=4000.35498047
##MAXX=4000.35498047
##MINX=399.26403809
##MAXY=62.16237259
##MINY=12.41554165
##XFACTOR=1.0000000000
##YFACTOR=0.000000100000000
##FIRSTY=26.07276726
##DELTAX=0.96440572
##XUNITS=1/CM
##YUNITS=TRANSMITTANCE
##XYDATA=(X++(Y..Y))
399.3B60727673M373874j469707N69515J540356M70886n403557p248J187172j323624
407.9B60665340N45369M735050M944744p356625q231239p8068P337132O909141J904469
416.6B71375313o72665n035477o108799k884273N932045K009602j89648L64246m888992
425.3B59901352j135769k672176j205159K085934L104153N281486L757153j238194
433B67878780o361236l077297N73997J974278m097176j946945L563385m99020M400826
441.7B62409592j384602k098980M518013j447544l24230J843777j960259o185379K185879
450.4B57556267P453327L011723k635861p335796k858868m257736o79169O722298N17788
459.1B57493973j196060n484238j849613J479950N81951J6231J99738J388512J762409
$$ y = [260727673, 265101547, 263631840, 264201355, 265741711, 266212597, 260809040, 260801792, 261988964, 260665340, 261210709, 265945759, 270890503, 263533878, 255302639, 255224571, 262561703, 269470844, 271375313, 270702648, 265667171, 259558372, 256674099, 262606144, 264615746, 264426098, 264790344, 259901352, 258765583, 256093407, 254888248, 256974182, 260078335, 265359821, 269116974, 267878780, 261517544, 258440247, 259014244, 260988522, 256891346, 254944401, 258507786, 258008766, 262409592, 261024990, 258926010, 263444023, 261996479, 261672249, 263516026, 261555767, 255370388, 257556267, 265009594, 268021317, 265385456, 258049660, 255190792, 250933056, 250253887, 256976185, 257493973, 256297913, 250813675, 248964062, 250444012, 251025963, 251042194, 251241932, 252630444, 254392853]
467.7B54392853M50001l915978j371956K589207O51760m358997j075440L30277O11381
476.4B48303108K508774k446461K81983L665428J166820M54712j976604q31547k171783
485.1B48954430k039795k06433j710987j606350L95260q30726k426644K627640L056488
493.8B46212883q00819k441044K84042J744423j396484j146012q21113j078854l12691
502.5B40244331J276780J664009P21931j176414j164608K332534M13628j610012r53522
511.1B41748657L93505j260357l578682p50064n17083R91764j548709j777478K509194
519.8B36210747j318112r20219R95159J946621P59449k542515j434536m26750j024361
528.5B32245483r96875J630878M80232q47816J621151m8065k368183j260338R27524
$$ y = [254392853, 254842854, 250926876, 249554920, 252144127, 252795887, 248436890, 247361450, 247691727, 248303108, 250811882, 248365421, 248647404, 252312832, 253479652, 253934364, 251957760, 251126213, 248954430, 246914635, 246708202, 244997215, 243390865, 243786125, 242955399, 240528755, 243156395, 246212883, 245412064, 242971020, 243255062, 244999485, 243603001, 242456989, 241635876, 240557022, 240244331, 241521111, 243185120, 243907051, 242730637, 241566029, 243898563, 244312191, 242702179, 241748657, 242142162, 240881805, 237303123, 236553059, 236035976, 237027740, 235479031, 233701553, 236210747, 234892635, 233972416, 234967575, 236914196, 237673645, 235131130, 233696594, 233269844, 232245483, 231248608, 232879486, 233359718, 232511902, 234133053, 234084988, 231716805, 230456467, 231383991]
537.2B31383991j76849n00221j23692J13773L71018j647320j27411J032314L33310
545.9B30658913j018067j144447K50931j354122o67019K85320M89273q2760l18222
554.5B27099800P05528j522045j859627j108188r2507P35417M78096M02698p06272
563.2B24132900J20583L58658l02239J6308M47197K5406j402760q31222j5526J161652
572.9B23710957J033420j665897j986523J111164P11880j705742R0637P31125J86730
581.5B22217751J566524P54089l40328q41217n64937J183147J723347M24652m82636
590.2B25640392J04599N90039M89502O23340L22972L09333M13990j44291l2043J00346
599.9B28418179M90131N42831j28288L58620n55382j837006j114463L7803K3747m98638
$$ y = [231383991, 231207142, 230706921, 230583229, 230697002, 231068020, 229420700, 229293289, 230325603, 230658913, 229640846, 228496399, 228747330, 227393208, 226726189, 227011509, 227500782, 227418022, 227099800, 227805328, 226283283, 224423656, 223315468, 223222961, 223958378, 224436474, 224839172, 224132900, 224253483, 224612141, 224309902, 224326210, 224773407, 224798813, 223396053, 222564831, 222549305, 223710957, 224744377, 223078480, 221091957, 222203121, 222915001, 221209259, 221299896, 222031021, 222217751, 223784275, 224538364, 224198036, 223356819, 222791882, 223975029, 225698376, 226123028, 225640392, 225744991, 226335030, 226824532, 227447872, 227770844, 228080177, 228494167, 228349876, 228317833, 228418179, 228908310, 229451141, 229322853, 229681473, 229126091, 227289085, 226174622, 226212425, 226236172, 225737534]
609.5B25737534P99465Q57715J33496l35541q87375q71010j413402j08548N34325J3161
619.2B24459820P24735J100178L52325m99267P30896J502533N59711K69985P45297
627.8B29946213J210823J005173P99446M16584P70168J684666J040630R24244J661720
636.5B39459667R49631Q82664J479816Q36315Q46215L79772L31230J550121N45597
645.2B47261028j18961P80182J938495J539860R38416J878395R29069o5631o81267
653.9B54399586n80273l12729j09711J136628o26908r75933J97468j58634j90067o0921
663.5B52718506N04761O36024P19872J539268M819908k111854k021981q89434m71802
672.2B55443268J664638J178379L52288J262016K024879J833687o39057J63956P77092
$$ y = [225737534, 226536999, 227394714, 227528210, 227192669, 226305294, 225434284, 224020882, 223912334, 224446659, 224459820, 225184555, 226284733, 226637058, 226137791, 226868687, 228371220, 228930931, 229200916, 229946213, 231157036, 232162209, 232961655, 233378239, 234148407, 235833073, 236873703, 237797947, 239459667, 240409298, 241291962, 242771778, 243608093, 244454308, 244834080, 245165310, 246715431, 247261028, 247142067, 247922249, 249860744, 251400604, 252339020, 254217415, 255146484, 255080853, 254399586, 253819313, 253506584, 253396873, 254533501, 253906593, 252930660, 253128128, 252969494, 252779427, 252718506, 253223267, 253859291, 254579163, 256118431, 260938339, 258826485, 256804504, 255915070, 255443268, 257107906, 258286285, 258638573, 259900589, 261925468, 263759155, 263120098, 263284054, 264061146]
680.9B64061146O11133J330586J001987J244221O13117Q74024O37092j72100R9621
689.6B70300827J111527J154689j17874K97680K46830Q11214L68615j66760Q43907
698.2B74850655K74276P89566L22018N80673J539459P97844R21135O55632O26603O20193
707.9B81978054P30991K70977j50871L36151O37932J121998J060009J699829J029377
716.6B88714447j06430n589J07823Q66833R22489J034584M56199K29683P29256P5417
726.2B93024712J70784J240100J299267N30110J010494J117172J152840N00908j62220
734.9B99884167L67565n15728M4536O96049Q61607L61461K6570J816387R31797l25584
744.5C04148827m80767K23675J546555J236591M76990O42109J254482N02872M19560
$$ y = [264061146, 264672279, 266002865, 267004852, 268249073, 268862190, 269736214, 270373306, 270201206, 270300827, 271412354, 272567043, 272449169, 272746849, 272993679, 273804893, 274173508, 274006748, 274850655, 275124931, 275914497, 276236515, 276817188, 278356647, 279154491, 280075626, 280731258, 281357861, 281978054, 282709045, 282980022, 282829151, 283165302, 283803234, 284925232, 285985241, 287685070, 288714447, 288608017, 288602428, 288710251, 289577084, 290499573, 291534157, 291990356, 292220039, 292949295, 293024712, 293195496, 294435596, 295734863, 296264973, 297275467, 298392639, 299545479, 300046387, 299884167, 300251732, 299736004, 299780540, 300476589, 301338196, 301699657, 301726227, 303542614, 304474411, 304148827, 303668060, 303891735, 305438290, 306674881, 307151871, 307793980, 309048462, 309551334, 309970894]
753.2C09970894J76811L43189R09882M22115J241360J706181K097606J009846K5082
761.9C17902966M82902P05338J254978M20608L17078M91638J157341N16892o78215
770.6C22571526M66117R4109m39873r70955K82936J194039L6850J62010J49460M70009
780.2C24016228l00637l21655O0921K01301J140061N78918M38996M90646N70869P6256
789.9C26951904k14882r7656M9019N95932n48782p62902Q4114O9237j372490j828537
799.5C22924957j486854j711312j048603r25350q87165j981525j683979j161938j623993
808.2C10414238j556034k840252k051334j407490j155338j181374j766396j171398
815.9B97284622j374836j179485j300793l73859L13282L61671L92247l49122J253643
$$ y = [309970894, 310147705, 310490894, 311400776, 311822891, 313064251, 314770432, 316868038, 317877884, 317902966, 318385868, 319091206, 320346184, 320766792, 321083870, 321575508, 322732849, 323249741, 322571526, 323037643, 323131752, 322691879, 321720924, 322003860, 323197899, 323234749, 323396759, 323546219, 324016228, 323715591, 323393936, 323454857, 323656158, 324796219, 325375137, 325814133, 326304779, 326875648, 326951904, 326737022, 326639366, 326688385, 327284317, 326735535, 325972633, 326056747, 326125984, 324753494, 322924957, 321438103, 319726791, 318678188, 317752838, 316865673, 314884148, 313200169, 312038231, 310414238, 308858204, 306017952, 303966618, 302559128, 301403790, 300222416, 298456020, 297284622, 295909786, 294730301, 293429508, 293055649, 293368931, 293730602, 294122849, 293773727, 295027370]
824.6B95027370J085797M13837J714344K034359K044106K760429K950859J737633J999989
833.3C11768723J730060K163487K328968J628532K842159J703797J684913K072869
841C27923508J745948J400300J279563K680283K093735K180786J702766J454125J661949
849.6C44122963K237892L094559J789017K136230J364937J976509K793312K427711
857.4C61943130K182198L00942J731948K632409K482376J206932O45981J496696L28293
866C74950905J82724k02446Q9798j035576k291451k195816j352653j158791j763763
874.7C65222931L60413r7847N4588L82652k93350q4000j422271q81081r19647p07856
884.4C61614532j058006r70917L33443k36397q84819j023216O11420j69678n34515
$$ y = [295027370, 296113167, 296527004, 298241348, 300275707, 302319813, 305080242, 308031101, 309768734, 311768723, 313498783, 315662270, 317991238, 319619770, 322461929, 324165726, 325850639, 327923508, 329669456, 331069756, 332349319, 335029602, 337123337, 339304123, 341006889, 342461014, 344122963, 346360855, 349455414, 351244431, 353380661, 354745598, 356722107, 359515419, 361943130, 364125328, 364426270, 366158218, 368790627, 371273003, 372479935, 373125916, 374622612, 374950905, 375133629, 374931183, 375020981, 373985405, 371693954, 369498138, 368145485, 366986694, 365222931, 365583344, 365485497, 365540085, 365922737, 365629387, 365545387, 364123116, 363242035, 362322388, 361614532, 360556526, 359585609, 359919052, 359682655, 358797836, 357774620, 358386040, 358216362, 357681847]
893C57681847R3155k05994M02756k68708P24030O90079J12419m36402q18252m20J39198
903.7C58113708J312295R22088R13658J103554J398621M76761q81768J51291j222877
912.3C62287331l86849j59569j025810j296425k399826j394653k333412k601319k676162
921C48013306k731591k211380k290687j979332k974358k677841k353706j969223j874543
929.7C26950645k434043k358590k244358j466579j143055o10523j473332j386890m21295
938.4C13411980r00383o51551j242771r82284j106549j342716r36470j315632j053657
947.1C03879967r46789m36573r73873j373730j275234j601982j252289j916294k664089
955.7B91439114k325268j498242k249832k776756k211247k007522j358681j622791
$$ y = [357681847, 357775002, 357569008, 357971764, 357703056, 358427086, 359117165, 359229584, 358793182, 357974930, 357974510, 358113708, 359426003, 360348091, 361261749, 362365303, 363763924, 364240685, 363358917, 363510208, 362287331, 361900482, 361740913, 360715103, 359418678, 357018852, 355624199, 353290787, 350689468, 348013306, 345281715, 343070335, 340779648, 338800316, 335825958, 333148117, 330794411, 328825188, 326950645, 324516602, 322158012, 319913654, 318447075, 317304020, 316693497, 315220165, 313833275, 313411980, 312511597, 311860046, 310617275, 309634991, 308528442, 307185726, 306249256, 304933624, 303879967, 302933178, 302496605, 301522732, 300149002, 298873768, 297271786, 296019497, 294103203, 291439114, 289113846, 287615604, 285365772, 282589016, 280377769, 278370247, 277011566, 275388775]
963.4B75388775k169342k612057k339344j713219j911811j545086j515599j740894
971.2B59841423j532459k103920k827244k833920k859802k415027k400971k785988
978.9B40082092k600727k654991k630463l354225l775825l777676l452339l087673
986.6B14748173l758049l529949l378487l165016l035641l983726m351845k930279
994.3A86615181k140827l083153k986813k458973j927623k370835k614860j881104
1002A67150993j631431j434269j328640o99005j102753j358528r93729r71298r84135
1010.7A56647205j174106j076088j432286q41741j031103j350975r38072j794825k025881
1019.4A44982128j491423r33275j570959j478395j787806j825495m15334j250363q36611
$$ y = [275388775, 273219433, 270607376, 268268032, 266554813, 264643002, 263097916, 261582317, 259841423, 258308964, 256205044, 253377800, 250543880, 247684078, 245269051, 242868080, 240082092, 237481365, 234826374, 232195911, 228841686, 225065861, 221288185, 217835846, 214748173, 210990124, 207460175, 204081688, 200916672, 197881031, 193897305, 189545460, 186615181, 184474354, 181391201, 178404388, 175945415, 174017792, 171646957, 169032097, 167150993, 165519562, 164085293, 162756653, 162057648, 160954895, 159596367, 158602638, 157631340, 156647205, 155473099, 154397011, 152964725, 152122984, 151091881, 149740906, 148802834, 147008009, 144982128, 143490705, 142557430, 140986471, 139508076, 137720270, 135894775, 135479441, 134229078, 133392467]
1028.1A33392467m67386j316652j546736r83047n60522o73552L37277J36261N77392
1036.7A28895502Q39195M59833N60151P59458J205759R8438J4649K44989K46926J57480
1046.4A33482380K69308L76501n50623k63319o29835l48415j22548q6097K11038n84974
1056A31753416p5951K32020P25136L83243L94478O64663J120005K172670J155606J622820
1065.7A40148106J627760J694860J348610N09367J237430O48757J400089J071148J61409
1074.4A49847536M27542M9152N75171J212234J153279O34203J214370Q66146R92060
1083A56971693J654530Q07914Q45785J017743J569709J178418R23118J257611R95750
1091.7A67222271J524925J893959J525250L17325R64527J812973P91398L90224O86474
$$ y = [133392467, 132925081, 131608429, 130061693, 129078646, 128518124, 127844572, 128181849, 128318110, 128895502, 129734697, 130194530, 130754681, 131514139, 132719898, 132818336, 132832985, 133077974, 133324900, 133482380, 133751688, 134128189, 133577566, 133314247, 132684412, 132335997, 132213449, 132127352, 132338390, 131753416, 131677465, 131909485, 132634621, 133017864, 133412342, 134077005, 135197010, 137369680, 138525286, 140148106, 141775866, 143470726, 144819336, 145328703, 146566133, 147214890, 148614979, 149686127, 149847536, 150275078, 150324230, 150899401, 152111635, 153264914, 153899117, 155113487, 155979633, 156971693, 158626223, 159434137, 160279922, 161297665, 162867374, 164045792, 164968910, 166226521, 167222271, 168747196, 170641155, 172166405, 172483730, 173448257, 175261230, 176052628, 176442852, 177129326]
1100.4A77129326J456451J648522J200161R22622J414032J184235O65379N52349j33286
1109.1A86039791N28107O92806M08211N11818J83506M92210M15421R48677J054039
1117.7A91274586K00939L27148J93711k53105j29300j4934K38476R22470O00776M37165
1127.4A93797932R36641R96209J429119J578083J030922R30290J695785J457234J069717
1136.1B04921932J612282J481686J007480R98402J234188P74097R06640J233062M58813
1144.8B14628582M05025J30959j2627O90480M83188L37944L6717k09160M272o68850
1154.4B15826530q35247l27587l52783n86929l59230l64285p78007m40121k03495j66988
1164B11411858M93221J014042J242599J149731J265221K356414K604466J656132J228675
$$ y = [177129326, 178585777, 180234299, 181434460, 182357082, 183771114, 184955349, 185620728, 186173077, 186039791, 186567898, 187260704, 187668915, 188180733, 188364239, 188856449, 189271870, 190220547, 191274586, 191475525, 191802673, 191996384, 191743279, 191613979, 191599045, 191837521, 192759991, 193360767, 193797932, 194734573, 195730782, 197159901, 198737984, 199768906, 200699196, 202394981, 203852215, 204921932, 206534214, 208015900, 209023380, 210021782, 211255970, 212030067, 212936707, 214169769, 214628582, 215033607, 215164566, 215151939, 215842419, 216325607, 216663551, 216700268, 216491108, 216495380, 215826530, 214991283, 214663696, 214310913, 213723984, 213364754, 213000469, 212222462, 211782341, 211578846, 211411858, 211905079, 212919121, 214161720, 215311451, 216576672, 218933086, 221537552, 223193684, 224422359]
1172.7B24422359J622296K070923K647800K501946K256565K477226J945744J865425
1180.4B41810284J736259J144142J068287J625290J465988Q21171N95741M80061M13399
1189.1B51160622o70128p76425n00469p48272m97379p53079j231174j257744q71296
1197.8B43854656j526851j671048j202411j652966j523475j296807j229801j142235
1205.5B32609062j390056j163636m56962m85344q82988p07989o64482p52621k62088
1214.2B25842896M06913L03784n64289q17395l12748J92013L76148j4248j93233r4872
1223.8B25124969K2870O942l71475l85971n72147p38087n78861n07794q182M2095l22475
1234.4B21711884o48003o43311n45482m79660Q1463k20986m02603k71797j15261N5809
$$ y = [224422359, 226044655, 228115578, 230763378, 233265324, 235521889, 237999115, 239944859, 241810284, 243546543, 244690685, 245758972, 247384262, 248850250, 249671421, 250267162, 250747223, 251160622, 250490494, 249714069, 249213600, 248465328, 247967949, 247214870, 245983696, 244725952, 243854656, 242327805, 240656757, 239454346, 237801380, 236277905, 234981098, 233751297, 232609062, 231219006, 230055370, 229598408, 229113064, 228230076, 227522087, 226857605, 226104984, 225842896, 226249809, 226553593, 225989304, 225171909, 224859161, 225051174, 225427322, 225413074, 225219841, 225124969, 225147839, 225154781, 224783306, 224397335, 223825188, 223087101, 222508240, 222000446, 221992264, 222034359, 221711884, 221063881, 220420570, 219875088, 219395428, 219476891, 219255905, 218853302, 218581505, 218466244, 218522053]
1244.1B18522053p49035n85842k72751n37262n59902m05350q9817k67715k33460k64416
1253.7B14556503l55167m10080l23753L9692p3643N8403K05841J14708L28502M37909
1263.4B14578915K42614N23434O39191K71015N75161R86023J075191P68147N39951
1272B20199642O45580O41594Q95081R76009Q70076J284523J540851J225529J127529
1280.7B29406414J186676J111126J207371J642303J829434J558094J305065J333504
1288.4B40579987J368713J293316J481895J117382R52397Q93020N06840P04804J181202
1297.1B50079556J344451P09744N97477M22096J32942J48182n7068L17212L48529J98021
1306.8B54241142J49441M05064j32351q19836m40674m22344q6803o6643p782l2749
$$ y = [218522053, 217773018, 217187176, 216914425, 216377163, 215817261, 215411911, 215322094, 215054379, 214820919, 214556503, 214201336, 213791256, 213467503, 213507195, 213433552, 213491955, 213697796, 213812504, 214141006, 214578915, 214821529, 215344963, 215984154, 216255169, 216830330, 217816353, 218891544, 219659691, 220199642, 220845222, 221486816, 222381897, 223357906, 224227982, 225512505, 227053356, 228278885, 229406414, 230593090, 231704216, 232911587, 234553890, 236383324, 237941418, 239246483, 240579987, 241948700, 243242016, 244723911, 245841293, 246793690, 247686710, 248193550, 248898354, 250079556, 251424007, 252133751, 252731228, 253153324, 253286266, 253434448, 253377380, 253694592, 254043121, 254241142, 254390583, 254795647, 254663296, 253843460, 253402786, 252980442, 252893639, 252826996, 252819214, 252786465]
1316.4B52786465J99947O86188K23655N57518N87731N03559N35374N66120N19810M45938
1326B57612305R44690J82228j54495k73533l54709k75669p72744n70240l67736n3368
1335.7B55916729k43378m37183o27213o34460J35593M17290Q18405L67832M49295M77772
1345.3B56640682R9335L28503P953R4509q3656J4458l27111l45954R040m27513j77231
1355.9B55833015l75194l01800r02767p86476r5139n04608m80652p90767j45436m13437
1365.6B51036739o08501p43580j297798p44801k85644Q3523m67377m52385o61984m81090
1375.2B45377102L44086l56217l37143l75442j19057n31712o06708n37453j431846
1383.9B41425610r51157n36652l11126j648846j111355o3076p77988j035481j303520
$$ y = [252786465, 252986412, 253672600, 253896255, 254453773, 255041504, 255545063, 256080437, 256646557, 257166367, 257612305, 258556995, 258739223, 258584728, 258311195, 257956486, 257680817, 256908073, 256337833, 255970097, 255916729, 255673351, 255236168, 254608955, 253974495, 254110088, 254527378, 255345783, 255713615, 256162910, 256640682, 256740017, 257068520, 257076473, 257170982, 257087326, 257101784, 256774673, 256428719, 256437759, 256010246, 255833015, 255457821, 255156021, 254253254, 253466778, 253371639, 252867031, 252386379, 251595612, 251450176, 251036739, 250428238, 249684658, 248386860, 247642059, 247356415, 247439938, 246972561, 246520176, 245858192, 245377102, 245721188, 245364971, 245027828, 244652386, 244533329, 244001617, 243394909, 242857456, 241425610, 240474453, 239937801, 239626675, 237977829, 236866474, 236803398, 236025410, 234989929, 233686409]
1392.6B33686409j187248j707573j231270o79569p93991o66771j785641j043510j089173
1401.3B23501663j606121j444111j093158j416836j561527n70298r76028j047535o73084
1409.9B13112965p98817p09381q73051r64737q23631m00486o29654l11089M39301j359158
1419.6B06682262l60088O36273L33671o2103p34348Q5868N07088N34115N58166J52111
1429.2B08333015J03989J94740N78652Q48465R85966J172447J103115k13013J01872
1437.9B13209248J612606J067943N42736O06404K56424M96730O64959Q62007N70584
1446.6B19889641J93405j86005M66175P44839J81599M80938N60970O55994J38703m75197
1456.2B22651062p12986J615677K490787M05999J230945R63288J000309J569709J131859
$$ y = [233686409, 232499161, 230791588, 229560318, 228880749, 228086758, 227419987, 225634346, 224590836, 223501663, 221895542, 220451431, 219358273, 217941437, 216379910, 215809612, 214833584, 213786049, 213112965, 212314148, 211604767, 210731716, 209766979, 208943348, 208542862, 207913208, 207602119, 208041420, 206682262, 206322174, 206958447, 207292118, 207230015, 206495667, 206581535, 207088623, 207622738, 208180904, 208333015, 208437004, 208631744, 209210396, 210058861, 211044827, 212217274, 213320389, 213107376, 213209248, 214821854, 215889797, 216432533, 217038937, 217295361, 217792091, 218457050, 219319057, 219889641, 220083046, 219897041, 220363216, 221108055, 221289654, 221770592, 222331562, 222987556, 223126259, 222651062, 221938076, 223553753, 226044540, 226450539, 227681484, 228644772, 229645081, 231214790, 232346649]
1464.9B32346649J574059Q54244J595402J912040K391453K388745J680851L524341
1472.6B48267784K917462K975044K776527K653980K218876J970349J503372J575432
1480.3B66858826K005920J760502J718597J411667J097565R43489N40276P2937R01107
1489B77310886m64935j191826K86999j53141r31664j375217j379433m270553n50881
1497.7B67280235j902942k733384k69584j475792j241837j193008j49689l00255l105964
1506.4B54907780m637337k44503K404175J00631K59400j393395j366272L8357o62784
1515.1B49406052J47476j406536j676960K34298M12713j047230j203919J353894N95932
1523.7B46815720J073093K76241J244679P14378j59073N86853N83592N89123M27780
$$ y = [232346649, 233920708, 234774952, 236370354, 238282394, 240673847, 243062592, 244743443, 248267784, 251185246, 254160290, 256936817, 259590797, 261809673, 263780022, 265283394, 266858826, 268864746, 270625248, 272343845, 273755512, 274853077, 275796566, 276336842, 276409779, 277310886, 276845951, 275654125, 275941124, 275787983, 274856319, 273481102, 272101669, 267831116, 267280235, 265377293, 262643909, 262374325, 260898533, 259656696, 258463688, 258313999, 258013744, 254907780, 250270443, 250025940, 252430115, 252530746, 252790146, 251396751, 250030479, 250068836, 249406052, 249553528, 248146992, 246470032, 246704330, 247117043, 246069813, 244865894, 246219788, 246815720, 247888813, 248165054, 249409733, 250124111, 249965038, 250551891, 251135483, 251724606, 252152386]
1532.4B52152386J433773o46496J42460P74956O10046J166515n28164K6741Q40035
1541.1B55972252J397571m28810O75583J407452l65276J112060L62072M07085J66264
1549.8B60706253J53694J008530L99818O84662j364631R21058J314354J109638R74713
1558.5B65908089p948628J974812K54173O98319l98407q48313j662273j370774p01561
1567.1B55905437j422061q37002n857563q54225j093121k340870j925373j947956j093140
1575.8B38534126q771152k13776j948738k769623k529049l458461k120572l720111
1583.5B13002644k258492l766117k859631k731533l680877k271939m078273k049332
1591.2A89306450l487530k207203k988491l439121j742954l326016j281681l488979
$$ y = [252152386, 253586159, 252939663, 253082123, 253857079, 254467125, 255633640, 255105476, 255132217, 255972252, 257369823, 256941013, 257616596, 259024048, 258658772, 259770832, 260132904, 260539989, 260706253, 260859947, 261868477, 262268295, 262952957, 261588326, 262509384, 263823738, 264933376, 265908089, 257959461, 259934273, 260188446, 260886765, 260488358, 259640045, 257977772, 256606998, 255905437, 254483376, 253646374, 247788811, 246934586, 245841465, 243500595, 241575222, 239627266, 238534126, 229762974, 229549198, 227600460, 224830837, 222301788, 218843327, 216722755, 213002644, 210744152, 206978035, 204118404, 201386871, 197705994, 195434055, 191355782, 189306450, 185818920, 183611717, 180623226, 177184105, 175441151, 172115135, 170833454, 167344475]
1599A67344475j726284k204552k106304j402893l111706q17757k442016q22716k370386
1607.6A50339861j087427j062584k078056K02064k228451j47276j449718M63896L34730
1616.3A43287039m387160J020670j092720Q81367p79114J073933j29938j216622J158677
1625A39816132l19176J585989j097412J223049P5903L90100N47943l59010K174511
1633.7A44038029k16532K328424p95698J579933P90501M20771J838436k4109J737003
1642.4A51696758R8877J632681J291962q67205J373406o77596L215580L72277J976137
1651A60112877P76825m008236K775640L82853L134918N74856J755390L47595J048890
1659.7A66901608J407127R92088K666054K04658K857323J483822K292404K124214J282711
$$ y = [167344475, 165618191, 163413639, 161307335, 159904442, 156792736, 155974979, 153532963, 152710247, 150339861, 149252434, 148189850, 146111794, 146313858, 144085407, 143938131, 142488413, 142952309, 143287039, 138899879, 139920549, 138827829, 139709196, 138930082, 140004015, 139874077, 138657455, 139816132, 139496956, 141082945, 139985533, 141208582, 141284485, 141674585, 142222528, 141863518, 144038029, 143821497, 146149921, 145354223, 146934156, 147724657, 148145428, 149983864, 149959755, 151696758, 151795635, 153428316, 154720278, 153853073, 155226479, 154548883, 157764463, 158136740, 160112877, 160889702, 156881466, 159657106, 160039959, 163174877, 163749733, 165505123, 165852718, 166901608, 168308735, 169300823, 171966877, 172171535, 175028858, 176512680, 178805084, 180929298, 182212009]
1668.4A82212009K333870J035309L788681J586342L499947K661819K030926L157997
1676.1B02306900K324467L715019K287388L680057K832737L846169L935394J201248
1683.8B26129379O242905J258469M992065L501301M222622M282245L635979M609737
1691.5B58874702L676701M613419M200725N100994L716927N185051N693397M293270
1699.3B95355186L897381K189122O543273N087529N022487L989106L462905L780175
1707C29327164L829612M462395K780228K932205L255043L358612L439980J859398K455406
1715.6C57700043L138580K943344n85213L347130L180504K031822J806069J312904
1723.4C74875183K374268K570381K221680J879158K202835K749824P58133J071472
$$ y = [182212009, 184545879, 185581188, 189369869, 190956211, 194456158, 197117977, 199148903, 202306900, 204631367, 208346386, 210633774, 214313831, 217146568, 220992737, 224928131, 226129379, 232372284, 233630753, 238622818, 242124119, 246346741, 250628986, 254264965, 258874702, 262551403, 267164822, 271365547, 276466541, 280183468, 285368519, 291061916, 295355186, 299252567, 301441689, 307984962, 313072491, 318094978, 322084084, 325546989, 329327164, 333156776, 337619171, 340399399, 343331604, 346586647, 349945259, 353385239, 355244637, 357700043, 360838623, 363781967, 363196754, 366543884, 369724388, 371756210, 373562279, 374875183, 377249451, 379819832, 382041512, 383920670, 386123505, 388873329, 389631462, 390702934]
1731.1C90702934L290825L504028J66588j133232M652634L919868K253495K938041
1738.8D10295181K073708N2452L993530L495522K160797L221969M102555M097023L286781
1747.5D36779518L970566L424148N081635L602562K321091N058479L983231M271965
1755.2D68493195M110946K245178K875710L492393L594246L712120J172944J725311
1762.9D91422043L952980L018341K853432K331161J658173k32392K837754M537391
1770.6E12378883J491814r308J44158M148292K339974N6076K653923J509018K380180
1779.3E27093010J331596K55509K137031K399445K047500J8693R56573J873856J493644
1788E39606857J232987K053604J499824J025429j09482J09177L521385J144524R5711
$$ y = [390702934, 393993759, 397497787, 397664375, 396531143, 401183777, 405103645, 407357140, 410295181, 412368889, 412421341, 416414871, 419910393, 422071190, 425293159, 429395714, 433492737, 436779518, 440750084, 444174232, 449255867, 452858429, 455179520, 460237999, 464221230, 468493195, 472604141, 474849319, 477725029, 481217422, 484811668, 488523788, 489696732, 491422043, 495375023, 498393364, 501246796, 503577957, 505236130, 505003738, 507841492, 512378883, 513870697, 513861389, 514005547, 518153839, 520493813, 520549889, 523203812, 524712830, 527093010, 528424606, 528680115, 530817146, 533216591, 535264091, 535282784, 536239357, 538113213, 539606857, 540839844, 542893448, 544393272, 545418701, 545309219, 545418396, 548939781, 550084305, 550180016]
1796.7E50180016J702385K038536Q62236P5035L338203P95555Q08983J751137J047325
1805.3E62599411J463089O25801J078835J319351J543617l55110J415558K197799N89180
1814E72477531J284485M24462J250801K74086P50007J287079M38919J623612K23083
1822.7E80034065J687279J464996j680755N97496K043991K004051J26686j634445J186218
1831.4E85829582K641258N99633M36744Q23441K95525N41343j02882J514702Q74214
1840.1E93453560O36444M69894J239014J108742l879852K464752K026024J22795M0817
1848.7E97682190Q92639J118622j31607R60579M3716P02744P07130N03807R34448j51214
1858.4F03263054P05871j07955K83241O1264O70853R79080J1711P84149k86407R83696
$$ y = [550180016, 551882401, 553920937, 554783173, 554858208, 558196411, 558991966, 559800949, 561552086, 562599411, 564062500, 564688301, 565767136, 567086487, 568630104, 568274994, 569690552, 571888351, 572477531, 573762016, 574186478, 575437279, 575711365, 576461372, 577748451, 578187370, 579810982, 580034065, 581721344, 583186340, 581505585, 582103081, 584147072, 586151123, 586277809, 584643364, 585829582, 588470840, 589070473, 589507217, 590330658, 590626183, 591167526, 591064644, 592579346, 593453560, 594090004, 594559898, 595798912, 596907654, 593027802, 595492554, 597518578, 597641373, 597682190, 598574829, 599693451, 599561844, 600522423, 600566139, 601268883, 601976013, 602479820, 603414268, 603263054, 603968925, 603860970, 604144211, 604205475, 604876328, 605855408, 605867119, 606651268, 606364861, 607348557]
1868F07348557n25284n34745J453553P54242P04116q0909Q82492K11868K89421M21906
1877.7F10925217K87094N28946k99378O33927l26577L12920L92227q4038O94886K87780
1887.3F13353004J106301k81754j078186M58145R79844J98020P6256K97890m10996
1896F14698524R67370L43933O03256K49863l42370P1717l34854N73158q9798P60193
1905.6F17500992N49049m6539R0637l17345L83912k66648R56116M8561j12495M08439
1915.3F19194679K36206J389962j635704o04287O74668N31425P58248q50678m39491
1923.9F19255028K42195O89697P2289N71327J30310l21961J76888m22134J57470l66211
1933.6F20184898K21634K74773N04303M38118n27344M4174q88557K59704r5863q07381
$$ y = [607348557, 606823273, 606288528, 607742081, 608496323, 609200439, 609119530, 610002022, 610213890, 610503311, 610925217, 611212311, 611741257, 611441879, 612075806, 611749229, 612062149, 612454376, 612370338, 613065224, 613353004, 614459305, 614177551, 613099365, 613557510, 614537354, 614735374, 614811630, 615109520, 614698524, 615665894, 616009827, 616613083, 616862946, 616520576, 616592293, 616257439, 616830597, 616740799, 617500992, 618050041, 618003502, 618094139, 617776794, 618160706, 617894058, 618850174, 618898735, 618786240, 619194679, 619430885, 620820847, 619185143, 618580856, 619255524, 619786949, 620545197, 619694519, 619255028, 619497223, 620186920, 620259209, 620830536, 620960846, 620638885, 620815773, 620393639, 620551109, 620184898, 620406532, 620681305, 621185608, 621623726, 621096382, 621140556, 620251999, 620511703, 620415840, 619608459]
1943.2F19608459J228829O53839l97224n99938L27568l16429j17035k10762l77769
1951.9F19799538O47468J90468J26457m40750j19705j04828J23596J25160m90570K60010
1961.6F20116844N5046L45154l57361k15568q1787p08733q1368p0457Q06770J5412
1971.2F19823952J14326J9951m66576K00806l29246j2169m75998P6523M0207p4921
1980.8F18916855N18951j53503R0446n22804m74319m16069Q2817k747k24724J071816
1990.5F18886719O6108n48172k95410J43891k40021n38101l58811m08668O42929O6109
2000.1F17416573P2021l21770p6866j52130j242676l1547l04680J69220K84538R6665
2009.8F15909348J3008n58739j56403q05359j85661l20396k89917R0370J24550K22816
$$ y = [619608459, 620837288, 621491127, 621093903, 620493965, 620821533, 620505104, 620388069, 620177307, 619799538, 620447006, 620637474, 620763931, 620323181, 620203476, 620098648, 620222244, 620347404, 619856834, 620116844, 620171890, 620517044, 620159683, 619944115, 619862328, 619153595, 619072227, 619001770, 619808540, 619823952, 619938278, 619958229, 619491653, 619692459, 619363213, 619351044, 618875046, 618951569, 618991776, 618916855, 619435806, 619282303, 619372749, 618849945, 618375626, 617959557, 618042374, 618039627, 617814903, 618886719, 618952827, 618404655, 618109245, 618253136, 618013115, 617475014, 617116203, 616707535, 617350464, 617416573, 617488594, 617166824, 617089958, 616937828, 615695152, 615663605, 615358925, 615528145, 615812683, 615909348, 615922356, 615363617, 615207214, 614401855, 614216194, 613895798, 613605881, 613696251, 613820801, 614043617]
2019.4F14043617m05235L32794n94597p20863p43485n49583K64168k57378L29361p8773
2029.1F11620026N33523j67618j395607p12509o3858N59197n50042q9302L39013K81677
2038.7F10354500l05443o91605n6457q28056j77422k80380M2457j21078l65410M21333
2048.4F07992439m08897j47553k86712K11487k13891m47006M13895j13449l6698n30128
2058F06433487J22642j29890k01340m158j92108O92215m49409k48948l17840k57759
2067.6F05446892m3946k97508L83873k82249J50451k10914k18888m6081j94473K51274
2077.3F04938431n29518l18566l40309L9902j29318Q8195L70293l03764J41258m15993
2086.9F03540611k17933p18384o39382o2408k15225L89328m68025k01607M4670J7967
$$ y = [614043617, 613638382, 613971176, 613376579, 612655716, 611912231, 611362648, 611626816, 611369438, 611698799, 611620026, 612153549, 611985931, 610590324, 609877815, 609813957, 610373154, 609823112, 609733810, 610072823, 610354500, 610049057, 609357452, 609300995, 608472939, 608295517, 608015137, 608057594, 607936516, 607571106, 607992439, 607583542, 607435989, 607149277, 607360764, 607146873, 606699867, 607113762, 607000313, 606963615, 606433487, 606556129, 606426239, 606224899, 606220741, 606028633, 606720848, 606271439, 606022491, 605704651, 605446892, 605402946, 605105438, 605489311, 605207062, 605357513, 605146599, 604927711, 604881630, 604687157, 604938431, 604408913, 604090347, 603750038, 603789940, 603660622, 603748817, 604119110, 603815346, 603956604, 603540611, 603322678, 602604294, 601964912, 601902504, 601687279, 602076607, 601608582, 601406975, 601451645, 601469612]
2096.6F01469612m13132p04383j00937j97907K35710l43322n3254o0691j19362j85852
2106.2E99526482q55370J32828l39623l37143j97944k022k7275n29061j10511n35507
2115.9E96724854K7656q5411J61438o7253n18379J4953m64019O3629n38788j01090
2125.5E95217590M38042L13034P2289r30481K16865m6348n73P8545j28098K25907n57709
2136.1E94899063n07316m02489M01649J55106J63765M0893o41594j3961k57187K07939
2145.8E94045868Q0490K80113j19438l29933L65028l97911J14517n00946k31056K54364
2155.4E93561096Q9302O11763p3509R7618k95563j82228l15971l59879j335k73857
2165E92857437L20931J84478O53687K37389K0256J3580m16794j74065o84280L23715
$$ y = [601469612, 601056480, 600352097, 600251160, 600053253, 600288963, 599945641, 599892387, 599831696, 599712334, 599526482, 598671112, 598803940, 598464317, 598127174, 597929230, 597927208, 597899933, 597370872, 597260361, 596724854, 596752510, 596667099, 596828537, 596761284, 596242905, 596257858, 595793839, 595857468, 595318680, 595217590, 595655632, 595968666, 596040955, 595110474, 595327339, 595280991, 595280418, 595358963, 595230865, 595456772, 594899063, 594391747, 593989258, 594390907, 594546013, 594709778, 594750671, 594109077, 594095116, 593837929, 594045868, 594126358, 594406471, 594287033, 593957100, 594322128, 593924217, 594038734, 593537788, 593306732, 593561096, 593650398, 594262161, 594188652, 594286270, 593990707, 593808479, 593492508, 593132629, 593131294, 592857437, 593178368, 593362846, 594016533, 594253922, 594274178, 594287758, 593870964, 593696899, 593012619, 593336334]
2174.7E93336334K95067J77002N10788L19443K60963n01709k8267l61519m00428k44141
2184.3E93363533N0888O27670P134k1515j57776L06511j3046j66092p4043k45095L81508
2194.9E94059677N4169K52838j72730j20887m9286j91689L38364p0381K51121M9477
2204.6E94400673J68190p9117n0468K59056m88816l4523n226N86167J85623n83115
2214.2E94358444j82419J78643M50782k24494K22091j82533j86081L97034J17950K32201
2223.9E95181618j69297j36833n96161j58271P8392J01165K05384l73421K37007j41029
2233.5E94228554N5237n4322j259K35939m53720J83487p0381O0196P4310J47896j44272
2244.1E94261665o25190K28233n6648Q2245j45302P4768K66075P2670M1161n57900
$$ y = [593336334, 593631401, 593808403, 594319191, 594638634, 594899597, 594397888, 594369621, 594008102, 593607674, 593363533, 593414421, 594042091, 594049225, 594027710, 593869934, 594176445, 594163399, 593997307, 593923264, 593678169, 594059677, 594113846, 594366684, 594193954, 594073067, 594023781, 593832092, 594170456, 594100075, 594351196, 594400673, 594568863, 594489746, 594439278, 594698334, 594209518, 594174995, 594169769, 594755936, 594941559, 594358444, 594176025, 594354668, 594805450, 594580956, 594803047, 594620514, 594434433, 594831467, 594949417, 595181618, 595012321, 594875488, 594279327, 594121056, 594199448, 594300613, 594505997, 594132576, 594369583, 594228554, 594283791, 594229469, 594228210, 594464149, 594010429, 594193916, 594123535, 594183731, 594258041, 594405937, 594261665, 593636475, 593864708, 593808060, 593890305, 593745003, 593819771, 594085846, 594158516, 594199677, 593641777]
2253.8E93641777Q9073j74866K00692J7395l29552K37579m06761j7395K51618M67376
2263.4E93976936l63998l64800J33973k84233L02658j52855N0201k85988j58119J73874
2273E93027649j27602K36855o03829m81300m94270J34048j15356n81055L87726j39656
2282.7E91243210J19667l08190j01661K06146j76468q0528l33099N44204J602R7695
2292.3E91212578K86941K1477K23961m90494j46293k84882K42653K58064q6784K96287
2302E91533508M4213J64489j66473J85852O1302K58560M81110R0103J82991j09787
2311.6E92725868P18460O5155l11088M27017N61256L27225q1634J132278J224251N85556
2321.3E97374344p10030j369323n62020M74205J316948M37813N53474J86463j30806
$$ y = [593641777, 593730850, 593555984, 593756676, 593774071, 593444519, 593682098, 593275337, 593257942, 593509560, 593976936, 593612938, 593248138, 593382111, 593097878, 593400536, 593247681, 593297882, 593011894, 592853775, 593027649, 592900047, 593136902, 592533073, 592051773, 591557503, 591691551, 591576195, 590995140, 591382866, 591243210, 591362877, 591054687, 590953026, 591159172, 590982704, 590902176, 590569077, 591113281, 591114883, 591212578, 591499519, 591520996, 591744957, 591254463, 591108170, 590823288, 591065941, 591324005, 591237221, 591533508, 591577721, 591742210, 591575737, 591761589, 591822891, 592081451, 592562561, 592652664, 592835655, 592725868, 593444328, 593509483, 593198395, 593625412, 594186668, 594513893, 594432259, 595564537, 596788788, 597374344, 596664314, 595294991, 594732971, 595207176, 596524124, 596961937, 597515411, 597701874, 597571068]
2329.9E97571068k66266L88145P41387j258736o44951P11632O46439j087227r10263
2338.6E95891228K25830M89120N79720K11944Q81577m79355p31964k146072l853379
2347.3E91068649k822189J51520K879142J001282J014481J447563N30281J745911J113243
2356E98129883J188011j596985P46498M96102j85547L25699j556092J604996j438713
2364.7E97713852j634674j257477j108208m55475k767295k336808k182083n39436j149216
2373.3E84283180j856498j265831j307908j040382j582756j335907j582184j308288
2381.1E73003426j274491j002922p17506j168213o56624j008568l23028K09655r0255
2389.7E66971474l39165o80161k67372o83517j86005k45018n21431m39758o68182j40267
$$ y = [597571068, 597304802, 597692947, 598434334, 597175598, 596530647, 597242279, 597888718, 596801491, 595891228, 596117058, 596606178, 597185898, 597397842, 598279419, 597800064, 597068100, 594922028, 591068649, 588246460, 588397980, 591277122, 592278404, 593292885, 594740448, 595270729, 597016640, 598129883, 599317894, 597720909, 598467407, 598963509, 598777962, 599103661, 597547569, 599152565, 597713852, 596079178, 594821701, 593713493, 593258018, 590490723, 588153915, 585971832, 585432396, 584283180, 582426682, 581160851, 579852943, 578812561, 577229805, 575893898, 574311714, 573003426, 571728935, 570726013, 570008507, 568840294, 568183670, 567175102, 566852074, 567061729, 566971474, 566632309, 565952148, 565684776, 565001259, 564815254, 564570236, 564048805, 563609047, 562940865, 562800598]
2399.4E62800598k89497l433n84259q40722k87323N0698N7640j026268m83895o9999
2409E59323540l18146n78194o21185n62973p08427j72806m31748k38762m10537l33061
2418.7E54947701j89934p89948k97470k24495j26381o17904n40047j70288l48396j80092
2428.3E51462746o73294n68619q49953m63409j10207o91452o63490m62647J00823k01226
2438E46879272n26466q06503o32630m11796m25224l41492q13675k56424n40733l16773
2447.6E41807556j46675q29353m09584n13230n58090q99887l14980j17836k00309q8005
2457.2E37729607j069298o07758o35948n21850m68865n08614j63192q04253q68111
2465.9E32081718o99424J15738k01912n66407p97958j029205k8572m72947m04853o84815
$$ y = [562800598, 562511101, 562507668, 561923409, 561082687, 560795364, 560846062, 560903702, 559877434, 559393539, 559323540, 559005394, 558427200, 557806015, 557243042, 556534615, 556361809, 555930061, 555691299, 555280762, 554947701, 554757767, 553967819, 553670349, 553445854, 553319473, 552701569, 552161522, 551991234, 551642838, 551462746, 550789452, 550220833, 549370880, 548907471, 548797264, 548105812, 547442322, 546979675, 547080498, 546879272, 546352806, 545546303, 544913673, 544501877, 544076653, 543735161, 542921486, 542665062, 542124329, 541807556, 541660881, 540831528, 540421944, 539908714, 539350624, 538450737, 538135757, 538017921, 537817612, 537729607, 536660309, 536052551, 535416603, 534894753, 534425888, 533917274, 533754082, 532949829, 532081718, 531382294, 531498032, 531296120, 530729713, 529931755, 528902550, 528873978, 528401031, 527996178, 527311363]
2475.6E27311363o63681k87285n96809k76375p99866n81321o48499n86700n45616o98700
2485.2E21626511m43955p84721j64871n74761p96051o17027m29344k47651j034011
2493.9E16534119q34999r50470n87922l85208m64744p23229q47053j7319p27196o61888
2503.5E10334091n02395m70047n97001j148033m16488n59807n33905o14586n90134
2512.2E04901695l67851n23109n79796p51457l15094p01714n26848l61175m80385m24195
2521.9D99870071q59146m42924n18265m46510n28603n47752n82466m59290R7122p39631
2531.5D94842606o56586m61006k22588l54309q31184l11241o64521m84237m77524l61214
2541.1D90018196l79295p73583l64837l29628j20392o39610q67081m24805j75705m88510
$$ y = [527311363, 526647682, 526360397, 525763588, 525487213, 524687347, 524106026, 523457527, 522870827, 522325211, 521626511, 521182556, 520397835, 520232964, 519658203, 518862152, 518245125, 517815781, 517568130, 516534119, 515699120, 514748650, 514160728, 513775520, 513310776, 512587547, 511740494, 511723175, 510995979, 510334091, 509831696, 509361649, 508764648, 507616615, 507200127, 506640320, 506106415, 505491829, 504901695, 504533844, 504010735, 503430939, 502679482, 502364388, 501662674, 501135826, 500774651, 500294266, 499870071, 499010925, 498568001, 498049736, 497603226, 497074623, 496526871, 495944405, 495485115, 495582237, 494842606, 494186020, 493725014, 493502426, 493148117, 492316933, 492005692, 491341171, 490856934, 490379410, 490018196, 489638901, 488865318, 488500481, 488170853, 488050461, 487410851, 486543770, 486118965, 485943260, 485454750]
2550.8D85454750p05643k06108p38296p40242n90248n13573m55055m81301l57437p32689
2560.4D79934158j28784l33099n25818l27568n58777m06036m30146k18620p98683o03867
2570.1D75602760j99089n15136o47202p10602j43890m02718n36766m50592j91498j03645
2579.7D71701622n48706n01061p17849o77643p72247k87323l62778p29141k44675m91371
2589.4D66368828l45841n86319m12139l46451o43730o41175j077995k90299j51557
2598D61873322m21067m93927q49380p45850l51829j90545q09364n44128o27442p22084
2607.7D56117706k03170j66474l73764r73663p45392n46837m24652o41975q32520n87501
2617.3D50621758n18418r5024o13747n67398m20990n61180o29463r90715m36325m79775
$$ y = [485454750, 484749107, 484542999, 483804703, 483064461, 482474213, 481960640, 481505585, 481024284, 480666847, 479934158, 479805374, 479472275, 478946457, 478618889, 478060112, 477654076, 477223930, 477005310, 476206627, 475602760, 475403671, 474888535, 474241333, 473530731, 473386841, 472984123, 472447357, 471996765, 471805267, 471701622, 471152916, 470651855, 469934006, 469256363, 468484116, 468196793, 467834015, 467104874, 466860199, 466368828, 466022987, 465436668, 465024529, 464678078, 464034348, 463393173, 462315178, 462024879, 461873322, 461452255, 460958328, 460108948, 459363098, 459011269, 458820724, 458011360, 457467232, 456839790, 456117706, 455914536, 455748062, 455374298, 454400635, 453655243, 453108406, 452683754, 452041779, 451209259, 450621758, 450103340, 450008316, 449394569, 448827171, 448406181, 447845001, 447215538, 446224823, 445788498, 445308723]
2627D45308723l46298m44946p78008o97975o07910l31764o87637n11399p60841n39131
2636.6D39602814j79901p63207p06329o87180l01780m16298m94652o00777o80542l28827
2646.3D34443321o14052k85682m36554n07660m61197p33643n29022k97928j91078q78830
2655.9D29507675o86149l88565o17371n06287k20298M4631m88319o31752o25191l00827
2665.5D25087547l41148n79338k36588l44505k71416o49185k34680j16539p24945k80876
2675.2D21308327l17536l46489l61290j01966j29357p03544p00493m38691k63099o04820
2684.8D17341042m82979l20168l34091k65999k01111l64380p85293m09088l61443m25987
2694.5D13390503k98500j01776l63922q10433k36587l09105l53127k04010j15165j78490
$$ y = [445308723, 444962425, 444517479, 443739471, 443041496, 442433586, 442101822, 441414185, 440902786, 440141945, 439602814, 439422913, 438659706, 437953377, 437266197, 436964417, 436548119, 436053467, 435452690, 434772148, 434443321, 433829269, 433543587, 433107033, 432599373, 432138176, 431404533, 430875511, 430577583, 430386505, 429507675, 428821526, 428432961, 427815590, 427309303, 427089005, 427133636, 426645317, 426013565, 425388374, 425087547, 424746399, 424167061, 423930473, 423585968, 423314552, 422665367, 422430687, 422314148, 421589203, 421308327, 420990791, 420644302, 420283012, 420181046, 420051689, 419348145, 418647652, 418208961, 417945862, 417341042, 416858063, 416537895, 416203804, 415937805, 415736694, 415372314, 414587021, 414177933, 413816490, 413390503, 413092003, 412990227, 412626305, 411815872, 411579285, 411270180, 410917053, 410713043, 410597878, 410419388]
2704.1D10419388o24771o15006o75125k50664j51176l37410m22859m31328m31709o57158
2713.8D05822182l7690q0337l03688l06435l10096p7057m70200n79567k57225J43089
2723.4D03542976l87878o04820k82593j92490j8158o10733m45137j22757r2086m86069
2733D00300255o35300K2392k06222k37808m36783k23236l38059n39360N7907m29725
2742.7C97334061j22719J46255j02348r1858K08397R9869q84705o27517n43557m12979
2752.3C95002899l37524m36516L31230J50299o28357p92122p3509n3787n14908n17616
2762C92130089l06282j9493j66397j90468l86429n8403k67487q64715n29213l36914
2771.6C89004288j80245n22957l58772j55296m03786n70488n92232l45039n68733j25733
$$ y = [410419388, 409794617, 409179611, 408504486, 408253822, 408102646, 407765236, 407342377, 406911049, 406479340, 405822182, 405784492, 405704155, 405400467, 405094032, 404783936, 404706879, 404236679, 403657112, 403399887, 403542976, 403155098, 402550278, 402267685, 402075195, 402057037, 401446304, 401001167, 400878410, 400786324, 400300255, 399664955, 399687347, 399481125, 399243317, 398806534, 398583298, 398245239, 397705879, 397763786, 397334061, 397211342, 397357597, 397255249, 397163391, 397371788, 397471657, 396586952, 395959435, 395415878, 395002899, 394665375, 394228859, 394560089, 394710388, 394082031, 393289909, 393216400, 393162613, 392647705, 392130089, 391823807, 391804314, 391637917, 391447449, 391061020, 391002617, 390735130, 389870415, 389341202, 389004288, 388824043, 388301086, 387942314, 387787018, 387383232, 386812744, 386220512, 385875473, 385306740, 385181007]
2781.3C85181007l76701q95691o18019k21481J28174n45311o46592q11119p72743m24766
2790.9C79996758o18020m16679n78232l82767l78265n84602n22537p35932q63724m33807
2800.5C74482193M692q60138j303406p30171j04408n85442r08012k85492o23550o71235
2810.2C68415031r97314r53293o08177q43506o46553q75969o12144o52008r07402q10242
2819.8C60508423r18198q79326q89930p28951r33571r86480q44040m32778r12781j398963
2829.5C51583405o28472j002235j107140j227951j159592j055755j642609j473198
2837.2C42286453j661300j264153j517792k111969k102852k484550k251892k310372
2844.9C26581573k268142k498932k751885k619781k574787k283783j731281j040574
$$ y = [385181007, 384804306, 383908615, 383290596, 383069115, 383197289, 382651978, 382005386, 381194267, 380421524, 379996758, 379378738, 378962059, 378383827, 378001060, 377622795, 377038193, 376515656, 375779724, 374916000, 374482193, 374486885, 373626747, 372323341, 371593170, 371488762, 370903320, 369995308, 369709816, 369086266, 368415031, 367417717, 366464424, 365856247, 365012741, 364366188, 363490219, 362878075, 362226067, 361318665, 360508423, 359590225, 358710899, 357820969, 357092018, 356158447, 355171967, 354327927, 353895149, 352982368, 351583405, 350954933, 349952698, 348845558, 347617607, 346458015, 345402260, 343759651, 342286453, 340625153, 339361000, 337843208, 335731239, 333628387, 331143837, 328891945, 326581573, 324313431, 321814499, 319062614, 316442833, 313868046, 311584263, 309852982, 308812408]
2852.6C08812408j256675p57733m31766k25868O85367M76017M08592J42804P763q3085
2862.3C07777824k99587k11162l65448m09699q22906o86131r92107j439267o69899
2870.9C01881618o6928k97242r27543n49355l34759l81431p7915m35276p84130m19846
2880.6B97607193l80859p48577m74339p28226q20236j125698j290817m55666p84511
2889.3B90798264p50237j050892j565475j118489j019706r43623j091938r65137p87316
2897.9B81505451l75747p04995j473884j243382r82456l66325q60234j644725j454316
2906.6B72399387j109600q14571q56953j147003j814136j607094j680832j800385j633434
2915.3B59935379k027779k172584k430229j510830j354428j451473p81822r72366l05081
$$ y = [308812408, 307555733, 306798000, 306366234, 306140366, 306825733, 307301750, 307710342, 307853146, 307860909, 307777824, 307478237, 307267075, 306901627, 306491928, 305669022, 304982891, 303990784, 302551517, 301881618, 301814690, 301517448, 300589905, 300040550, 299705791, 299324360, 299246445, 298811169, 298027039, 297607193, 297226334, 296477757, 296003418, 295275192, 294454956, 293329258, 292038441, 291582775, 290798264, 290048027, 288997135, 287431660, 286313171, 285293465, 284349842, 283257904, 282292767, 281505451, 281129704, 280424709, 278950825, 277707443, 276724987, 276358662, 275498428, 273853703, 272399387, 271289787, 270475216, 269618263, 268471260, 266657124, 265050030, 263369198, 261568813, 259935379, 257907600, 255735016, 253304787, 251793957, 250439529, 248988056, 248206234, 247233868, 246928787]
2924B46928787j33133K28215N80864K05745K94647K49577O17466L23811L16333R23806
2933.6B50536118J167259J241550R55944J250191J052513M69818Q07762J402398J371536
2942.3B60255089O54220N63736R40037N42050K89840M62780N74608N54314j43471R1324
2952B64784527O87485L59668M9858L32966J100579M41589L68366P81975L54404P77855
2961.6B70039272P10926J087780J442128R48619P59240O50940P73391R45320J189824
2970.3B78547440J158790J161537P04861O80809J110668O23398M87175L77026P24868
2979B85576572Q01068N47905K61745k53639L57189M86679O09799M64496j30501K97108
2988.6B89018421O83594M09260M4269M47445K29264o3344k2773N817J08032l16810
$$ y = [246928787, 246795654, 247023869, 247604733, 247810478, 248105125, 248354702, 248972168, 249295979, 249612312, 250536118, 251703377, 252944927, 253900871, 255151062, 256203575, 256673393, 257481155, 258883553, 260255089, 260909309, 261473045, 262413082, 262955132, 263244972, 263707752, 264282360, 264836674, 264693203, 264784527, 265472012, 265831680, 265881538, 266214504, 267315083, 267756672, 268125038, 268907013, 269261417, 270039272, 270750198, 271837978, 273280106, 274228725, 274987965, 275638905, 276412296, 277357616, 278547440, 279706230, 280867767, 281572628, 282253437, 283364105, 283987503, 284474678, 284851704, 285576572, 286377640, 286925545, 287187290, 286933651, 287290840, 287777519, 288387318, 288851814, 288721313, 289018421, 289702015, 290111275, 290155544, 290602989, 290832253, 290768909, 290746136, 290751953, 290859985, 290543175]
2998.2B90543175j97544m53625j72806J28384l93772l69797m73118m14276n78384l34816
3007.9B87283421k38648l59268m91676o84891N9299k68993m51069n98526r70707o60190
3017.5B82618752l93715K96344l64456j004410o44474m98619q47053j162300m90418
3026.2B77509651l09048l40785n06955q98838r93824o08730n00393r10644o00167p03544
3035.9B71136723m77219m27094j003475o82487l63274n40752j037350q72650q35819
3044.5B64896603q12741m28543m59747n47924q10719q10108j227321r49097k09198
3053.2B58641205m33102n95627q71162j077042j082267o65207m83704m33826o70319
3061.9B52328949q92963j84842l49998l29247l83300n91088o21814j172753o20022
$$ y = [290543175, 290345631, 289892006, 289719200, 289847584, 289453812, 289084015, 288610897, 288196621, 287618237, 287283421, 287044773, 286685505, 286193829, 285508938, 285568237, 285299244, 284848175, 284249649, 283278942, 282618752, 282225037, 282521381, 282156925, 281152515, 280508041, 280009422, 279162369, 278000069, 277509651, 277200603, 276859818, 276352863, 275454025, 274460201, 273851471, 273351078, 272440434, 271840267, 271136723, 270659504, 270232410, 269228935, 268546448, 268183174, 267642422, 266605072, 265732422, 264896603, 264083862, 263655319, 263195572, 262647648, 261836929, 261026821, 259799500, 258850403, 258641205, 258208103, 257612476, 256741314, 255664272, 254582005, 253916798, 253433094, 252999268, 252328949, 251435986, 251251144, 250901146, 250571899, 250188599, 249597511, 248975697, 247802944, 247182922]
3070.6B47182922k61345l95221n00660o12126r42630p69139j37253q01506p89871m66003
3080.2B41507168j38130n9929o50921o43749q30193l67012j73969m64440o46114p07016
3089.9B36825695l52936o23588n75009o34155p53612q28534q25901k28233k91615m60319
3099.5B31251793n25990n85727p22084p67861n25932j68190j32866m37431j59073n46131
3109.1B26680508q20065m38881o52923q59242l91807n3444m99211m69761p11631n84870
3118.8B21198673n17959j112767n11608m10938n31998p31353q65384m96177m93737
3127.5B15526752m48589n11799k06241p26967r60159m68922o49338n55324m94900q2245
3137.1B10422268n58281r44519k83375l71532o04878r36775j059780o73180j95293
$$ y = [247182922, 246921577, 246526356, 246025696, 245413570, 244470940, 243701801, 243564548, 242763042, 241973171, 241507168, 241369038, 241309109, 240658188, 240014439, 239184246, 238817234, 238643265, 238178825, 237532711, 236825695, 236472759, 235849171, 235274162, 234640007, 233886395, 233057861, 232231960, 232003727, 231712112, 231251793, 230725803, 230140076, 229417992, 228650131, 228124199, 227956009, 227823143, 227385712, 227226639, 226680508, 225860443, 225421562, 224768639, 223909397, 223517590, 223464146, 222964935, 222495174, 221783543, 221198673, 220680714, 219567947, 219056339, 218645401, 218113403, 217382050, 216516666, 216020489, 215526752, 215078163, 214566364, 214360123, 213633156, 212672997, 212204075, 211554737, 210999413, 210504513, 210422268, 209863987, 208919468, 208636093, 208264561, 207659683, 206722908, 205663128, 204989948, 204794655]
3145.8B04794655n42126o45599q9913k99873p02343j087627q60157n63374l38039n85022
3155.4A99080582r98650l45249l15971m25282n59387p02133o92101p91359m83532m18873
3165.1A93348045k97756n88951p16190n49927l95470k71206o45542n68924p31888q25119
3174.7A87757072p70568m53701k56844n88493l26367o76136n16872k06642o34747o57730
3184.4A82668972o25534l10116r7599m77009j002712n51872o95305p65877J60122k74181
3194A78028889m96044n07317n59998n75428n51548j8234k96078n56850p35664p00207
3203.6A73031521o46477l89690j96705n86834l44544o95343l55434K11105k49004l64895
3213.3A69413700o25954n04608m65355n77087n26123n34783n47466k71778j73416p18765
$$ y = [204794655, 204252529, 203606930, 203517017, 203217144, 202514801, 201427174, 200567017, 200003643, 199665604, 199080582, 198081932, 197736683, 197420712, 196995430, 196436043, 195733910, 195041809, 194250450, 193766918, 193348045, 193050289, 192461338, 191745148, 191195221, 190799751, 190528545, 189883003, 189314079, 188582191, 187757072, 186986504, 186532803, 186275959, 185687466, 185361099, 184684963, 184168091, 183961449, 183326702, 182668972, 182043438, 181733322, 181635723, 181158714, 180156002, 179604130, 178908825, 178142948, 178303070, 178028889, 177532845, 177025528, 176465530, 175890102, 175338554, 175320320, 175024242, 174467392, 173731728, 173031521, 172385044, 171995354, 171798649, 171211815, 170867271, 170171928, 169816494, 170027599, 169778595, 169413700, 168787746, 168283138, 167817783, 167240696, 166714573, 166179790, 165632324, 165360546, 165187130, 164468365]
3222.9A64468365m16889k00902j40380j11332m93985n72891n22823r6073k31552l34454
3232.6A61347084n10387o06118j52683m81501m08887q4334k45886q78505o09207K84738
3242.2A57654314n6925l12242o27327k74191L65219j82238q43868j090212m17890L70044
3251.9A54584684K1105r28640p48434J38302J90534l50342q34446n55248k51694l37123
3261.5A50928698l57924k00500q583J09643k70805q05216o93559o06633j47943r0532
3271.2A47856646l11308K2030k99464m34084p5454J27477m71573q02126k94523K00711
3280.8A45518332K83947m70734k53086j25523m19016q4581j21203j0871l52307o22148
3290.4A43342810l70407J38578o8378m24881K13041l76072p05624j08490J13564j43128
$$ y = [164468365, 164051476, 163850574, 163710194, 163598862, 163104877, 162531986, 162009163, 161913090, 161681538, 161347084, 160836697, 160230579, 160077896, 159596395, 159187508, 159103174, 158857288, 157978783, 157369576, 157654314, 157597389, 157285147, 156657820, 156383629, 156748848, 156566610, 155722742, 154632530, 154214640, 154584684, 154605789, 153677149, 152928715, 153067017, 153257551, 152907209, 152072763, 151517515, 151265821, 150928698, 150570774, 150370274, 150361691, 150471334, 150200529, 149395313, 148701754, 148095121, 147947178, 147856646, 147545338, 147567368, 147267904, 146833820, 146758366, 146885843, 146414270, 145612144, 145317621, 145518332, 145802279, 145331545, 145078459, 144952936, 144533920, 144449339, 144328136, 144317265, 143964958, 143342810, 142972403, 143110981, 143042603, 142617722, 142830763, 142454691, 141749067, 141640577, 141754141, 141611013]
3300.1A41611013j75809K71129l95164k59171J39713m22573l35989l0956r6979k03133
3309.7A40102081k29368p67488m44765j11161k50454J36824k83804k82516K4671k03552
3319.4A37690468p19662p22017j0758j29385n6810J22128k73409m70534j65720j36289
3329A35128012l46661q6689m87642n41725P543m23422j003465m13733J36423j48992
3338.7A31819649n2920l96604m33150j83839o41375n40123j73473J44424J01242J00651
3348.3A29744482j72243m13771J34707k68297l87183j07965l69387k58894k85787q0357
3357.9A27535305J51758K61660M88291l30830q42972J6785J35412k03209q3704j21870
3367.6A27006626j21469P9794O2227l72944j95875M5051k09951k29654j91822K1781
$$ y = [141611013, 141435204, 141706333, 141311169, 141051998, 141191711, 140769138, 140433149, 140402193, 140305214, 140102081, 139872713, 139105225, 138660460, 138549299, 138298845, 138435669, 138151865, 137869349, 137894020, 137690468, 136970806, 136248789, 136238031, 136108646, 136051836, 136173964, 135900555, 135430021, 135264301, 135128012, 134781351, 134694662, 134207020, 133665295, 133672838, 133249416, 132245951, 131832218, 131968641, 131819649, 131766729, 131370125, 130936975, 130753136, 130111761, 129571638, 129398165, 129542589, 129643831, 129744482, 129572239, 129158468, 129293175, 129024878, 128637695, 128529730, 128160343, 127901449, 127615662, 127535305, 127687063, 127948723, 128437014, 128106184, 127263212, 127279997, 127415409, 127212200, 127128496, 127006626, 126885157, 126964951, 127027178, 126654234, 126458359, 126503410, 126293459, 126063805, 125871983, 125893764]
3377.2A25893764j65739j53503j34315k35987M87413K56739R82L31984j45722o34279
3386.9A25501337m88357M41780N49497o52094n24883N22022k66952r26934J27383P36332
3396.5A25019131M18806J1606m9219j50604J06859N00831M5910q6498N6372j21241
3406.2A25751953j02491n0679j63450k46229k91901J13707P07245M34780j69611k94685
3415.8A25688639K32687L25899n9834K73810K89278l14026n09768L07923Q90732M05588
3425.5A27530928L5209J74637L58477k36521L8776M84791p7753J09596L64294Q56886
3435.1A29639320M93508j64099M77819J71633m74176k37608M64468L44200k8801M33722
3444.7A31119986L62968L6669J51329R24167N70345l21464K34814N85422J52454o0930
$$ y = [125893764, 125728025, 125574522, 125440207, 125204220, 125691633, 125948372, 125949354, 126281338, 126135616, 125501337, 125012980, 125454760, 126004257, 125352163, 124827280, 125349302, 125082350, 124155416, 124282799, 125019131, 125437937, 125449543, 125400324, 125249720, 125356579, 125857410, 125903320, 125816822, 125873194, 125751953, 125649462, 125598783, 125435333, 125189104, 124897203, 125010910, 125718155, 126152935, 125983324, 125688639, 125921326, 126247225, 126187391, 126461201, 126750479, 126436453, 125926685, 126234608, 127125340, 127530928, 127566137, 127740774, 128099251, 127862730, 127901506, 128386297, 128308544, 128418140, 128782434, 129639320, 130132828, 129968729, 130446548, 130618181, 130144005, 129906397, 130370865, 130715065, 130686264, 131119986, 131482954, 131519623, 131670952, 132595119, 133165464, 132844000, 133078814, 133664236, 133816690, 133755760]
3454.4A33755760L02382N33247O17313P07121M99706P80621L96137k74086L03049O71854
3464A38293104J59893K14319R35126N79529J41811M5786j71032M51488P74699N90276
3473.7A42014999M92878L52202Q22735J038999K29454M9114M81110L29208L74642N64670
3483.3A46750011Q76723J074915N13639L35159O85273Q51717M70409M58307J052046
3492A53068199O90165O6328L65057J027155Q02259L80182O28634L62368N50260Q94022
3501.6A58834629N56040N22241J70956O16493Q33435O62442J385574L93333K5521J241932
3511.3A65242596Q26473R07688J050224Q33512Q07037N38998O27021P67098M74815
3520A72075462J83201R62753J526490J031589L87383M36821J387119J033421R04216
$$ y = [133755760, 134058142, 134591389, 135208702, 135915823, 136415529, 137196150, 137592287, 137318201, 137621250, 138293104, 138452997, 138667316, 139602442, 140181971, 140323782, 140369568, 140198536, 140650024, 141424723, 142014999, 142507877, 142860079, 143682814, 144721813, 144951267, 145000381, 145481491, 145810699, 146185341, 146750011, 147626734, 148701649, 149215288, 149550447, 150235720, 151087437, 151557846, 152016153, 153068199, 153758364, 153824692, 154189749, 155216904, 156019163, 156399345, 157027979, 157390347, 157940607, 158834629, 159390669, 159912910, 160083866, 160700359, 161533794, 162196236, 163581810, 163975143, 164000664, 165242596, 166069069, 166976757, 168026981, 168860493, 169667530, 170206528, 170833549, 171600647, 172075462, 172258663, 173221416, 174747906, 175779495, 176166878, 176603699, 177990818, 179024239, 179928455]
3528.6A79928455P00055J35192R39045J021443J066761R93976J194764J232681M02984
3537.3A87615356R00822O56300O33506J320820J069298O73599Q77381J071281J007080
3546A95825443J214619Q37154J187802R15851J374932K061901j47362K75669J367893
3554.7B04913902J920224J964950J300678J889420J434231Q66069Q39806J514092R56726
3563.4B17600098L91121J609554K34470K142353J923428R28192K369938J058864J395474
3572B29653492J733532J413479J314106J305218J494827J323776K169628J328449J256409
3580.7B42992916K072373J762237J585999J339511K546216J895141L63808J313076
3588.4B55871277J346950K064038J895237K335167J652565J563167K451992Q75187
$$ y = [179928455, 180628510, 180763702, 181702747, 182724190, 183790951, 184784927, 185979691, 187212372, 187615356, 188516178, 189172478, 189805984, 191126804, 192196102, 192869701, 193747082, 194818363, 195825443, 197040062, 197877216, 199065018, 199980869, 201355801, 203417702, 203270340, 203546009, 204913902, 206834126, 208799076, 210099754, 211989174, 213423405, 214289474, 215129280, 216643372, 217600098, 217991219, 219600773, 219835243, 221977596, 223901024, 224829216, 227199154, 228258018, 229653492, 231387024, 232800503, 234114609, 235419827, 236914654, 238238430, 240408058, 241736507, 242992916, 245065289, 246827526, 248413525, 249753036, 252299252, 254194393, 254558201, 255871277, 257218227, 259282265, 261177502, 263512669, 265165234, 266728401, 269180393, 270055580]
3596.1B70055580K684364L092289J514187K036400J179104J368046K044754J902466
3603.9B85877190K131195K350940K519093J465435K772999J114654P29428M436054
3611.6C03396988J625881P1049K882118J814957M201355L720035J228962K338486K172813
3620.3C23452644K009468K628365K534027K167091L113442L388405L254623M652519
3628C47200584N88952k673798M622765M555549M265289K428208J402435L379860L740387
3636.6C69510231K931099J639633K993355L622971K729301K641563K530594L602753
3644.4C92201500L842468L947907O36406P85751P180328J774826l70407K294960N444298
3653D17738037N236397L628616M091950j318665M407463N645294K517472K315483J549530
$$ y = [270055580, 272739944, 275832233, 277346420, 279382820, 280561924, 281929970, 283974724, 285877190, 288008385, 290359325, 292878418, 294343853, 297116852, 298231506, 298960934, 303396988, 305022869, 305093918, 307976036, 309790993, 313992348, 317712383, 318941345, 321279831, 323452644, 325462112, 328090477, 330624504, 332791595, 335905037, 339293442, 342548065, 347200584, 347789536, 345115738, 349738503, 354294052, 358559341, 360987549, 362389984, 365769844, 369510231, 372441330, 374080963, 377074318, 380697289, 383426590, 386068153, 388598747, 392201500, 396043968, 399991875, 400628281, 401414032, 408594360, 410369186, 409998779, 412293739, 417738037, 422974434, 426603050, 430695000, 429376335, 433783798, 439429092, 441946564, 444262047, 445811577]
3661.7D45811577L759270K873954K702141L079529K020225M430123K518501J034393
3669.4D68229713J514016j114350M184914O493683O610832o83022r494628L745307
3677.1D79486465P253952M559441M50668K706185K607155J664619J708756J472129
3684.9E01909370J067238L679467O114234n117530q30994O530800l032990Q96149M770889
3693.5E15986633J529122J683044J074410m86412R41543J572952K583123K215881k520027
3702.2E24580269j87988L434791J651955O92711P07626K605743L736420l981361L564720
3710.9E36804886M299774j1024551L174438M681511J128502L31879J711158J806374
3718.6E42913971j540909J334191L524093k327576j850585L851318Q16383o55670m87213
$$ y = [445811577, 449570847, 452444801, 455146942, 458226471, 460246696, 464676819, 467195320, 468229713, 469743729, 468629379, 472814293, 479307976, 485918808, 485235786, 475741158, 479486465, 486740417, 491299858, 491750526, 494456711, 497063866, 498728485, 500437241, 501909370, 502976608, 506656075, 512770309, 507652779, 506821785, 513352585, 510319595, 511215744, 515986633, 517515755, 519198799, 520273209, 519786797, 520728340, 522301292, 524884415, 527100296, 524580269, 524392281, 527827072, 529479027, 530171738, 530879364, 533485107, 537221527, 533240166, 536804886, 541104660, 530080109, 533254547, 537936058, 539064560, 539396439, 541107597, 542913971, 541373062, 542707253, 546231346, 543903770, 542053185, 545904503, 546720886, 546065216, 545578003]
3727.3E45578003J528664L028450L62777L980522j257629n186462P053222j033745
3735E54053802o559143K125283J156501r9372J915359K406349l176613K721062Q162117
3743.7E62705345r928017q385925Q216973M519004L148919n213166n546341J0242501
3751.4E59759293k637749m968910M466896L068886J863441l782120K718315N205155
3759.1E65693207n713845j806144K593117R24415O81496K777595k355880l477021K958718
3767.8E62275658L998031l80134o677513K625236K671471J87607J090431L98903N28984
3776.5E66718674k32277K577820o2600n700035K200280J985549J332970R22966k235641
3785.2E67507706j43738J017647O35338L39126k19269J9646L33710M01001k96517Q58269
$$ y = [545578003, 547106667, 550135117, 550497894, 554478416, 553220787, 548034325, 555087547, 554053802, 547494659, 549619942, 550776443, 550677071, 552592430, 554998779, 551822166, 554543228, 562705345, 552777328, 544391403, 552608376, 557127380, 560276299, 555063133, 549516792, 559759293, 557121544, 552152634, 556619530, 559688416, 561551857, 557769737, 560488052, 565693207, 559979362, 558173218, 560766335, 561690750, 562372246, 565149841, 562793961, 559316940, 562275658, 566273689, 565893555, 559216042, 561841278, 564512749, 564700356, 565790787, 566189690, 566718674, 566486397, 569064217, 569001617, 563301582, 565501862, 567487411, 568820381, 569743347, 567507706, 567363968, 568381615, 569016953, 569356079, 569136810, 569156456, 569490166, 569891167, 569594650, 570452919]
3794.8E70452919K424469k478294k909966J836891K297936K970733m368095n216484
3802.5E65010109L455734J771431K998772K443237q011894r58252M379654J732368
3810.2E72821159M30375J2207k94152P71942L219605j829338r269295M626885M832763
3818.9E75322151K725945k67067j2220726K731209L900337J692314K225685o00319
3826.6E75509529l850021j13869K063866K334518J174011n161934J442833M919396
3834.3E78318329m234772l00827N102425p134896k734603N346641k109413J105423
3842.1E73358307M505310j498795j793251J424370M75426l31192L42026p27120K022667
3850.7E77777748M351616o420860k057610q102531L703499P645797k334442j588707
$$ y = [570452919, 572877388, 570399094, 567489128, 569326019, 571623955, 574594688, 570226593, 565010109, 568465843, 570237274, 573236046, 575679283, 567667389, 566709137, 571088791, 572821159, 573251534, 573263741, 572969589, 573741531, 576961136, 575131798, 565862503, 570489388, 575322151, 578048096, 577781029, 565560303, 568291512, 572191849, 573884163, 576109848, 575509529, 571659508, 571545639, 573609505, 575944023, 577118034, 571956100, 573398933, 578318329, 574083557, 573782730, 578885155, 571750259, 569015656, 574362297, 572252884, 573358307, 577863617, 576364822, 574571571, 575995941, 576471367, 576140175, 576482201, 575755081, 577777748, 582129364, 575708504, 573650894, 565548363, 569251862, 576897659, 574563217, 572974510]
3858.4E72974510K055359J954956J123200l776780J911240L956375n815506k984123
3866.2E71399231L512878L551560L468361o130066o509438L967629M427261R79500
3873.9E78666916p421417J251945L121033o2790K383308L307305n158005n605202M285393
3882.6E74768486J605339J043472K409974r286652J339989L346939J318206L064538
3890.3E79610291j543694n232735J296311K138405p52449N54008J92947J693573J051445
3898.9E79008102p032280L281212m081l389092L707543j762238k77786J62048k14653
3907.6E73478775O89812R56573N97840r14345K47230j58195n58281M92935J018066
3916.3E75850410k203521k187653K617417j40572j345520J811027Q72269o29234k163582
$$ y = [572974510, 575029869, 576984825, 578108025, 574331245, 576242485, 580198860, 574383354, 571399231, 574912109, 578463669, 581932030, 575801964, 569292526, 573260155, 577687416, 578666916, 571245499, 572497444, 575618477, 575555687, 577938995, 581246300, 576088295, 570483093, 574768486, 576373825, 577417297, 579827271, 570540619, 571880608, 575227547, 576545753, 579610291, 578066597, 572833862, 574130173, 576268578, 575516129, 576070137, 576263084, 577956657, 579008102, 571975822, 575257034, 575252953, 571863861, 575571404, 573809166, 573531380, 573693428, 573478775, 574168587, 575125160, 575723000, 574808655, 575055885, 574897690, 574339409, 574832344, 575850410, 573646889, 571459236, 574076653, 573936081, 572590561, 574401588, 575273857, 574644623, 572481041]
3925E72481041p50580J600838J468162M42582j179543n37415P63817j418190l41110
3933.7E72529602J262817K9984j51062m27742j16234k90565k47307J604194L77999
3942.3E74571686l023720o43196J583023R99947K21099j483573j40458L68996j259384
3951E71194420P31239N71900N3672J35270k50779l7956j28746P56950j23939j58653
3960.7E72743378q2817j034165K42806L62320J86195J76430j36528l85971k75574k69394
3970.3E71526680k2469M88472n09224o1073N43060J04218k86522k16865O17828j4649
3980E72169456j92718Q0681n16205o34537k14348j12114J13907P07169N80749L99590
3989.6E72381630n26810l32603O67763K30789j69258q23632l06816N02243L19367p9384
$$ y = [572481041, 571730461, 573331299, 574799461, 575242043, 574062500, 573525085, 574288902, 572870712, 572529602, 573792419, 573822403, 573671341, 573243599, 573127365, 572836800, 572589493, 574193687, 574571686, 571547966, 570904770, 572487793, 573487740, 573708839, 572225266, 572084808, 572453804, 571194420, 571925659, 572497559, 572551231, 572686501, 572435722, 572397766, 572269020, 573025970, 572902031, 572743378, 572660561, 571626396, 571869202, 572231522, 572417717, 572594147, 572457619, 572071648, 571796074, 571526680, 571504211, 571992683, 571483459, 571422386, 571965446, 572069664, 571783142, 571566277, 572184105, 572169456, 571976738, 572057419, 571541214, 570906677, 570692329, 570580215, 570694122, 571401291, 571982040, 572381630, 571854820, 571522217, 572189980, 572420769, 572251511, 571427879, 571121063, 571623306, 571942673, 571863289]
3999.2E71863289l09067
4000.2E71554222
$$ y = [571863289, 571554222]
##END=$$ End of the data block
