##TITLE=$$ Begin of the data block
##JCAMP-DX=5.00 $$ ACD/SpecManager v 10.08
##SPECTROMETER/DATA SYSTEM=Varian
##DATE=15 Jan 2013 15:39:44
##DATA TYPE=INFRARED SPECTRUM
##DATA CLASS=XYDATA
##ORIGIN=
##OWNER=
##NPOINTS=3735
##FIRSTX=399.26403809
##LASTX=4000.35498047
##MAXX=4000.35498047
##MINX=399.26403809
##MAXY=62.40089798
##MINY=12.51551819
##XFACTOR=1.0000000000
##YFACTOR=0.000000100000000
##FIRSTY=27.27045059
##DELTAX=0.96440572
##XUNITS=1/CM
##YUNITS=TRANSMITTANCE
##XYDATA=(X++(Y..Y))
399.3B72704506p535782O987534L571434k405930l113251o607341j882687n062351
$$ 272704506 265168724 272156258 275727692 273321762 270208511 263601170 261718483 256656132
407B56656132J225090J636543j957684M752064j813526j345997k221546N06344M426670
$$ 256656132 257881222 259517765 257560081 262312145 260498619 259152622 256931076 257437420 261864090
415.7B61864090L321381P852020j5074234j3045483J3225975L522263K929268m065762
$$ 261864090 265185471 273037491 257963257 244917774 258143749 261666012 264595280 260529518
423.4B60529518l958073L12558M67281l079605Q20446M670391J422939J829510R10931
$$ 260529518 256571445 256884003 257351284 254271679 255092125 259762516 261185455 263014965 263925896
432.1B63925896q39024j951504k196865j25198Q92944j534958p69157K39620j62906
$$ 263925896 263086872 261135368 258938503 258813305 259706249 258171291 257402134 257641754 257478848
440.7B57478848M649581K306843l149586o140518k986602N780544M182396O18248k45076
$$ 257478848 262128429 264435272 261285686 255145168 252158566 257939110 262121506 262739754 262494678
449.4B62494678j273975m52213m55666J01910M38290j733551o171418j458053M004783
$$ 262494678 261220703 260768490 260312824 260414734 260853024 259119473 252948055 251490002 255494785
458.1B55494785j92775R46559k678241l787308J156464K459983O5251j58100J98230
$$ 255494785 255302010 256248569 253570328 249783020 250939484 253399467 253464718 253306618 253504848
466.8B53504848k144088l21770J488857n77411o29673q59948l603439k759247j04427
$$ 253504848 251360760 251038990 252527847 251950436 251320763 250460815 246857376 244098129 243993702
475.5B43993702L401928J493626N588k493076n619145Q99830K630806J111584p17602
$$ 243993702 247395630 248889256 248894844 246401768 240782623 241682453 244313259 245424843 244707241
484.1B44707241j397133J103153k468338m15096j5354M40102L635864J505260N21412
$$ 244707241 243310108 244413261 241944923 241529827 241514473 241954575 245590439 247095699 247617111
492.8B47617111j236496o04133l27244R13391K006626j261291k483960l252945N51033
$$ 247617111 246380615 245776482 245449238 246362629 248369255 247107964 244624004 241371059 241922092
501.5B41922092J49708j423340Q43182n52387J849861J734943j972999k310944n39989
$$ 241922092 242071800 240648460 241491642 240939255 242789116 244524059 242551060 240240116 239700127
510.2B39700127P90348N05027k39906l070621j105900K264290J183929r97524p39250
$$ 239700127 240490475 240995502 240755596 237684975 236579075 238843365 240027294 239029770 238290520
518.9B38290520j455612k143364k7886P89986m9114j874752j203957p0438r8095M95567
$$ 238290520 236834908 234691544 234663658 235453644 235404530 233529778 232325821 232255383 232157288 232652855
528.5B32652855J60847L54728q27102m30832K56881o45561j416721J22051K740002
$$ 232652855 232813702 233168430 232341328 231910496 232167377 231521816 230105095 230227146 232967148
537.2B32967148M29153R04866n22366l401737m25606l5152J76239k75727n11455j69297
$$ 232967148 233396301 234301167 233778801 230377064 229951458 229916306 230092545 229816818 229305363 229136066
546.8B29136066o56623O96678q8539q40187n86873p80544j068611L76949J096135j56212
$$ 229136066 228479443 229176121 229087582 228247395 227660522 226879978 225811367 226188316 227284451 227128239
556.5B27128239r632k188225k199917J013222J449775J568623J790333l14446j911945
$$ 227128239 227118607 224930382 222730465 223743687 225193462 226762085 228552418 228237972 226326027
565.1B26326027j613407p53689J267529j86921j757583Q8787Q73947J20468j643963
$$ 226326027 224712620 223958931 225226460 225039539 223281956 223370743 224244690 224365158 222721195
573.8B22721195k47955P37095m66576o23073p16134R23844M23088k50568J172657O44035
$$ 222721195 222473240 223210335 222743759 222120686 221404552 222328396 222751484 222500916 223673573 224317608
583.5B24317608L72715j35670q68530O39954Q79955n01824M15345O93893M1466N2452
$$ 224317608 224690323 224554653 223686123 224326077 225206032 224704208 225119553 225813446 225854912 225907364
593.1B25907364M89292J689663N39322J68266M38366n04055N46017k5025p40509J167736
$$ 225907364 226396656 228086319 228625641 228793907 229232273 228728218 229274235 229249210 228508701 229676437
602.8B29676437O61793j360149j242390m77047L33729K60715l17192J20449n75733
$$ 229676437 230338230 228978081 227735691 227258644 227592373 227853088 227535896 227656345 227080612
611.4B27080612o70643M42620O61106L5324p21359o24237j3104Q36678M39338m80232
$$ 227080612 226409969 226852589 227513695 227549019 226827660 226203423 226190319 227026997 227466335 226986103
621.1B26986103m68330M66499Q40416L46584O74305L60432R18884J339970Q15620J286335
$$ 226986103 226517773 226984272 227824688 228171272 228845577 229206009 230124893 231464863 232280483 233566818
630.7B33566818J392384J057834K09427Q31490J221619Q05606J843605J364861J051350
$$ 233566818 234959202 236017036 236226463 237057953 238279572 239085178 240928783 242293644 243344994
639.4B43344994Q97255l7594N81855J291085J314773P10469K05650O55937J148014
$$ 243344994 244242249 244204655 244786510 246077595 247392368 248102837 248308487 248964424 250112438
648.1B50112438J173916J217671K08950J84879J510315O56414Q4534l88546K8438J153183
$$ 250112438 251286354 252504025 252712975 252897854 254408169 255064583 255149117 254760571 254789009 255942192
657.7B55942192k5711k84004K08301M5567j096516n65433M89197J84688L45612j18523
$$ 255942192 255916481 255632477 255840778 255886345 254789829 254224396 254713593 254898281 255243893 255125370
667.4B55125370O379662o05202l781929j367798L70998J272889N10749J377144J687527
$$ 255125370 261505032 260899830 257117901 255750103 256121101 257393990 257904739 259281883 260969410
676.1B60969410J260929J933460L03421O1646O18229J146278N75142O86131J684131
$$ 260969410 262230339 264163799 264467220 264528866 265147095 266293373 266868515 267554646 269238777
684.7B69238777J43337J155987K387009P75452r88408o56986N77259Q59699O63262
$$ 269238777 269382114 270538101 272925110 273700562 272712154 272055168 272632427 273492126 274155388
693.4B74155388m07505j60618O61049J058102l9807m00905J050834J182595J460971
$$ 274155388 273747883 273587265 274248314 275306416 275266609 274865704 275916538 277099133 278560104
702.1B78560104L60928p25M97894P12262J540012O39515N85422O80943Q47568N28298
$$ 278560104 278921032 278920307 279418201 280130463 281670475 282309990 282895412 283576355 284423923 284952221
711.7B84952221J47514J283837J427230J086083j09139L6908O45923R05819J465893
$$ 284952221 285099735 286383572 287810802 288896885 288787746 288824654 289470577 290376396 291842289
720.4B91842289M85153j16024K15435J282139P14874L86429L13244K96078J347274
$$ 291842289 292327442 292211418 292426853 293708992 294423866 294810295 295123539 295419617 296766891
729.1B96766891O34614R87472P85351M43058N27668N92689J015931j46409L63141O19239
$$ 296766891 297401505 298388977 299174328 299617386 300145054 300737743 301753674 301607265 301970406 302589645
738.7C02589645O74630Q9683L6774J255398L96270N41993K12478J71356M38500Q86707
$$ 302589645 303264275 303353958 303390732 304646130 305042400 305584393 305796871 305968227 306406727 307293434
748.4C07293434L29704n15689J495781R99507L97320j52664J022854K208347J64662
$$ 307293434 307623138 307107449 308603230 309602737 310000057 309847393 310870247 313078594 313243256
757.1C13243256R31358R43870J902962J979428Q6097N10197P98225O35033J77879J318779
$$ 313243256 314174614 315118484 317021446 319000874 319086971 319597168 320395393 321030426 321208305 322527084
766.7C22527084Q20122j65520k5711L29476K84767q31871M59823J07422J39542L87535
$$ 322527084 323347206 323181686 323155975 323485451 323770218 322938347 323398170 323505592 323645134 324032669
776.4C24032669K49634Q95080j22871M81300l95774m13247k0256j20239Q29048L35121
$$ 324032669 324282303 325177383 325054512 325535812 325140038 324726791 324706535 324586296 325415344 325750465
786C25750465J059342O42624M11453K212J77842R88121p20444r85298l93105K93160
$$ 325750465 326809807 327452431 327863884 327866096 328043938 329032059 328311615 327326317 326933212 327226372
795.6C27226372J6937l70254j605340j833114m88892j668739j471272j186065j640225
$$ 327226372 327243309 326873055 325267715 323434601 322945709 321276970 319805698 318619633 316979408
804.3C16979408k086067j496696j113053k068977j982117k193813j437283j937065
$$ 316979408 314893341 313396645 312283592 310214615 308232498 306038685 304601402 302664337
812C02664337j626625p97291j738052j881046j418591N33028k87190r42726J86958
$$ 302664337 301037712 300240421 298502369 296621323 295202732 295735760 295448570 294505844 294692802
820.7B94692802L65143M34876k46182R54857Q14705N49889J632862K224159J988430
$$ 294692802 295057945 295492821 295246639 296201496 297016201 297566090 299198952 301423111 303411541
829.4C03411541Q58631K114010K552128K823219K556229K001705K247353J049175R41467
$$ 303411541 304270172 306384182 308936310 311759529 314315758 316317463 318564816 319613991 320555458
838.1C20555458K035790M244003K723045J531372K461434J172905J276016J539268
$$ 320555458 322591248 326835251 329558296 331089668 333551102 334724007 336000023 337539291
845.8C37539291K261124J460342J856499J784630J564026L469162J957931K958336
$$ 337539291 339800415 341260757 343117256 344901886 346465912 349935074 351893005 354851341
853.5C54851341K196732M47349J756325K386551K624130J844406K273026J207123K073822
$$ 354851341 357048073 357495422 359251747 361638298 364262428 366106834 368379860 369586983 371660805
862.2C71660805K438011N24330K14119k71759O69746K99340K71682j077041k759323
$$ 371660805 374098816 374623146 374837265 374565506 375235252 375534592 375806274 374729233 371969910
870.9C71969910k120133j411171q59718q33588J20125j032524n63774Q02078K2774
$$ 371969910 369849777 368438606 367578888 366745300 366865425 365832901 365269127 366071205 366093979
879.5C66093979p25517j058197m44794j716461n09682j46904j123772J74752n3292
$$ 366093979 365368462 364310265 363865471 362149010 361639328 361492424 360368652 360543404 360490112
888.2C60490112m61616o62384l9711p75223m55437J17264n2833P52792k50893K39220
$$ 360490112 360028496 359366112 359326401 358551178 358095741 358213005 358160172 358912964 358662071 358901291
897.9C58901291k10762j93558p1869n01365N68237j15776L21579P06177J540374J388474
$$ 358901291 358690529 358496971 358425102 357923737 358491974 358376198 358697777 359403954 360944328 362332802
907.5C62332802Q21991Q90960l35884K58294m44031o13518p29828j210213j679992
$$ 362332802 363154793 364045753 363709869 363968163 363524132 362910614 362180786 360970573 359290581
916.2C59290581k361794j479988k337379k201767k200737k373658k602500k400589
$$ 359290581 356928787 355448799 353111420 350909653 348708916 346335258 343732758 341332169
923.9C41332169j376496l483887l844795k757339j960678j812249k385864k294884
$$ 341332169 339955673 336471786 332626991 329869652 327908974 326096725 323710861 321415977
931.6C21415977j955966n41077m46034r20753j476441j452789r56440r49936m70257
$$ 321415977 319460011 318918934 318472900 317552147 316075706 314622917 313666477 312716541 312246284
940.3C12246284j250934j404457r63707o19736j075134j798001j607456j609993q64315
$$ 312246284 310995350 309590893 308627186 308007450 306932316 305134315 303526859 301916866 301052551
949C01052551r18579p21702j067162j410446o18000j397476k116070l113747l043728
$$ 301052551 300133972 299412270 298345108 296934662 296316662 294919186 292803116 289689369 286645641
957.7B86645641k105064j864147j760845k103672k377606k321663j637745j887512
$$ 286645641 284540577 282676430 280915585 278811913 276434307 274112644 272474899 270587387
965.4B70587387k198658k056751j733246j555729j871967j180535j891803k623635
$$ 270587387 268388729 266331978 264598732 263043003 261171036 259990501 258098698 255475063
973.1B55475063k092456k553082k983112k486744k127323k866536l049488k767048
$$ 255475063 253382607 250829525 247846413 245359669 243232346 240365810 237316322 234549274
980.8B34549274l017215l641262l507176k942104l626804l877030l203678l068066
$$ 234549274 231532059 227890797 224383621 221441517 217814713 213937683 210734005 207665939
988.5B07665939l401165l530368l726540l521271k981834l124771l481980k896614
$$ 207665939 204264774 200734406 197007866 193486595 190504761 187379990 183898010 181001396
996.2A81001396k437973k820091k474079k206326j944332j881618j962281j874923
$$ 181001396 178563423 175743332 173269253 171062927 169118595 167236977 165274696 163399773
1004A63399773j704903r54990n87597l14083j203986j350164n65796j024456j270237
$$ 163399773 161694870 160739880 160152283 159838200 158634214 157284050 156718254 155693798 154423561
1012.6A54423561j021185r12742j614848r63039q80966j955013j935654j711731r61590
$$ 154423561 153402376 152489634 150874786 149911747 149030781 147075768 145140114 143428383 142466793
1021.3A42466793j149349j477184j742611r11370j119079k287340j096077j064806
$$ 142466793 141317444 139840260 138097649 137186279 136067200 133779860 132683783 131618977
1029A31618977m47178o40850j000376p53660j109782n18970k56338J179333N69982
$$ 131618977 131171799 130530949 129530573 128776913 127667131 127148161 126891823 128071156 128641138
1037.7A28641138R92880J571522K91195P67927J14565J68066N36117J145897l8166
$$ 128641138 129634018 131205540 131496735 132264662 132379227 132547293 133083410 134229307 134191141
1046.4A34191141p11193L41530l15609M45366o25458p03268n4321o26173n35374k43902
$$ 134191141 133479948 133821478 133505869 133951235 133325777 132622509 132568188 131942015 131406641 131162739
1056A31162739O65540k70872R61314Q47931N0878J016970J221180K224750J315832
$$ 131162739 131828279 131557407 132518721 133366652 133417530 134434500 135655680 137880430 139196262
1064.7A39196262J381207J411486J705703J646614N88999J062851M04816P44667O03876
$$ 139196262 140577469 141988955 143694658 145341272 145930271 146993122 147397938 148142605 148746481
1073.4A48746481M92449O00576Q03156J361094Q56990J532412O22807M03108P79343
$$ 148746481 149238930 149839506 150642662 152003756 152860746 154393158 155015965 155419073 156198416
1082.1A56198416P42903J043071O52600J547107J667004J381435L11013O17046J739635
$$ 156198416 156941319 157984390 158636990 160184097 161851101 163232536 163543549 164160595 165900230
1090.7A65900230Q92067J705132K349892J145362N03960J248398P17373J000252J836128
$$ 165900230 166792297 168497429 170847321 171992683 172496643 173745041 174462414 175462666 177298794
1099.4A77298794N03959R46885J814708J681347J411095J271381L44525q9569O45713
$$ 177298794 177802753 178749638 180564346 182245693 183656788 184928169 185272694 185183125 185828838
1108.1A85828838j05552K43606N28336P60612R77993m5395N66063O09207N46551Q65498
$$ 185828838 185723286 185966892 186495228 187255840 188233833 188188438 188754501 189363708 189910259 190775757
1117.7A90775757L21884j97735M8180K75230l11699L10250L95298N85022J254711R91726
$$ 190775757 191097641 190899906 190948086 191223316 190911617 191221867 191617165 192202187 193456898 194448624
1127.4A94448624J266918J288853R91230Q25576J226597J419125J175823R13506J045150
$$ 194448624 195715542 197004395 197995625 198821201 200047798 201466923 202642746 203556252 204601402
1136.1B04601402K182102K007313J128731Q59795P71656J073608Q98018Q34808J078739
$$ 204601402 206783504 208790817 209919548 210779343 211550999 212624607 213522625 214357433 215436172
1144.8B15436172M69380j01681L8204J80474L92456K86464j09577o8588l82061l24287
$$ 215436172 215905552 215803871 215842075 216022549 216415005 216701469 216591892 216523304 216141243 215816956
1154.4B15816956j34316j92738k06565r80854q45623p01294o44913n15j87473L6335
$$ 215816956 215682640 215489902 215283337 214302483 213456860 212755566 212110653 212110138 211922665 211959000
1164B11959000M03175N21488R94988J603012J833286J678715J603279J795540K144394
$$ 211959000 212362175 212883663 213878651 215481663 217314949 218993664 220596943 222392483 224536877
1172.7B24536877K141208K053833K227078K107391K191239K365436K349987K237778
$$ 224536877 226678085 228731918 230958996 233066387 235257626 237623062 239973049 242210827
1180.4B42210827J348324Q32958J154137J588172J414834J030597N68447J04828N0907
$$ 242210827 243559151 244392109 245546246 247134418 248549252 249579849 250148296 250253124 250304031
1189.1B50304031J698R2850n22213p89852r01852q17356n79338j156998j485004j689663
$$ 250304031 250305729 250398579 249876366 249086514 248184662 247367306 246787968 245630970 244145966 242456303
1198.8B42456303j242047j488628j472416j183186j518344j034031j390076j426220
$$ 242456303 241214256 239725628 238253212 237070026 235551682 234517651 233127575 231701355
1206.5B31701355j041660j121884j066303r24988m45900j93367k60143n08003k19269
$$ 231701355 230659695 229537811 228471508 227546520 227100620 226907253 226647110 226139107 225919838
1215.1B25919838o8665k50167p1450r7103J45836J67751k2163j62487l04852j3904
$$ 225919838 225851173 225601006 225529556 225432453 225578289 225746040 225723877 225561390 225256538 225242634
1224.8B25242634R5062j83430o44722o97822n77603m41932j35327k14653n64098m97360
$$ 225242634 225337696 225154266 224509544 223811722 223234119 222792187 222656860 222442207 221878109 221380749
1234.4B21380749j9207k82040p39136m54979j83715k47326k56501j72538k53697k90546
$$ 221380749 221361542 221079502 220340366 219885387 219701672 219454346 219197845 219025307 218771610 218481064
1244.1B18481064m23374o28643m85459m80060m27132j27583l54709j93520m1599m35829
$$ 218481064 218057690 217429047 216943588 216463528 216036396 215908813 215554104 215360584 215318985 214883156
1253.7B14883156j42250l05310m95567j30138L0613Q0356p7476J56536J43547M4918
$$ 214883156 214740906 214435596 213940029 213809891 213840504 213920860 213843384 213999920 214143467 214188385
1263.4B14188385N81551P62558J52473L87383J131668Q04405O50005Q18119J120014
$$ 214188385 214769936 215532494 215684967 216072350 217204018 218008423 218658428 219476547 220596561
1272B20596561P99485K13585Q40358J076680R82837J358414J365833J199551R74274
$$ 220596561 221396046 221609631 222449989 223526669 224509506 225867920 227233753 228433304 229407578
1280.7B29407578R97085J475086J457291J401081J683579J578540J421032J511174
$$ 229407578 230404663 231879749 233337040 234738121 236421700 238000240 239421272 240932446
1288.4B40932446J471691J274128J174507R37195R94758P45392P97462J401883J179371
$$ 240932446 242404137 243678265 244852772 245789967 246784725 247530117 248327579 249729462 250908833
1297.1B50908833J075325P69958J88370j5526K81887K36473K84405N41878O0863K90661
$$ 250908833 251984158 252754116 252942486 252926960 253208847 253445320 253729725 254271603 254332466 254623127
1306.8B54623127J54667M3392k01073n78975o7463m82941n45597J36147M97913k9945
$$ 254623127 254777794 254821186 254620113 254041138 253973675 253490734 252945137 253081284 253579197 253549252
1316.4B53549252p6180M20876N14927J247997N55458L5705K40174N15213O90975K02923
$$ 253549252 253473072 253893948 254408875 255656872 256212330 256248035 256488209 257003422 257694397 257897320
1326B57897320L88527M93278L11089n04818o12831n42317p14512l11241k57168J83258
$$ 257897320 258285847 258779125 259090214 258585396 257972565 257430248 256715736 256404495 256147327 256330585
1335.7B56330585l40309l43189k00806o43367K5692M37946R69181K15836Q4343M56638
$$ 256330585 255990276 255647087 255446281 254802914 254828606 255266552 256235733 256451569 256535912 256992550
1345.3B56992550L49083M95376j40533r7275l43151n4607j59912m33445j68209m66233
$$ 256992550 257341633 257837009 257696476 257599201 257256050 257201443 257041531 256608086 256439877 255973644
1355B55973644j63402n36824l34320m64534l84522j81312p08676j90124j069279o14567
$$ 255973644 255810242 255273418 254939098 254474564 254090042 253908730 253200054 253009930 251940651 251326084
1364.6B51326084l75099m18453m68655j065273p04479n67170q8863k57359m12139m67587
$$ 251326084 250950985 250532532 250063877 248998604 248294125 247726955 247638092 247380733 246968594 246501007
1374.3B46501007j03798J32809r36871o64100k66343o4010m13284n81894n14107j147556
$$ 246501007 246397209 246530018 245593147 244929047 244662704 244598694 244185410 243603516 243089409 241941853
1383.9B41941853q33283o73733o29177j626415o23455n7125j079369r60560j049804
$$ 241941853 241108570 240434837 239805660 238179245 237555790 237498665 236419296 235458736 234408932
1392.6B34408932r11598j508542j723518p94220j210098j504097j512451l68214p94201
$$ 234408932 233497334 231988792 230265274 229471054 228260956 226756859 225244408 224876194 224081993
1401.3B24081993j531105j607208j119862j282844j333027m92707j021060j272240
$$ 224081993 222550888 220943680 219823818 218540974 217207947 216715240 215694180 214421940
1409B14421940j164169j198197p50370o04534p32727p29561m66156o01463l56236Q9417
$$ 214421940 213257771 212059574 211309204 210704670 209971943 209242382 208776226 208174763 207818527 207907944
1418.6B07907944q73337n9300N00985J82743k73571n38178L19462L15666L29399P98397
$$ 207907944 207034607 206975307 207476292 207659035 207385464 206847286 207166748 207482414 207811813 208610210
1428.3B08610210M19999J01509M18281J025028O38772J92260R03244O51551L25985
$$ 208610210 209030209 209131718 209549999 210575027 211213799 211406059 212309303 212960854 213286839
1437B13286839Q10966J040115J004143O17504N61505N39970N46360L63750N30758L73764
$$ 213286839 214097805 215137920 216142063 216759567 217321072 217861042 218407402 218771152 219301910 219675674
1446.6B19675674j82342K34394J087341O49720K07519O05164L56273M17538M04587
$$ 219675674 219493332 219727726 220815067 221464787 221672306 222277470 222633743 223051281 223455868
1455.3B23455868L74508m97151Q09956J846332N32399J364307J052361J334018J355992
$$ 223455868 223830376 223333225 224143181 225989513 226521912 227886219 228938580 230272598 231628590
1464B31628590l2292J699162J579036K031785K146244K408466K473488K357597K974968
$$ 231628590 231596298 233295460 234874496 236906281 239052525 241460991 243934479 246292076 249267044
1472.6B49267044J508007L078060K788239K489738K521897K470321K127476J788235
$$ 249267044 250775051 253853111 256641350 259131088 261652985 264123306 266250782 268039017
1480.3B68039017J569767J405105J641407J389695J403579J202812N7106o20861Q06103
$$ 268039017 269608784 271013889 272655296 274044991 275448570 276651382 276708488 276087627 276893730
1489B76893730O2199l22628K02102l46431r57547j361713q88557l905621j400185k315521
$$ 276893730 276955929 276633301 276835403 276488972 275531425 274169712 273281155 269375534 267975349 265659828
1498.7B65659828k607269m18835j464863j205749j435528r5596J56708k110005m446697
$$ 265659828 263052559 262633724 261168861 259963112 258527584 258431988 258588696 256478691 252031994
1507.3B52031994o26030J939526l51658M87022r29718j485996k77863r95979k88372
$$ 252031994 251405964 253345490 252993832 253480854 252551136 251065140 250787277 249791298 249502926
1516B49502926j715374q58479O68087J028157m72870k763825J133442Q93269R63707
$$ 249502926 247787552 246929073 247597160 248625317 248152447 245388622 246522064 247415333 248379040
1524.7B48379040Q1310J393662O45275K50950R00421J53427M56257K41241j38912k14520
$$ 248379040 248460350 249854012 250499287 250750237 251650658 251804085 252260342 252501583 252362671 252148151
1534.3B52148151J496945J055050L41549K70214m564991J369934L066788J687850P04632
$$ 252148151 253645096 254700146 255041695 255311909 250746918 252116852 255183640 256871490 257576122
1543B57576122L33023J002083N27554J269855K87781N60017M49352J60217R84173M33064
$$ 257576122 257909145 258911228 259438782 260708637 260996418 261556435 262005787 262166004 263150177 263583241
1552.7B63583241P18441j602364M42238R59015j84555k00539k902908P20768k52457
$$ 263583241 264301682 262699318 263141556 264100571 263916016 263715477 260812569 261533337 261280880
1561.4B61280880M19579p31526o32076j755123j416436k34165j508083j399574o191216
$$ 261280880 261700459 260968933 260336857 258581734 257165298 256931133 255423050 254023476 247832260
1570B47832260m17728o96945k059212j918392k440567q24356p746678r17225k204780
$$ 247832260 247414532 246717587 244658375 242739983 240299416 239475060 231728382 230811157 228606377
1578.7B28606377k925625k669029l614846k188453l978405k269287l356781k879544
$$ 228606377 225680752 223011723 219396877 217208424 213230019 210960732 207603951 204724407
1586.4B04724407k879543l902969k476159m127178k052040l349457k013797k519494
$$ 204724407 201844864 197941895 195465736 191338558 189286518 185937061 183923264 181403770
1594.1A81403770l497715k044963l177681j483860l586445j665993k276916k021637
$$ 181403770 177906055 175861092 172683411 171199551 167613106 165947113 163670197 161648560
1601.9A61648560j449414l239631q62446k343607n40772k260542j159343j254206k467222
$$ 161648560 160199146 156959515 156097069 153753462 153212690 150952148 149792805 148538599 146071377
1610.5A46071377K16541j663790J20554j848640r9268m41122m016161K045717o72006
$$ 146071377 146287918 144624128 144744682 142896042 142796774 142355652 138339491 140385208 139713202
1619.2A39713202Q06980j225434P19548n18380j353664J674395j20326J732417j249810
$$ 139713202 140520182 139294748 140014296 139495916 138142252 139816647 139696321 141428738 140178928
1627.9A40178928P90711K29387N33867J054573P2269J679688o06861K397737j197900
$$ 140178928 140969639 141199026 141732893 142787466 142859735 144539423 143932562 146330299 145132399
1636.6A45132399J541986J550694N82609J095104j72100J994972R5282J658735J208534
$$ 145132399 146674385 148225079 148807688 149902792 149730692 151725664 151820946 153479681 154688215
1645.3A54688215j93462K541923j577768K299595K96688J818323P42407p96938K824812
$$ 154688215 154494753 157036676 155458908 157758503 158055191 159873514 160615921 159818983 162643795
1653.9A62643795j479321K238274K17476J757030O97556J679878J533032O94542K047138
$$ 162643795 161164474 163402748 163620224 165377254 166074810 167754688 169287720 169982262 172029400
1662.6A72029400J98269L250503J308976K149734K273922J429558K312584R59892L824253
$$ 172029400 172227669 175478172 176787148 178936882 181210804 182640362 184952946 185912838 189737091
1671.3A89737091J433163L306179K560711K510719L760567K274914L512535K031326
$$ 189737091 191170254 194476433 197037144 199547863 203308430 205583344 209095879 211127205
1679B11127205L703823K641315L867074M219074J12571N114575K854290N467472L661613
$$ 211127205 214831028 217472343 221339417 225558491 225671062 230785637 233639927 239107399 242769012
1687.7B42769012M397450M490833L726216M521026L737164M709968L776512M648343
$$ 242769012 247166462 251657295 255383511 259904537 263641701 268351669 272128181 276776524
1695.4B76776524M904975M521657M773941M468975O205635J359920O032887M525299
$$ 276776524 281681499 286203156 290977097 295446072 301651707 303011627 309044514 313569813
1703.1C13569813M361744M133682L957138M310951L458328M526864L208847K665825
$$ 313569813 317931557 322065239 326022377 330333328 333791656 338318520 341527367 344193192
1710.8C44193192L314895L523026L587722J899300J978912K837296J975136J62201
$$ 344193192 347508087 351031113 354618835 356518135 358497047 361334343 363309479 363471680
1718.5C63471680M024238L079987K201843K409706J609268J624108K351341K454033
$$ 363471680 367495918 370575905 372777748 375187454 376796722 378420830 380772171 383226204
1726.3C83226204J855354K083473K718430J374550J348076K979774K718353p49931
$$ 383226204 385081558 387165031 389883461 391258011 392606087 395585861 398304214 397554283
1734C97554283j04217M471168L767700K525025L119240J706161O11839M568024L394737
$$ 397554283 397450066 401921234 405688934 408213959 411333199 413039360 413651199 418219223 421613960
1742.7D21613960K048531L263321M297371M070854K853699L403892K776985N121994
$$ 421613960 423662491 426925812 431223183 435294037 438147736 441551628 444328613 449450607
1750.4D49450607L655014K951851N287628L898049M639091L923950J926804L260727
$$ 449450607 453105621 456057472 461345100 465243149 469882240 473806190 475732994 478993721
1758.1D78993721L529549L739814L903237J191597J667595M069977K894439K455521
$$ 478993721 482523270 486263084 490166321 491357918 493025513 497095490 499989929 502445450
1765.8E02445450K650490K196884n91355K964020M862442P91664p44857Q38890M756431
$$ 502445450 505095940 507292824 506701469 509665489 514527931 515319595 514574738 515413628 520170059
1774.5E20170059K587929O2904K731476J087914J848411J267395N73044K108269K037391
$$ 520170059 522757988 522820892 525552368 526640282 528488693 529756088 530329132 532437401 534474792
1783.2E34474792K163697M74472J216163J903115J270752J019363K190323J577873
$$ 534474792 536638489 537112961 538329124 540232239 541502991 542522354 544712677 546290550
1790.9E46290550N31693k8725M39568L671646J233444R9258J916047J893157Q93517
$$ 546290550 546822243 546793518 547233086 550904732 552138176 552237434 554153481 556046638 556940155
1799.5E56940155O0997K841568Q39539J148796J897964Q26073J342239Q27446J106911
$$ 556940155 557001152 559842720 560682259 561831055 563729019 564555092 565897331 566724777 567831688
1808.2E67831688J235428J592140p9269J211662J899452N41153J218796M91943J475105
$$ 567831688 569067116 570659256 570579987 571791649 573691101 574232254 575451050 575942993 577418098
1816.9E77418098N54047O43692J145706P34749K014732K38686J226311J301231j428718
$$ 577418098 577972145 578615837 579761543 580496292 582511024 582749710 583976021 585277252 583848534
1825.6E83848534O68869K047691K032433K86674j811523Q97369K666779Q45642L37639
$$ 583848534 584517403 586565094 588597527 588884201 587072678 587970047 590636826 591482468 591820107
1834.3E91820107N63545M14390M81911p6027J575813P67250J236954Q33244P92847
$$ 591820107 592383652 592798042 593279953 593203926 594779739 595546989 596783943 597617187 598410034
1842.9E98410034Q10089m477195K425537K383957N23834J99928P17087J174812l51143
$$ 598410034 599220123 594742928 597168465 599552422 600076256 600276184 600993271 602168083 601816940
1851.6F01816940N79529L58696J255188R85909M2076M39338j03340O34651m997P71408
$$ 601816940 602396469 602755165 604010353 604996262 605038338 605477676 605374336 606008987 606003990 606775398
1861.3F06775398L80745L75900O81725K0638N18035l00865J431847m49448r55353J284256
$$ 606775398 607156143 607532043 608213768 608234406 608752441 608451576 609883423 609433975 608478622 609762878
1870.9F09762878J009713R28878k18162Q11310N11818L17764J63155L40347O63452
$$ 609762878 610772591 611701469 611483307 612294617 612806435 613124199 613287354 613627701 614291153
1879.6F14291153l74870L46870l09944O44684L58467j86196O68335K74239J191597
$$ 614291153 613916283 614263153 613953209 614597893 614956360 614770164 615438499 615712738 616904335
1888.3F16904335m01993j018867O75354Q70247O8168J83106J73416n99404J400452
$$ 616904335 616502342 615483475 616158829 617029076 617097244 617280350 617453766 616854362 618254814
1896.9F18254814N22156N18036N56907l42063j76506o26336N31311J35231M23356K90298
$$ 618254814 618776970 619295006 619851913 619509850 619333344 618707008 619238319 619373550 619796906 620087204
1906.6F20087204K71873O44341j95503J4724k25906R79691L0098J30157M81873m3717
$$ 620087204 620359077 621003418 620807915 620822639 620596733 621576424 621606522 621736679 622218552 622174835
1916.2F22174835J054001j344032k77939O30379L54194K49253j106987k27089M84962
$$ 622174835 623228836 621884804 621606865 622237244 622591438 622840691 621733704 621506615 621991577
1924.9F21991577R66568N9242K96860p5493k23274L90854l02963K98118l58314J86577
$$ 621991577 622958145 623017387 623314247 623238754 623015480 623406334 623103371 623401489 623043175 623229752
1934.6F23229752O1454J57509N60265m88281m6845m40407O17600j99089j073723Q11958
$$ 623229752 623291206 623448715 624008980 623520699 623473854 623033447 623651047 623451958 622378235 623190193
1944.2F23190193L25089j8387k73094P7934m21791r766K11563j411K02560k71492K16332
$$ 623190193 623515282 623496895 623223801 623301735 622879944 622870178 623081741 623080330 623282890 623011398 623227730
1954.8F23227730m45366k40479l17230n4207O63681N5848J38511j37977M04548l38211
$$ 623227730 622782364 622541885 622224655 622170448 622834129 622889977 623028488 622890511 623295059 622956848
1964.5F22956848n65224k9983j77536k1782k86636N11703j30195J48468J99546m19082
$$ 622956848 622391624 622361641 622184105 622162323 621875687 622387390 622257195 622405663 622605209 622186127
1974.1F22186127m4976k51274K38648l42751O0997Q1291k3841J85203k80456R0293
$$ 622186127 622141151 621889877 622128525 621785774 621846771 621928062 621904221 622089424 621808968 621899261
1983.7F21899261o05201k52648k83279r8419r54Q2703Q44917k78168m06494m79469
$$ 621899261 621294060 621041412 620758133 620659714 620658760 620741463 621586380 621308212 620901718 620422249
1993.4F20422249J36833j55220l32260L82385l88718K10038j65367j4954j70288l55950
$$ 620422249 620559082 620403862 620071602 620453987 620065269 620275307 620109940 620094986 619924698 619568748
2003F19568748j40037q66890l3569k84005k39868M3488O01120K18773m89464j2932
$$ 619568748 619428711 618561821 618528252 618244247 618004379 618047867 618648987 618867760 618378296 618365364
2012.7F18365364r97467n70602n66941k05726J04866M692L64647m44832J14632m22860
$$ 618365364 617367897 616797295 616230354 616024628 616129494 616134186 616498833 616054001 616168633 615745773
2022.3F15745773k45437l94440l70827L34397o16455J45263j3923K7618l54385q35419
$$ 615745773 615500336 615105896 614735069 615069466 614453011 614598274 614584351 614611969 614257584 613422165
2032F13422165n27649l18031O32896k96440j5144L8108k74963l65486o15006j53999
$$ 613422165 612894516 612576485 613209381 612912941 612897797 612935905 612660942 612295456 611680450 611526451
2041.6F11526451n77774K33421l11622k33383K57263l4256K76756l19405m3449o57082
$$ 611526451 610948677 611182098 610870476 610637093 610894356 610860100 611136856 610817451 610774002 610116920
2051.2F10116920k06947K480n37415j81999j63727M19998k83889k8191k5711k75345
$$ 610116920 609909973 609912453 609375038 609193039 609029312 609449310 609165421 609137230 609111519 608836174
2060.9F08836174k15073k12173M91638k51121J57280j23024k46239k1897k39181Q7852
$$ 608836174 608621101 608408928 608900566 608649445 608806725 608683701 608437462 608415565 608176384 608264236
2070.5F08264236n88722P7782R2964J0948l6773R8381K06184q14667j73874l60374
$$ 608264236 607675514 607753296 607846260 607857208 607820435 607918816 608125000 607310333 607136459 606776085
2080.2F06776085j50032j2474q2741K45323j21651J70975m39338n56450p57943l16696
$$ 606776085 606626053 606613579 606530838 606776161 606654510 606825485 606386147 605829697 605071754 604755058
2089.8F04755058L4333l15934J87798j25885q3084m57421r4833j57204m69818J8807
$$ 604755058 604789391 604473457 604661255 604535370 604452286 603994865 603900032 603742828 603273010 603291817
2099.5F03291817j27793K2087o23168K18391K02446m30412k74468p07245M7493l72047
$$ 603291817 603164024 603186111 602562943 602781334 602983780 602553368 602278900 601571655 601619148 601247101
2109.1F01247101l85666l4256N4512J2283j51252j59188q73642j83716M1352Q3618
$$ 601247101 600861435 600827179 600881691 600893974 600742722 600583534 599709892 599526176 599567528 599651146
2118.7E99651146l21922k76184L14331j30806J50528p34368m49753J94664L10898k5482
$$ 599651146 599329224 599053040 599367371 599236565 599387093 598652725 598202972 598397636 598708534 598683052
2128.4E98683052r48219j87683Q2130O66542p3280m56886L6621k57378J70174j98861
$$ 598683052 597734833 597547150 597629280 598295822 598222542 597765656 597802277 597544899 597715073 597516212
2138E97516212J33629j02272J22872J06048m91981J1825k32887K19917J05477N9089
$$ 597516212 597649841 597547569 597670441 597776489 597284508 597296333 597063446 597283363 597388840 597447929
2147.7E97447929k71110r346J71051o15387K88353j70479k83432k81944k7962K51350
$$ 597447929 597176819 597167473 597338524 596723137 597011490 596841011 596557579 596275635 596247673 596499023
2157.3E96499023l852O40182k61497p9537l35846l46145O2179j82457M63944P2708
$$ 596499023 596495171 597135353 596873856 596794319 596458473 596112328 596174507 595992050 596455994 596528702
2167E96528702L83720j59645L8033L55415k11906n5924p23915j02158J27449N21737
$$ 596528702 596912422 596752777 596790810 597146225 596934319 596878395 596154480 596052322 596179771 596701508
2176.6E96701508K85606q7700J70555l93944L1624l72047m502q4037N3596N39131k03933
$$ 596701508 596987114 596899414 597069969 596676025 596707649 596335602 596331100 596247063 596300659 596839790 596635857
2187.2E96635857Q049k72522N83229L78875l36113k47650j37024L94402k55699J95122
$$ 596635857 596643906 596371384 596954613 597333488 596997375 596749725 596612701 597007103 596751404 596946526
2196.9E96946526p1831q5831J80664J3275J74065m53110K01264J9989J95961K60887
$$ 596946526 596874695 596788864 596969528 596982803 597156868 596703758 596905022 596925011 597120972 597381859
2206.5E97381859j90849m8790k38572M43192R4528J62773o904j39733K55051J09405
$$ 597381859 597191010 597142220 596903648 597346840 597441368 597604141 597597237 597457504 597712555 597821960
2216.1E97821960J93673n86625k78282r5672J36070J41716L7384O31371J6593j33323
$$ 597821960 598015633 597429008 597150726 597055054 597191124 597332840 597370224 598001595 598018188 597884865
2225.8E97884865n30243j54648J20583J64032K28958l86429K70233R9144L4866l24249
$$ 597884865 597354622 597199974 597320557 597484589 597713547 597327118 597597351 597696495 597731361 597407112
2235.4E97407112k91252N8327k15226K42043j17264M9401m6883L07503K1476m27703
$$ 597407112 597115860 597174187 596958961 597201004 597083740 597133141 597086258 597393761 597415237 596987534
2245.1E96987534R1018o43272J7662J72195J78719k8343o4164L43247l17345K73209
$$ 596987534 597078552 596435280 596452942 596625137 596803856 596775513 596711349 597054596 596737251 597010460
2254.7E97010460m20342l19824N7984k18583K03324l8910K93350J87416L40538p27310
$$ 597010460 596590118 596270294 596328278 596109695 596313019 596274109 596567459 596754875 597095413 596368103
2264.4E96368103p41425L24288J44577K10380m73556M30412J37215m71039j99280l32107
$$ 596368103 595626678 595950966 596095543 596305923 595832367 596262779 596399994 595928955 595729675 595397568
2274E95397568K14691l23677j6670k47193J8921Q2817n13000m998m48265q4838k75612
$$ 595397568 595612259 595288582 595271912 595024719 595043640 595126457 594613457 594608459 594160194 594075356 593799744
2284.6E93799744M615J90621o6643K90299k73514L46374j11274n50805Q126Q4648J70174
$$ 593799744 593804359 593994980 593928337 594218636 593945122 594291496 594180222 593629417 593637543 593722191 593892365
2295.2E93892365K13890M85000j59950k56844j79023J8272M4594J69639N83535q0681
$$ 593892365 594106255 594591255 594431305 594174461 593995438 594013710 594058304 594227943 594811478 594730797
2304.9E94730797j0109n226O09398L11012q3923M27398j71242N24254j2741l17802
$$ 594730797 594720688 594715462 595324860 595635872 595551949 595979347 595808105 596332359 596319618 596001816
2314.5E96001816M21600K87056j23138j58348J050682J148758Q30803k14501o2942
$$ 596001816 596423416 596710472 596587334 596428986 597479668 598628426 599459229 599244728 599181786
2323.2E99181786M33502k93923j81160K94266N46265o29349O68793J043815J27983
$$ 599181786 599615288 599321365 599140205 599434471 599980736 599351387 600020180 601063995 601191978
2331.9F01191978j23672j201057o10886j85547J054611Q5831m01917L3455m25033K29873
$$ 601191978 601068306 599867249 599256363 599070816 600125427 600211258 599809341 599842796 599417763 599647636
2341.5E99647636k24533O14128m74014r06601q56514l024978l499146n34134K554550
$$ 599647636 599423103 600037231 599563217 598656616 597800102 594775124 591275978 590741844 593296394
2350.2E93296394J234742J413688K676392J684494M55513l56674K195243n65681q35762
$$ 593296394 594531136 595944824 598621216 600305710 600761223 600404549 602599792 602034111 601198349
2358.9F01198349M845l50533j35536J58615J645851j550712j845971k224121j274376
$$ 601198349 601203194 600852661 600717125 600875740 602521591 600970879 599124908 596900787 595626411
2367.6E95626411j008834j569710j394463k749061n72777j180153k028580j387939
$$ 595626411 594617577 593047867 591653404 588904343 588331566 587151413 585122833 583734894
2375.3E83734894j211853j309052k037582j354485j177902p95593j199608j151085
$$ 583734894 582523041 581213989 579176407 577821922 576644020 575848427 574648819 573497734
2383E73497734p17087r11827o35605r95407j46065m0626k83852m96635r26972m13627
$$ 573497734 572780647 571868820 571233215 570237808 570091743 570051117 569767265 569270630 568343658 567930031
2392.6E67930031n91088J22414j94473o30036m43687l37257r308o01769m05616o89164
$$ 567930031 567338943 567461357 567266884 566636848 566193161 565855904 565846596 565244827 564839211 564150047
2402.3E64150047l99666l17153m23584p0763n63812k08550k75307j38015o90728o01272
$$ 564150047 563750381 563433228 563009644 562938881 562375069 562166519 561891212 561753197 561062469 560461197
2411.9E60461197j47438o48194l55224r39903k74430j02081k33917l28903r33152j04599
$$ 560461197 560313759 559665565 559310341 558370438 558096008 557993927 557760010 557431107 556497955 556393356
2421.6E56393356o06765n49813l54995l02887k47384l58543K11372m96101o61888r38988
$$ 556393356 555786591 555236778 554881783 554578896 554331512 553972969 554184341 553688240 553026352 552087364
2431.2E52087364o51893j22414m57535n76248o02379q1863m46282k56920m72908q20045
$$ 552087364 551435471 551313057 550855522 550279274 549676895 549595032 549148750 548891830 548418922 547598877
2440.8E47598877k65350l57399m43688p14187l53318m72374k87552m00466q23212n20554
$$ 547598877 547333527 546976128 546532440 545818253 545464935 544992561 544705009 544304543 543481331 542960777
2450.5E42960777q40492j42975l78799n52941k70462n14831m52194p02858m90227p76405
$$ 542960777 542120285 541977310 541598511 541045570 540775108 540260277 539808083 539105225 538614998 537838593
2460.1E37838593l82386n09224o92825m60777q58193k58712o47088m98008j49384n15518
$$ 537838593 537456207 536946983 536254158 535793381 534935188 534676476 534029388 533531380 533381996 532866478
2469.8E32866478o95877n24216k85187r74426m70695k79770l64495p23037r87053m26064
$$ 532866478 532170601 531646385 531361198 530386772 529916077 529636307 529271812 528548775 527561722 527135658
2479.4E27135658m58374q6593o72608p84492p02935m37049k41929q77075l22151p05147
$$ 527135658 526677284 526590691 525918083 525133591 524430656 523993607 523751678 522874603 522552452 521847305
2489.1E21847305n38597p12471q63304l24364p12394l91159p67098n30891o72493q33702
$$ 521847305 521308708 520596237 519732933 519408569 518696175 518305016 517537918 517007027 516334534 515500832
2498.7E15500832o26526q96454l19824o60591n41955n86586l77464n18570j176567
$$ 515500832 514874306 513977852 513658028 512997437 512455482 511868896 511491432 510972862 509796295
2507.4E09796295n81512o70357l57895n58815m45137j06811l26882n11970j080475
$$ 509796295 509214783 508544426 508186531 507627716 507182579 507075768 506748886 506236916 505156441
2516.1E05156441o40412p58819m48876n66291p29294M7188m96674p71790q05854l57514
$$ 505156441 504516029 503757210 503308334 502742043 502012749 502059937 501563263 500791473 499985619 499628105
2525.7D99628105k97813m20151o55289p66334O5460l64342l09181k51846n45388p17926
$$ 499628105 499330292 498910141 498254852 497488518 497553978 497189636 496880455 496628609 496083221 495365295
2535.4D95365295o80122l00674p52678m45214m42962m70925n75103o43158p5722m71954
$$ 495365295 494685173 494384499 493631821 493186607 492743645 492272720 491697617 491054459 490978737 490506783
2545D90506783o64521o86531n09872m78821l70293l70331m39872l76549q28323l21808
$$ 490506783 489842262 489155731 488645859 488167038 487796745 487426414 486986542 486609993 485781670 485459862
2554.6D85459862n31807n68428l03040m65317k79884q08411n23223m48914l57399k56500
$$ 485459862 484928055 484359627 484056587 483591270 483311386 482502975 481979752 481530838 481173439 480916939
2564.3D80916939n88875n75371p21855m06952m10080j35078l84674o68831n06706p16782
$$ 480916939 480328064 479752693 479030838 478623886 478213806 478078728 477694054 477025223 476518517 475801735
2573.9D75801735m94118o83975k44865j80207m41894m15268n38140m04625o46057n75523
$$ 475801735 475307617 474623642 474378777 474198570 473756676 473341408 472803268 472398643 471752586 471177063
2583.6D71177063p37190l13378k86445n80483j61133l76663o07338r91897m54827l03917
$$ 471177063 470439873 470126495 469840050 469259567 469098434 468721771 468114433 467122536 466667709 466363792
2593.2D66363792n50613o96945q44574k5368l37181l72314n96772r07936p32345p17697
$$ 466363792 465813179 465116234 464271660 464246292 463909111 463536797 462940025 462032089 461299744 460582047
2602.9D60582047j17150n51605n90401m60472n05104n16663n92498l55110o69213n06668
$$ 460582047 460464897 459913292 459322891 458862419 458357315 457840652 457248154 456893044 456223831 455717163
2612.5D55717163m90189l63349p02401q06045m70467o38962j24282o64788p82470o44455
$$ 455717163 455226974 454863625 454161224 453355179 452884712 452245750 452121468 451456680 450674210 450029755
2622.1D50029755o66047n09910q31184l06969m08898m78401o49528o43158n85327o87523
$$ 450029755 449363708 448853798 448022614 447715645 447306747 446828346 446178818 445535660 444950333 444262810
2631.8D44262810k01378p56874n19829m25453n97840p45048j132507j29052J08986
$$ 444262810 444061432 443304558 442784729 442359276 441761436 441016388 439883881 439754829 439863815
2640.5D39863815m93126j031074n58853k17629o58760p00455p06863l19366n23911
$$ 439863815 439370689 438339615 437780762 437563133 436904373 436203918 435497055 435177689 434653778
2649.1D34653778m11415l93219n84679l19175k59552k06643r25064p72628l50686m78630
$$ 434653778 434242363 433849144 433264465 432945290 432685738 432479095 431554031 430781403 430430717 429952087
2658.8D29952087n12657k72178K7427m62112m23813p83844p95288l86620n51605m05884
$$ 429952087 429439430 429167252 429194679 428732567 428308754 427524910 426729622 426343002 425791397 425385513
2668.4D25385513m75959j67847p1869k60735n71518l89709m3182k74620j16768m88320
$$ 425385513 424909554 424741707 424669838 424409103 423837585 423447876 423404694 423130074 423013306 422524986
2678.1D22524986n92880m43993l94439m49181m33235l82652p23305k38037n10712n00374
$$ 422524986 421932106 421488113 421093674 420644493 420211258 419828606 419105301 418867264 418356552 417856178
2687.7D17856178k42691n64193k07482l71742j78528k58560m96864m34037l70292j97487
$$ 417856178 417613487 417049294 416841812 416470070 416291542 416032982 415536118 415102081 414731789 414534302
2697.4D14534302o79512o22254l69529j5564M8332m19922o47240l96194j30692o71692
$$ 414534302 413854790 413232536 412863007 412847443 412895775 412475853 411828613 411432419 411301727 410630035
2707D10630035l65829p1793l82347m59518n23644n14068m00849M2763k82974n66025
$$ 410630035 410264206 410192413 409810066 409350548 408826904 408312836 407911987 407954750 407671776 407105751
2716.6D07105751m78668j90392R4643k45781k91367l35426l15132o62117o00891l58544
$$ 407105751 406627083 406436691 406531334 406285553 405994186 405658760 405343628 404681511 404080620 403722076
2726.3D03722076m66423j34163m28657l36227P7095J07612l33252n62401k47879j07154
$$ 403722076 403255653 403121490 402692833 402356606 402433701 402541313 402208061 401645660 401397781 401290627
2735.9D01290627L5476o25648n82962j93634j45684k8572k02865j06011l33366j49918
$$ 401290627 401326103 400700455 400117493 399923859 399778175 399749603 399546738 399440727 399107361 398957443
2745.6C98957443l09143l67279j46637j47781m1580o47049k12632j74522l48015J4916
$$ 398957443 398648300 398281021 398134384 397986603 397945023 397297974 397085342 396910820 396562805 396577721
2755.2C96577721k22626m10652o44036j32865k26365l77235l91769m16565K4337l14064
$$ 396577721 396355095 395944443 395300407 395167542 394941177 394563942 394172173 393755608 393779945 393465881
2764.9C93465881m79583m67263m9400k24113k61193n98945j098786J48201j20201k31934
$$ 393465881 392986298 392519035 392469635 392245522 391984329 391385384 390286598 390434799 390314598 390082664
2774.5C90082664j93405m59480n02205j138725n51300o18401k50168j46827m77677
$$ 390082664 389889259 389429779 388927574 387788849 387237549 386619148 386368980 386222153 385744476
2783.2C85744476k67448r05304l61176k40173n43137n87501n43099m03900o12678k42958
$$ 385744476 385477028 384571724 384210548 383970375 383427238 382839737 382296638 381892738 381280060 381037102
2792.8C81037102n28298n84640n84831o64063l50838p94143j027451n35431l08685
$$ 381037102 380508804 379924164 379339333 378675270 378324432 377530289 376502838 375967407 375658722
2801.5C75658722p44515n73158n52597n79262o31561r70573n62783n99060n24902o46668
$$ 375658722 374914207 374341049 373788452 373209190 372577629 371607056 371044273 370445213 369920311 369273643
2811.2C69273643q30612q75778r17778p22275r79423m32434p17926j172028r61952
$$ 369273643 368443031 367567253 366649475 365927200 364947777 364515343 363797417 362625389 361663437
2819.8C61663437j039581n28489o30989p25059q80928j136513j041985q40034o66656
$$ 361663437 360623856 360095367 359464378 358739319 357858391 356721878 355679893 354839859 354173203
2828.5C54173203p91855p02744j057014j069222j160583j413231j397858j517029j187744
$$ 354173203 353381348 352678604 351621590 350552368 349391785 347978554 346580696 345063667 343875923
2837.2C43875923j297455j550827k178344k157822j906967k444420j959725k143592
$$ 343875923 342578468 341027641 338849297 336691475 334784508 332340088 330380363 328236771
2844.9C28236771k628861k347221k413559k705021k633648k185936j706676j249390
$$ 328236771 325607910 323260689 320847130 318142109 315508461 313322525 311615849 310366459
2852.6C10366459j432858r88140j32904J38874K39029j373N8021K63482N80329L27092
$$ 310366459 308933601 307945461 307812557 307951431 308190460 308189087 308247108 308510590 309090919 309418011
2862.3C09418011l75958n34286m41304n35469j054325r80854n34439n35831p28646
$$ 309418011 309042053 308507767 308066463 307530994 306476669 305495815 304961376 304425545 303696899
2870.9C03696899n14698m21524m80613j94130l92361m33693m53377n69172p65361p11670
$$ 303696899 303182201 302760677 302280064 302085934 301693573 301259880 300806503 300237331 299471970 298760300
2880.6B98760300l17211o28777n49412q62102j226464q68415p18842o99768j095409
$$ 298760300 298443089 297814312 297264900 296402798 295176334 294307919 293589077 292889309 291793900
2889.3B91793900j030865j075497j283378j017113o28376m93641r74064j408119j427632
$$ 291793900 290763035 289687538 288404160 287387047 286758671 286265030 285290966 283882847 282455215
2897.9B82455215o50024p30057j253338q99238p25918p17602j134205r00974p57656
$$ 282455215 281805191 281075134 279821796 278922558 278196640 277479038 276344833 275443859 274686203
2906.6B74686203j365891j183795q64468j434383k045536j657811j515503j712646
$$ 274686203 273320312 272136517 271272049 269837666 267792130 266134319 264618816 262906170
2914.3B62906170k096291k090187j636047j729527j780414k060147j634025j059837
$$ 262906170 260809879 258719692 257083645 255354118 253573704 251513557 249879532 248819695
2922.1B48819695m78058M1465k51236K63005m3469l30353L83759M36382K92549L88241
$$ 248819695 248341637 248383102 248131866 248394871 248351402 248021049 248404808 248841190 249133739 249521980
2931.7B49521980R29394J078301J094913J219273J122741J053696J093559J026116
$$ 249521980 250451374 251529675 252624588 253843861 254966602 256020298 257113857 258139973
2939.4B58139973R96017J212082Q49800Q11386P56741M75426O27040O44989P06940
$$ 258139973 259135990 260348072 261197872 262009258 262765999 263241425 263868465 264513454 265220394
2948.1B65220394N87692K11621l35388M88891R95197K57206K79332l3265M15097O15825
$$ 265220394 265808086 266019707 265684319 266173210 267168407 267425613 267704945 267671680 268086777 268702602
2957.7B68702602L06645P12452O76441O91986P51896J028881J037464R25255R01356
$$ 268702602 269009247 269721699 270398140 271090126 271842022 272870903 273908367 274833622 275734978
2966.4B75734978J134681J385746R65500Q26569Q82263J098480O73218R38072J098919
$$ 275734978 276869659 278255405 279220905 280047474 280929737 282028217 282701435 283639507 284738426
2975.1B84738426K46830N43671M33044Q34904R77077P12967P20311P8621L84616J55716
$$ 284738426 284985256 285528927 285961971 286796875 287773952 288486919 289207230 289285851 289670467 289826183
2984.7B89826183J06545L08380J08871K33365M58774Q31699K00367l3626j45550j64680
$$ 289826183 289932728 290241108 290349979 290583344 291042118 291873817 292074184 292040558 291895008 291730328
2994.4B91730328K97317L34435p2022o22387J91040R1629n70545m23164n18265m63924
$$ 291730328 292027645 292362080 292290058 291667671 291858711 291950340 291379795 290956631 290438366 289974442
3004B89974442k83776j43184o66810k42595Q2931j60293k36264r78660m94938j36051
$$ 289974442 289690666 289547482 288880672 288638077 288721008 288560715 288324451 287345791 286850853 286714802
3013.7B86714802l71704n30453p72419n67551l00693n53227r95407k96840n37148p43637
$$ 286714802 286343098 285812645 285040226 284472675 284171982 283618755 282623348 282326508 281789360 281045723
3023.3B81045723k77824p99237p30037m93737l83110n57937n80464q79421j040668
$$ 281045723 280767899 279968662 279238625 278744888 278361778 277803841 277223377 276343956 275303288
3032B75303288l27206p06196p64046n46341o66618p96833o43024k59171q53176j046810
$$ 275303288 274976082 274269886 273505840 272959499 272292881 271496048 270853024 270593853 269740677 268693867
3041.6B68693867r34773r07326o26945n21450n35564n49012q00132j134415p54681
$$ 268693867 267759094 266851768 266224823 265703373 265167809 264618797 263818665 262684250 261929569
3050.3B61929569o64253n47848m85439q08296o95706m92172n08556j125031j004791
$$ 261929569 261265316 260717468 260232029 259423733 258728027 258235855 257727299 256602268 255597477
3059B55597477n75562o50119n79472m45328l22189o17828m84143p06062j037941m25415
$$ 255597477 255021915 254371796 253792324 253346996 253024807 252406979 251922836 251216774 250178833 249753418
3068.6B49753418j51043o12602j119690p99446m21200j87244n35679o15540j90296
$$ 249753418 249602375 248989773 247870083 247070637 246649437 246462193 245926514 245310974 245120678
3077.3B45120678o60477o17065m62074m04644m50097m79030m93164q37441o32591p21035
$$ 245120678 244460201 243843136 243381062 242976418 242526321 242047291 241554127 240716686 240084095 239363060
3087B39363060j65539K709n69592m75483p32860q89130q97865k53430k30999r58252
$$ 239363060 239197521 239200230 238630638 238155155 237422295 236533165 235635300 235381870 235150871 234192619
3096.6B34192619o58340j82877r5558p01427q60710p04022n01423n9070j80550q05168
$$ 234192619 233534279 233351402 233255844 232554417 231693707 230989685 230488262 230429192 230248642 229443474
3106.2B29443474j132527l91445k46925o81076n66940k93217l76511m96387l68843
$$ 229443474 228310947 227919502 227672577 226991501 226424561 226131344 225754833 225258446 224889603
3114.9B24889603n08614n30815r55124q29182m59690l55415k57893j076259q60901
$$ 224889603 224380989 223850174 222895050 222065868 221606178 221250763 220992870 219916611 219055710
3123.6B19055710o39134m95967j40648m65565m38156r01928p86209k35939k59877j051502
$$ 219055710 218416576 217920609 217779961 217314396 216876240 215974312 215188103 214952164 214692287 213640785
3133.3B13640785j136265k72541o78081m74873k54650m50668o80409j096534n28469
$$ 213640785 212504520 212231979 211553898 211079025 210824375 210373707 209693298 208596764 208068295
3141.9B08068295k05899l67546r00154p06463l90796n30262l28141o15406l99551n66502
$$ 208068295 207862396 207494850 206594696 205888233 205497437 204967175 204639034 204023628 203624077 203057575
3151.6B03057575o85787m41074r65767p78466l22723k63996m84676n65892o49299j026631
$$ 203057575 202371788 201930714 200964947 200186481 199863758 199599762 199115086 198549194 197899895 196873264
3161.2A96873264p90500j60218l70559j039563o63394l41092o21929n93872l91216
$$ 196873264 196082764 195922546 195551987 194512424 193849030 193507938 192886009 192292137 191900921
3169.9A91900921m82044o31314o45656q47626m25968l66059p41577n34286o04611m37011
$$ 191900921 191418877 190787563 190141907 189294281 188868313 188502254 187760677 187226391 186621780 186184769
3179.5A86184769k28234n01842o58875m27608k86884l72506o63070r02462n11570m65737
$$ 186184769 185956535 185454693 184795818 184368210 184081326 183708820 183045750 182143288 181631718 181165981
3189.2A81165981n99441m33827l26252n21698p63816j39866J98860n63603j223144
$$ 181165981 180566540 180132713 179806461 179284763 178520947 178381081 178579941 178016338 176793194
3197.9A76793194p16934j53599k40193l69434n13020n15651p83596m50287J7071l28942
$$ 176793194 176076260 175922661 175682468 175313034 174800014 174284363 173500767 173050480 173067551 172738609
3207.5A72738609n52444n59654m17939n54885k46926j26686n63068m76437n47218m10080
$$ 172738609 172186165 171626511 171208572 170653687 170406761 170280075 169717007 169240570 168693352 168283272
3217.2A68283272l78113l78819j31282j55068k37331p34692r65175l77121K5215m58660
$$ 168283272 167905159 167526340 167395058 167239990 167002659 166267967 165302792 164925671 164950886 164492226
3226.8A64492226n88570j21193l35522o05564r7465M4021m61177k35768n74512j169644
$$ 164492226 163903656 163782463 163446941 162841377 162743912 162787933 162326756 162090988 161516476 160346832
3236.4A60346832m38261R0199j51015n94024l44019j46361m23440j77241l25661q17127
$$ 160346832 159908571 159998770 159847755 159253731 158909712 158763351 158339911 158162670 157837009 157019882
3246.1A57019882k95286J50595m62895m98352m03356n00822J4524L6087l69930n32808
$$ 157019882 156724596 156875191 156412296 155913944 155510588 155009766 155024290 155060377 154690447 154157639
3255.7A54157639l92342n01471l85646k62318m08507k09674l28932k06242m37565n08833
$$ 154157639 153765297 153263826 152878180 152615862 152207355 151997681 151668749 151462507 151024942 150516109
3265.4A50516109j25570k04067m4241l95727l51687p8830k84233l00179j20850k18496
$$ 150516109 150390539 150186472 150142231 149746504 149394817 149315987 149031754 148731575 148610725 148392229
3275A48392229r79776m88053L78847K06156m56438o24275R8638L7852m19302o31285
$$ 148392229 147412453 146924400 147303247 147509403 147052965 146428690 146527328 146565180 146145878 145514593
3284.7A45514593n0230J48211l58477l61404o58055l70884M9629J38894K3260j61934
$$ 145514593 145464363 145612574 145254097 144892693 144234638 143863754 143913383 144052277 144075537 143913603
3294.3A43913603j13774m33673l19472p3805L6765j09349j47733j19620l29094j23310
$$ 143913603 143799829 143366156 143046684 142972879 143009644 142900295 142752562 142632942 142303848 142180538
3303.9A42180538m23889l79333j51988j94778J19476O6376l74823p74049m91038k95715
$$ 142180538 141756649 141377316 141225328 141030550 141150026 141216402 140841579 140067530 139576492 139280777
3313.6A39280777n6992j97992o72464j63632N8670K44580K67238l60861p16934l96061
$$ 139280777 139223785 139025793 138353329 138189697 138248367 138492947 138760185 138399324 137682390 137286329
3323.2A37286329j50261k67639j39208o74705p78113j83315N4798k55270p35912j00832
$$ 137286329 137136068 136868429 136729221 136054516 135276403 135093088 135147886 134892616 134156704 134055872
3332.9A34055872Q4829m70953o49118k33708J55058k96878k34633j15004l85408m18625
$$ 134055872 134140701 133669748 133020630 132786922 132941980 132645102 132410469 132295465 131910057 131491432
3342.5A31491432l92122j63775o2189m87251n64108j62115p7600K19440J44186m69723
$$ 131491432 131099310 130935535 130873346 130386095 129821987 129659872 129582272 129801712 129945898 129476175
3352.2A29476175m86936K49033M60539k25869j27086j36462l95612k99082j83792j32570
$$ 129476175 128989239 129238272 129698811 129472942 129345856 129209394 128813782 128514700 128330908 128198338
3361.8A28198338l31526R565p7448m24776m58746k5244L68128k56290j20583K070k18592
$$ 128198338 127866812 127876377 127798929 127374153 126915407 126890163 127258291 127002001 126881418 126883488 126664896
3372.4A26664896j19781K45742K31142k94380K66190j93434o49118k83213l56350M88834
$$ 126664896 126545115 126790857 127021999 126727619 126993809 126800375 126151257 125868044 125511694 126000528
3382.1A26000528O25935N7735k02207l1166J7700l16868j99823r7876L98026L99799
$$ 126000528 126626463 126684198 126481991 126450825 126468525 126151657 125951834 125853958 126251984 126651783
3391.7A26651783l33900m80214Q0080J84651j76726m196k91395r3784O03475N77832
$$ 126651783 126317883 125837669 125917749 126102400 125925674 125921478 125630083 125536299 126139774 126717606
3401.3A26717606o8541p55548l96777l00922m0636N75867M14867K83003J37920M921
$$ 126717606 126649065 125893517 125496740 125195818 125155182 125731049 126145916 126428919 126566839 126571760
3411A26571760j51205j74770k22540k94838J57967M82816j6746k57511P64379R21221
$$ 126571760 126420555 126245785 126023245 125728407 125886374 126369190 126352444 126094933 126859312 127780533
3420.6A27780533O7253j34916j50404J23348K88772L60690L87497J30205k68355k78682
$$ 127780533 127847786 127712870 127562466 127685814 127974586 128335276 128722773 128852978 128584623 128305941
3430.3A28305941L44820M43430M4260p8259L60489O21147p7715j54791M64630L23668
$$ 128305941 128650761 129094191 129138451 129060192 129420681 130041828 129964113 129809322 130273952 130597620
3439.9A30597620J86520K03304K26030P18947L89261N4331M37498K71320K78902K43473
$$ 130597620 130784140 130987444 131213474 131932421 132321682 132376013 132813511 133084831 133363733 133607206
3449.6A33607206j34029J30672O44770K60229o1140L83911N11713P88040O60954O20089
$$ 133607206 133473177 133603849 134248619 134508848 134447708 134831619 135343332 136131372 136792326 137412415
3459.2A37412415R03148N7183l44430J87903Q23631N16081j2150L90330M25624P98264
$$ 137412415 138315563 138372746 138028316 138216219 139039850 139555931 139543781 139934111 140359735 141157999
3468.8A41157999J043453M68922l2816Q0786O34384M14686K90508N28002N61361M22516
$$ 141157999 142201452 142670374 142637558 142718344 143352728 143767414 144057922 144585924 145147285 145569801
3478.5A45569801O13060J091605M36134K78749O14987J48172L61414J187515J172448
$$ 145569801 146182861 147274466 147710600 147989349 148604336 148752508 149113922 150301437 151473885
3487.2A51473885j8225k84987O56577P75127P75452J183757P68090M83484N84211Q726
$$ 151473885 151455660 151170673 151827250 152602377 153377829 154561586 155329676 155813160 156397371 156406097
3496.8A56406097M22450P49340N47981R36632P61566P27997O22444J90239O09932R89170
$$ 156406097 156828547 157577887 158125868 159062500 159824066 160552063 161174507 161364746 161974678 162963848
3506.5A62963848J204434J372795N53722l44906L50800J037597J046524O24218Q17967
$$ 162963848 164168282 165541077 166094799 165749893 166100693 167138290 168184814 168809032 169626999
3515.1A69626999R76715N04971N55534M18587N42431P94162Q57182Q16536N08270P43084
$$ 169626999 170603714 171108685 171664219 172082806 172625237 173419399 174276581 175093117 175601387 176344471
3524.8A76344471Q31223J421527J355973P09190N85423Q18595J606141J057586P46022
$$ 176344471 177175694 178597221 179953194 180662384 181247807 182066402 183672543 184730129 185476151
3533.5A85476151J047649J056595N91984L38954J195660R93443R72957R27735J012535
$$ 185476151 186523800 187580395 188172379 188511333 189706993 190700436 191673393 192601128 193613663
3542.1A93613663J333122P39040M64249N06516J350669J347676J321048J181393J178017
$$ 193613663 194946785 195685825 196150074 196656590 198007259 199354935 200675983 201857376 203035393
3550.8B03035393J496467N46055J247502J098461J670017K096329P95555J091671R85451
$$ 203035393 204531860 205077915 206325417 207423878 209093895 211190224 211985779 213077450 214062901
3559.5B14062901J400108J049423J356964J723461J135311K432690N95074L23047Q21591
$$ 214062901 215463009 216512432 217869396 219592857 220728168 223160858 223755932 224078979 224900570
3568.2B24900570J040001K798786J478672J205196J529141J776447J435356J398869
$$ 224900570 225940571 228739357 230218029 231423225 232952366 234728813 236164169 237563038
3575.9B37563038J685295J250515K198849J446876J048298J552162K044697J954537
$$ 237563038 239248333 240498848 242697697 244144573 245192871 246745033 248789730 250744267
3583.6B50744267J068096L056125K537003L94401J161232O75393K444324K459412J995353
$$ 250744267 251812363 254868488 257405491 257799892 258961124 259636517 262080841 264540253 266535606
3592.3B66535606J165142J149788K223492J099663K343101K470398J468735K617378
$$ 266535606 267700748 268850536 271074028 272173691 274516792 276987190 278455925 281073303
3600B81073303J295910J085377K620468K041054K022953K718620K382507J049881L001442
$$ 281073303 282369213 283454590 286075058 288116112 290139065 292857685 295240192 296290073 299291515
3608.7B99291515J665860J129398N075645K401162J10263K557850J064987L946171
$$ 299291515 300957375 302086773 307162418 309563580 309673843 312231693 313296680 317242851
3616.4C17242851M475556K250900J160278J140251J943932K647018L086129K332916
$$ 317242851 321718407 323969307 325129585 326269836 328213768 330860786 333946915 336279831
3624.1C36279831L421745L161087K694969M942017J185265k733460L374405M571724
$$ 336279831 339701576 342862663 345557632 350499649 351684914 348951454 352325859 356897583
3631.8C56897583M774208K959099K076225L075562L104438K983017K270661K377052
$$ 356897583 361671791 364630890 366707115 369782677 372887115 375870132 378140793 380517845
3639.5C80517845L345719L361091K775726K545395L476334M157486M113998J242829
$$ 380517845 383863564 387224655 390000381 392545776 396022110 400179596 404293594 405536423
3647.3D05536423N48935N022354K988891R88388K340012M816399M408378L993492N064583
$$ 405536423 406085358 411107712 414096603 415084991 417425003 422241402 426649780 430643272 435707855
3655.9D35707855j370773L174934N191765K636376K868194K193566L906135K692490
$$ 435707855 434337082 437512016 442703781 445340157 448208351 450401917 454308052 457000542
3663.6D57000542J978492L080178K249183M176178K305031R52454K090416j780129
$$ 457000542 458979034 462059212 464308395 468484573 470789604 471742058 473832474 472052345
3671.4D72052345M575882P490349P210846j283340j0487442M946670P251244M627494
$$ 472052345 476628227 484118576 491329422 490046082 479558640 484505310 491756554 496384048
3679.1D96384048K53296J293755K315903K809944K494697J456681J334037L435936
$$ 496384048 496637344 497931099 500247002 503056946 505551643 507008324 508342361 511778297
3686.8E11778297N018540n209389j86195O741180k836037P49283M698143J407280J083412
$$ 511778297 516796837 511587448 511401253 518142433 515306396 516055679 520753822 522161102 523244514
3695.5E23244514O59371L30315J724967J351548K261390K043915k756309L84941L649177
$$ 523244514 523903885 524234200 525959167 527310715 529572105 531616020 528859711 529244652 532893829
3704.1E32893829J120682P14684J098518K048454K676087m153061L865547M421349
$$ 532893829 534014511 534729195 535827713 537876167 540552254 536399193 540264740 544686089
3711.9E44686089j0103341L694573M450912J088524R52454J432380R04122k217598
$$ 544686089 534582748 538277321 542728233 543816757 544769211 546201591 547105713 544888115
3719.6E44888115J218910M323540j052132j707001L616791J323624l38097j588783
$$ 544888115 546107025 550430565 549378433 547671432 551288223 552611847 552273750 550684967
3727.3E50684967R72710L654976M55474K340546k030716l734093O527100j908951o455345
$$ 550684967 551657677 555312653 555768127 558108673 556077957 552343864 558870964 556962013 550506668
3736E50506668K641182K278328O29730J644669K243843k809410K467384P376328j1330643
$$ 550506668 553147850 555426178 556055908 557700577 559944420 557135010 559602394 566978722 555648079
3744.7E55648079o651421Q495407L797684M073601j788406p115899Q328286l054543
$$ 555648079 548996658 557492065 561289749 565363350 563574944 556459045 564787331 561732788
3752.4E61732788n084495N050849L209992J634560l264008K304306L909760m960595
$$ 561732788 556648293 561699142 564909134 566543694 563279686 565583992 569493752 564533157
3760.1E64533157l70941K356758K20528N72662L465958j692238l946304K373009L807373
$$ 564533157 564162216 566518974 566739502 567312164 570778122 569085884 565139580 567512589 571319962
3768.8E71319962m921o744805K620125K980766Q2779M46739l81317O11039N3215K474556
$$ 571319962 571315041 564570236 567190361 570171127 570253906 570700645 570319328 570930367 570983582 573458138
3778.4E73458138j10283n360489K588043J518593Q84094J238709k331467m4708J584472
$$ 573458138 573347855 567987366 570575409 572094002 572978096 574216805 571885338 571840630 573425102
3787.1E73425102L18604K45781N35278q8310j89972n0965j93710J237755J181641l489647
$$ 573425102 573743706 573989487 574524765 574436455 574246483 574195518 574001808 575239563 576421204 572931557
3796.7E72931557j545525K992745L229370K830658p087174n746231N103836L056984
$$ 572931557 571386032 574378777 577608147 580438805 573351631 567605400 572709236 575766220
3804.4E75766220K902107J093178p137489N68085L892936O38771l57246K72598M29917
$$ 575766220 578668327 579761505 572624016 573192101 577085037 577723808 577366562 577639160 578069077
3813.1E78069077J620864L552056j972084r605637M009552M830361K715301k50893
$$ 578069077 579689941 583241997 581269913 571664276 575673828 580504189 583219490 582968597
3820.8E82968597j3292312K567444N039329J781120J516724p30476k848892J11961
$$ 582968597 569676285 572243729 577283058 579064178 580580902 579850426 577001534 577113495
3828.6E77113495J873131K781982O45752o088753J566544N227814l341484k13242M387474
$$ 577113495 578986626 581768608 582414360 576325607 577892151 583119965 579778481 579565239 583952713
3837.2E83952713p280655q18024N894967m355851o01120M771691j105194k142373J855240
$$ 583952713 576672058 575854034 581749001 577393150 576792030 581563721 580458527 578316154 580171394
3845.9E80171394N48973j52816J161995p67403J310768M717751m053269k070770j0657120
$$ 580171394 580720367 580567551 581729546 580962143 582272911 586990662 582937393 580866623 570209503
3854.6E70209503L187943Q392105j522904k161445J778869J967736J265792l995056
$$ 570209503 573397446 581789551 580266647 578105202 579884071 581851807 583117599 579122543
3862.3E79122543J450234M440193n020294l515587L031235L854866L039741p270698
$$ 579122543 580572777 585012970 579992676 576477089 579508324 583363190 586402931 579132233
3870E79132233n509873L501854M760323K516823p457924M91790L274956K46620J619835
$$ 579132233 573622360 577124214 581884537 584401360 576943436 577435226 580710182 580956802 582576637
3878.7E82576637K127610m618035l843078M622230N36003n5160K831077q197517J325035
$$ 582576637 584704247 580086212 576243134 580865364 581401367 581346207 584177284 575979767 577304802
3887.4E77304802L051147Q51899K653427k068711n336113J331520J707612p74422J332168
$$ 577304802 580355949 581207848 583861275 581792564 576456451 577787971 579495583 578721161 580053329
3896.1E80053329L15171Q29010J418190n648690L593407J190415l409386K459145k531968
$$ 580053329 580368500 581197510 582615700 576967010 580560417 581750832 578341446 580800591 578268623
3904.7E78268623n39093M97895N71899Q74214O68030P27692r09462j44158m43306l76701
$$ 578268623 577729530 578227425 578799324 579673538 580341568 581069260 580159798 580015640 579572334 579195633
3914.4E79195633R02824J669579j713905k752877K934456k52380k781487J270943P48253
$$ 579195633 580098457 581768036 580054131 577301254 580235710 579983330 577201843 578472786 579221039
3923.1E79221039Q13064j004562k043762J207008J521759L09830j630097m67834J386032
$$ 579221039 580034103 579029541 576985779 578192787 579714546 580024376 578394279 577926445 579312477
3931.7E79312477k476387n43823K146377l97338j38741K13509m47045l99360k1630
$$ 579312477 576836090 576292267 578438644 578041306 577902565 578116074 577669029 577269669 577248039
3940.4E77248039J509209Q43010k283211l32870J146927J18408L7842j684990l79448
$$ 577248039 578757248 579600258 577317047 576984177 578131104 578249512 578287354 576602364 576222916
3949.1E76222916L29704j008682J049804L40767K37427M00047k20375j50680l38440
$$ 576222916 576552620 575543938 576593742 576934509 577171936 577571983 577351608 577200928 576862488
3957.8E76862488J268348j88369n93529K5558q87908M4326k81028m8371l2081J00898
$$ 576862488 578130836 577942467 577348938 577374496 576486588 576530914 576249886 576201515 576169434 576270332
3967.4E76270332M91295K3613l6812m30374p6217K57835J46904r7923L30505J76582
$$ 576270332 576761627 576785240 576748428 576318054 576241837 576499672 576646576 576548653 576879158 577055740
3977.1E77055740n61103k07444j32370j22375k33422M26064J61552j9798K09465o40716
$$ 577055740 576494637 576287193 576154823 576032448 575799026 576225090 576386642 576366844 576576309 575935593
3986.7E75935593K98996R88083J062164n51377j326179N04684K00692l75100o36596
$$ 575935593 576234589 577222672 578284836 577733459 576407280 576911964 577112656 576737556 576100960
3995.4E76100960J69334N59311O1150J0299l61328
$$ 576100960 576270294 576829605 576890755 576901054 576539726
4000.2E76539726
$$ 576539726
##END=$$ End of the data block
