##TITLE=$$ Begin of the data block
##JCAMP-DX=5.00 $$ ACD/SpecManager v 10.08
##SPECTROMETER/DATA SYSTEM=Varian
##DATE=15 Jan 2013 15:39:38
##DATA TYPE=INFRARED SPECTRUM
##DATA CLASS=XYDATA
##ORIGIN=
##OWNER=
##NPOINTS=3735
##FIRSTX=399.26403809
##LASTX=4000.35498047
##MAXX=4000.35498047
##MINX=399.26403809
##MAXY=62.97988129
##MINY=12.73532200
##XFACTOR=1.0000000000
##YFACTOR=0.000000100000000
##FIRSTY=26.43179131
##DELTAX=0.96440572
##XUNITS=1/CM
##YUNITS=TRANSMITTANCE
##XYDATA=(X++(Y..Y))
$$ plain form
399.3 264317913 273000622 277361641 280204258 271001015 268686733 266403599 267527046 262259369
407 262259369 261071014 258961620 255226288 261747437 260444965 262463703 261130085 262858276 269305859
415.7 269305859 268494282 268020496 251837807 255469398 265532818 265015068 264152279 259317780 258620262
424.3 258620262 264523773 267244930 260477753 260165348 262493496 262986221 260611172 258113480 261239071
433 261239071 260966034 259270325 258052959 261891460 260807247 260220280 264817314 261218395 262991276
441.7 262991276 263057995 259246082 260872803 259787674 258678455 259255524 261005859 260035191 261018219
450.4 261018219 259851208 254484367 253821697 256914387 260742207 263866806 266364994 257400894 254894276
459.1 254894276 255065937 255302296 259875851 255554066 252241421 251317940 253731232 254309063 250693817
$$ packed form
399.3B64317913Q682709M361019K842617r203243k314282k283134J123447n267677
407B62259369j188355k109394l735332O521149j302472K018738j333618J728191O447583
415.7B69305859q11577m73786j6182689L631591J0063420n17750q62789m834499o97518
424.3B58620262N903511K721157o767177l12405K328148M92725k375049k497692L125591
433B61239071k73037j695709j217366L838501j084213n86967M597034l598919J772881
441.7B62991276O6719l811913J626721j085129j109219N77069J750335r70668R83028
450.4B61018219j167011n366841o62670L092690L827820L124599K498188q964100k506618
459.1B54894276J71661K36359M573555m321785l312645r23481K413292N77831l615246
$$ plain form
467.7 250693817 254538116 254637966 253817596 254514580 257977142 257332649 252021923 250219059 246889935
476.4 246889935 246388626 247704010 250436916 252014523 248883133 246600780 244469013 245640450 246621056
485.1 246621056 245847397 246041946 244466877 241846256 242648201 245800781 245185413 244310226 244597988
493.8 244597988 243879509 244828110 246296368 245928307 246231174 246329498 244295540 244461441 246613159
502.5 246613159 247345734 245362492 243241825 243160763 244382133 246340313 244962368 243183060 241795692
511.1 241795692 240792389 240704212 240707912 241365566 239960804 240552063 238112354 234410286 236986923
519.8 236986923 239035759 238371925 235328827 233397884 234220028 236750889 235950890 232385273 233187256
528.5 233187256 235368748 236339512 235116062 233826694 233783817 233595142 233494797 232867088 233154049
$$ packed form
467.7B50693817L844299R9850q20370O96984L462562o44493n310726j802864l329124
476.4B46889935n01309J315384K732906J577607l131390k282353k131767J171437R80606
485.1B46621056p73659J94549j575069k620621Q01945L152580o15368q75187K87762
493.8B44597988p18479R48601J468258l68061L02867R8324k033958J65901K151718
502.5B46613159P32575j983242k120667q1062J221370J958180j377945j779308j387368
511.1B41795692j003303q8177L700O57654j404762N91259k439709l702068K576637
519.8B36986923K048836o63834l043098j930943Q22144K530861p99999l565617Q01983
528.5B33187256K181492R70764j223450j289368m2877j88675j00345o27709K86961
$$ plain form
537.2 233154049 232078266 232023067 232796593 230681171 230249748 231202202 231117058 230724068 230268364 230135860
546.8 230135860 231188850 231239414 230672817 230545959 229451122 228713360 226688519 226553917 228674049
555.5 228674049 229720707 230383034 228751087 227095604 225993748 225574856 225238285 224617882 226179180
564.2 226179180 227638741 227367954 225804920 225932903 226602554 226710300 227137051 225845375 225798492
572.9 225798492 226762085 227022285 226185360 224363174 224042072 224476185 224559593 222866650 222004948 223583355
582.5 223583355 224904213 225273075 225652142 225697842 225545769 226284580 226565495 226334267 225634155 226191559
592.1 226191559 228713093 230042305 230590439 230128002 229380531 229425259 229937115 230976448 230791168
600.8 230791168 229376888 228838463 229652519 230180359 230335426 229876194 228972397 229015484 229022369 228684082
$$ packed form
537.2B33154049j075783n5199P73526k115422m31423R52454q5144l92990m55704j32504
546.8B30135860J052990N0564n66597j26858j094837p37762k024841j34602K120132
555.5B28674049J046658O62327j631947j655483j101856m18892l36571o20403J561298
564.2B26179180J459561k70787j563034J27983O69651J07746M26751j291676m6883
572.9B25798492R63593K60200q36925j822186l21102M34113Q3408j692943q61702J578407
582.5B23583355J320858L68862L79067M5700j52073P38811K80915k31228p00112N57404
592.1B26191559K521534J329212N48134m62437p47471M4728N11856J039333j85280
600.8B30791168j414280n38425Q14056N27840J55067m59232r03797M3087O885l38287
$$ plain form
610.5 228684082 228563900 228404026 227105751 226720047 228023090 228424397 227949448 226861763 226768532
619.2 226768532 227420864 228135223 228770256 228479748 229529343 231058540 230879822 230508766 231189919
627.8 231189919 232696838 234705734 236696625 237874279 238633404 239189243 240080357 240571556 240331326
636.5 240331326 241771698 243763943 244724140 246120129 247320271 247469406 248251266 249949265 251168499
645.2 251168499 251558399 251826267 252986565 254701328 255010910 254382668 255662441 256707954 255037460
653.9 255037460 254095192 255486336 257526398 257727509 257672424 258261967 256669216 255295124 254945354
662.5 254945354 254881496 254878883 255157986 256828518 257659130 258075218 259799614 259244862 258218899 258800316
672.2 258800316 259746342 259914875 261738605 263649273 264912968 265874157 266044731 267305031 268530312
$$ packed form
610.5B28684082j20182j59874j298275l85704J303043M01307m74949j087685r3231
619.2B26768532O52332P14359O35033k90508J049595J529197j78718l71056O81153
627.8B31189919J506919K008896J990891J177654P59125N55839Q91114M91199k40230
636.5B40331326J440372J992245R60197J395989J200142J49135P81860J697999J219234
645.2B51168499L89900K67868J160298J714763L09582o28242J279773J045513j670494
653.9B55037460r42268J391144K040062K01111n5085N89543j592751j374092l49770
662.5B54945354o3858k613K79103J670532Q30612M16088J724396n54752j025963N81417
672.2B58800316R46026J68533J823730J910668J263695R61189J70574J260300J225281
$$ plain form
680.9 268530312 268891640 269180794 269925346 270814819 271590881 272759285 274040604 274580536 273479023
689.6 273479023 272776146 273487358 275076351 276355457 276775227 277200890 277012119 277582645 277910366
698.2 277910366 277360916 278198910 279816437 280847530 281379852 283084641 284179535 284127655 284289665
706.9 284289665 284104118 284821243 285731926 286311798 287561150 289216080 289926624 290591908 291344280
715.6 291344280 291186943 291771297 291675224 291945095 292948818 293827686 295365906 295642891 296661339
724.3 296661339 298007984 298497066 298201618 297599907 298822289 300048885 301131229 301697903 302221127
733 302221127 302753201 303167114 304184875 303635521 303956909 304666233 305096626 306471844 306189938 306434841
742.6 306434841 308185959 308507938 307908306 308534126 309816990 310563965 310361156 310858898 312188854
$$ packed form
680.9B68530312L61328K89154P44552Q89473P76062J168404J281319N39932j101513
689.6B73479023p02877P11212J588993J279106M19770M25663j88771N70526L27721
698.2B77910366n49450Q37994J617527J031093N32322J704789J094894n1880J62010
706.9B84289665j85547P17125R10683N79872J249352J654930P10544O65284P52372
715.6B91344280j57337N84354r6073K69871J003723Q78868J538220K76985J018448
724.3B96661339J346645M89082k95448o01711J222382J226596J082344N66674N23224
733C02221127N32074M13913J017761n49354L21388P09324M30393J375218k81906K44903
742.6C06434841J751118L21979n99632O25820J282864P46975k02809M97742J329956
$$ plain form
751.3 312188854 312199459 312131653 312285709 313718891 315524673 316371021 317515068 318462181 320317688
760 320317688 321147766 321199455 322264290 322735100 322454376 322516937 324290886 325585976 326092606 326333771
769.6 326333771 326953888 327629242 326614265 326342087 326018219 325472794 325008888 325145836 326875458
778.3 326875458 327772026 328039017 328056450 327849503 327360191 327073021 327219810 328326302 330167198 330416412
787.9 330416412 329907303 329383812 329856262 329881248 329611778 330348969 330060577 329508781 328247986 327747612
797.6 327747612 327283478 325616302 324595490 323529778 322330971 320492325 318422871 316489315 315912552
806.2 315912552 315055351 312691879 310733051 308259258 305965691 303883362 302721081 301865444 300589790
814.9 300589790 299144955 297229290 296403885 295414677 295326958 295834160 295700588 295684910 295728683 297169476
$$ packed form
751.3C12188854J0605o7806J54056J433182J805782Q46348J144047R47113J855507
760C20317688Q30078N1689J064835M70810k80724O2561J773949J295090N06630K41165
769.6C26333771O20117O75354j014977k72178l23868n45425m63906J36948J729622
778.3C26875458Q96568K66991J7433k06947m89312k87170J46789J106492J840896K49214
787.9C30416412n09109n23491M72450K4986k69470P37191k88392n51796j260795n00374
797.6C27747612m64134j667176j020812j065712j198807j838646k069454j933556n76763
806.2C15912552q57201k363472j958828k473793k293567k082329j162281q55637j275654
814.9C00589790j444835j915665q25405r89208q7719N07202j33572j5678M3773J440793
$$ plain form
824.6 297169476 297850609 298263035 300220623 303025723 305840168 307463818 308883133 310488377 312751846
833.3 312751846 315070000 318011799 320531349 321712341 324153442 326410599 328468704 330334282
841 330334282 332434387 334717789 335985260 337553024 339460449 341664925 342968559 344134636 345562477
849.6 345562477 348183594 351024780 352644310 355504684 357504158 359812431 362174416 363777313
857.4 363777313 365410118 366963730 370148621 372002106 373651886 375037918 375942612 376879616 376852074
866 376852074 377282181 376711884 376580391 375485878 373488693 371778870 370002785 368690872 367205467
874.7 367205467 367513504 367480087 367438736 367655792 367076950 366690598 365952301 365225296 364035301 363896332
884.4 363896332 362685776 361272354 361402740 361099586 360657768 359465027 359641991 359735794 359379539
$$ packed form
824.6B97169476O81133M12426J957588K805100K814445J623650J419315J605244K263469
833.3C12751846K318154K941799K519550J180992K441101K257157K058105J865578
841C30334282K100105K283402J267471J567764J907425K204476J303634J166077J427841
849.6C45562477K621117K841186J619530K860374J999474K308273K361985J602897
857.4C63777313J632805J553612L184891J853485J649780J386032R04694R37004k7542
866C76852074M30107n70297j31493j094513j997185j709823j776085j311913j485405
874.7C67205467L08037l3417m1351K17056n78842l86352p38297p27005j189995j38969
884.4C63896332j210556j413422J30386l03154m41818j192741J76964R3803l56255
$$ plain form
893 359379539 359355812 359427261 360040512 359980583 360764275 360611610 360851135 361002083 359570351 358830490
902.7 358830490 358125343 359239578 360708771 362071686 363483925 364788895 366201630 366101608 365668182
911.4 365668182 363930473 362740593 362561913 361584015 359470711 357363739 356371918 354566879 352935143
920 352935143 350042267 346394272 343633614 341138840 338857155 336080856 334160652 331796494 329217300
928.7 329217300 326886826 324016075 321894073 320559921 319367924 318131371 317506027 316332932 315491924
937.4 315491924 315171051 314192009 313314342 311904221 310725861 309337711 308149986 307172737 305212727
946.1 305212727 303352451 302232666 301908970 301307392 300888462 299680824 297554073 296189632 294674492
954.8 294674492 292935429 290496883 287733994 285042477 282558651 280327740 278018112 276334820
$$ packed form
893C59379539k3727P1449O13251n9929P83692j52665K39525J50948j431732p39861
902.7C58830490p05147J114235J469193J362915J412239J304970J412735j00022m33426
911.4C65668182j737709j189880j78680r77898k113304k106972r91821j805039j631736
920C52935143k892876l647995k760658k494774k281685k776299j920204k364158k579194
928.7C29217300k330474k870751k122002j334152j191997j236553o25344j173095q41008
937.4C15491924l20873r79042q77667j410121j178360j388150j187725r77249j960010
946.1C05212727j860276j119785l23696o01578m18930j207638k126751j364441j515140
954.8B94674492j739063k438546k762889k691517k483826k230911k309628j683292
$$ plain form
962.5 276334820 274634056 272343922 270283508 268393002 265964870 264497757 263082657 260954933
970.2 260954933 259722309 258036346 256146927 253897820 251308575 249090729 246095238 243002892
977.9 243002892 240267830 237852402 234935093 231213417 228229446 225337849 221358471 217779198
985.6 217779198 214228554 210296154 207270679 204082451 200865822 197628422 194116001 190444908
993.3 190444908 186644745 183453159 180424328 177839680 175560684 173267670 171070271 169286118
1001.1 169286118 167442799 165275440 163428783 162096519 161568260 160660038 159684629 158668613 157766752
1009.7 157766752 157599077 156537380 155040665 153910675 152577019 150928907 149845705 148458948
1017.5 148458948 146936159 146123371 144425507 142419176 140660992 139301462 137543135 136137781
$$ packed form
962.5B76334820j700764k290134k060414j890506k428132j467113j415100k127724
970.2B60954933j232624j685963j889419k249107k589245k217846k995491l092346
977.9B43002892k735062k415428k917309l721676k983971k891597l979378l579273
985.6B17779198l550644l932400l025475l188228l216629l237400l512421l671093
993.3A90444908l800163l191586l028831k584648k278996k293014k197399j784153
1001.1A69286118j843319k167359j846657j332264n28259r08222r75409j016016r01861
1009.7A57766752j67675j061697j496715j129990j333656j648112j083202j386757
1017.5A48458948j522789q12788j697864k006331j758184j359530j758327j405354
$$ plain form
1025.2 136137781 135389719 134624815 134418077 132737083 131408653 130392256 129505186 129209957 128276491
1033.8 128276491 128447113 128556356 129405499 129945707 130160217 131227798 131146812 131127253 131812153 133233204
1043.5 133233204 133619843 133668470 133805981 133404303 133377581 133292847 133853331 132655668 131662121 132773161
1053.1 132773161 133238974 132694101 131877117 131679487 131562138 132375727 132629566 133309765 135032034
1061.8 135032034 136495647 138404694 139255400 141178045 143087063 143888178 144570837 145325680 146556892
1070.5 146556892 147142439 148379230 149499302 150975580 151371717 151063061 152200670 152746382 154339094
1079.2 154339094 155115051 155737791 157406921 158006430 158695011 159123392 159918823 161031666 162425213
1087.9 162425213 163613930 164517231 166482658 168601227 169560738 169880619 171262074 172411537 173847694
$$ packed form
1025.2A36137781p48062p64904k06738j680994j328430j016397q87070k95229r33466
1033.8A28276491J70622J09243Q49143N40208K14510J067581q0986j9559O84900J421051
1043.5A33233204L86639M8627J37511m01678k6722q4734N60484j197663r93547J111040
1053.1A32773161M65813n44873q16984j97630j17349Q13589K53839O80199J722269
1061.8A35032034J463613J909047Q50706J922645J909018Q01115O82659P54843J231212
1070.5A46556892N85547J236791J120072J476278L96137l08656J137609N45712J592712
1079.2A54339094P75957O22740J669130N99509O88581M28381P95431J112843J393547
1087.9A62425213J188717R03301J965427K118569R59511L19881J381455J149463J436157
$$ plain form
1096.5 173847694 175677223 176173687 176806259 177836666 179409046 181023827 182012444 182775688 183469696
1105.2 183469696 184502754 185409641 185944767 186548939 187199326 187541752 188206387 188637772 188492947
1113.9 188492947 189069939 190329971 191418266 191191540 190793591 190838375 190701599 191144295 191833153
1122.6 191833153 192388554 192372551 192634945 193900909 194873123 195255222 196312027 198179836 199251328
1131.2 199251328 199657478 200758038 202767868 204020233 204628181 206336937 208444233 210042019 210987701
1139.9 210987701 211590195 212377644 213447914 214198112 214718170 215206547 215037136 215584011 216713905
1148.6 216713905 216734791 216518173 216453743 216341248 216373463 216470585 216222649 215282784 214499130 214370117
1158.3 214370117 214132957 213508701 213114948 212817936 212816391 212901669 212574577 212798595 214126720 216406193
$$ packed form
1096.5A73847694J829529M96464O32572J030407J572380J614781R88617P63244O94008
1105.2A83469696J033058R06887N35126O04172O50387L42426O64635M31385j44825
1113.9A88492947N76992J260032J088295k26726l97949M4784j36776M42696O88858
1122.6A91833153N55401j6003K62394J265964R72214L82099J056805J867809J071492
1131.2A99251328M06150J100560K009830J252365O07948J708756K107296J597786R45682
1139.9B10987701O02494P87449J070270P50198N20058M88377j69411N46875J129894
1148.6B16713905K0886k16618o4430j12495L2215R7122k47936r39865p83654j29013
1158.3B14370117k37160o24256l93753k97012j545Q5278l27092K24018J328125K279473
$$ plain form
1167.9 216406193 218173904 219436378 221087742 222507744 224212856 226552601 228877487 231025696
1175.6 231025696 233243790 235845394 238351631 240272331 241713543 243188171 244823265 245986767
1183.3 245986767 247607994 249283466 250195942 250744324 250997410 251406879 251398182 250852547 249989700 249402466
1193 249402466 248423691 247009888 246280746 245316753 244349079 243048420 241186352 239559155 238388672
1201.6 238388672 237126236 235364990 234139423 233321362 232376347 231257782 230190048 229093208 228039093
1210.3 228039093 227757988 227466202 226847248 226533928 226479797 226619835 226523952 226126919 225940342 225805950
1220 225805950 225476837 225345364 225546799 225760937 225829144 225748043 225344791 224553337 223878193 223434048
1229.6 223434048 223027267 222830868 222677917 222329006 222052574 221773357 221142483 220364990 219976044 219984493
$$ packed form
1167.9B16406193J767711J262474J651364J420002J705112K339745K324886K148209
1175.6B31025696K218094K601604K506237J920700J441212J474628J635094J163502
1183.3B45986767J621227J675472R12476N48382K53086M09469q697n45635q62847n87234
1193B49402466r78775j413803p29142r63993r67674j300659j862068j627197j170483
1201.6B38388672j262436j761246j225567q18061r45015j118565j067734j096840j054115
1210.3B28039093k81105k91786o18954l13320n4131J40038r5883l97033j86577j34392
1220B25805950l29113j31473K01435K14138O8207q1101m03252p91454o75144m44145
1229.6B23434048m06781j96399j52951l48911k76432k79217o30874p77493l88946Q449
$$ plain form
1239.3 219984493 219844303 219420033 219187565 219384747 219274483 218759193 218098755 217373676 217005405 216459923
1248.9 216459923 215878448 215663548 215771465 215802860 215377636 215300503 215022125 214411850 214162140 214122105
1258.5 214122105 214213848 214445992 214661102 214656239 215172977 215777817 215765076 215636215 216243553 217309761
1268.2 217309761 217960472 219030666 220059414 220711308 221444244 222106895 223045864 224294167 225495682
1276.9 225495682 226487560 227680187 228792191 229902363 231064739 232226353 233819923 235142651
1284.6 235142651 236562901 238254280 239825020 241659908 243260059 244413052 245210438 246044273 247340641
1293.3 247340641 248418140 249492321 250427380 251277828 252613811 253422871 253788719 253958530 254093475
1301.9 254093475 253961697 253955307 254923229 255620899 255797329 255555668 255546894 255624142 255012569 254573402
$$ packed form
1239.3B19984493j40190m24270k32468J97182j10264n15290o60438p25079l68271n45482
1248.9B16459923n81475k14900J07917L1395m25224p7133k78378o10275k49710m0035
1258.5B14122105R1743K32144K15110m863N16738O04840j2741j28861O07338J066208
1268.2B17309761O50711J070194J028748O51894P32936O62651R38969J248303J201515
1276.9B25495682R91878J192627J112004J110172J162376J161614J593570J322728
1284.6B35142651J420250J691379J570740J834888J600151J152993P97386Q33835J296368
1293.3B47340641J077499J074181R35059Q50448J335983Q09060L65848J69811J34945
1301.9B54093475j31778o390R67922O97670J76430k41661q774P7248o11573m39167
$$ plain form
1311.6 254573402 254428501 254123745 253588390 253675804 253782120 254119549 255121307 255673676 256082458 256362820
1321.2 256362820 256870766 257346020 257850819 258379822 258838558 259634380 259697056 259736996 259442844 258787518
1330.9 258787518 258157806 257454071 257298660 256981335 256733170 256352425 256419525 256547623 255993042 255814400
1340.5 255814400 255821133 256448669 256850033 257340031 257730331 257822037 258440895 258439121 258251114 257931118
1350.2 257931118 258062553 258217583 258009548 258051796 257416763 256760006 256254730 255845566 255106163 254570560
1359.8 254570560 254158573 253659477 253810997 252930489 252532444 252156830 251418152 250708790 249709759 249254818
1369.4 249254818 248650074 248099842 247801533 247893906 247401886 246406288 246391506 246375294 246247654 245727119
1379.1 245727119 245478668 244991550 244341927 243643856 242665176 241938572 240967464 240485229 239089336
$$ packed form
1311.6B54573402j44901l04756n35355Q7414J06316L37429J001758N52369M08782K80362
1321.2B56362820N07946M75254N04799N29003M58736P95822O2676L9940k94152o55326
1330.9B58787518o29712p03735j55411l17325k48165l80745O7100J28098n54581j78642
1340.5B55814400O733O27536M01364M89998L90300R1706O18858j774j88007l19996
1350.2B57931118J31435J55030k08035M2248o35033o56757n05276m09164p39403n35603
1359.8B54570560m11987m99096J51520q80508l98045l75614p38678p09362r99031m54941
1369.4B49254818o04744n50232k98309R2373m92020r95598j4782j6212j27640n20535
1379.1B45727119k48451m87118o49623o98071r78680p26604r71108m82235j395893
$$ plain form
1387.8 239089336 238262787 238055248 237087212 236318913 235235157 234366055 232399445 230101337 229185085
1396.4 229185085 228055763 227601509 226377583 225222816 224398632 223152084 221884975 220435429 218886948
1405.1 218886948 217833977 217049541 216020241 215176296 214461765 213431625 212330589 211504536 210964203
1413.8 210964203 210341339 209818096 209246387 208906460 208902493 207287827 207074471 207725143 208050499 208275833
1423.4 208275833 207912560 208194427 208787155 208936100 209322376 209814835 210141392 210176678 210719337 211513329
1433.1 211513329 212106209 213112202 214027805 214005623 215029202 216300411 216611500 217119408 217924805
1441.8 217924805 218188534 218805161 219569912 220269241 220598679 220976048 221315613 222025604 222852936 222913895
1451.4 222913895 222999229 223194313 223826256 223643188 222842426 222883148 223650970 226304150 227572041 228977165
$$ packed form
1387.8B39089336q26549k07539r68036p68299j083756q69102j966610k298108r16252
1396.4B29185085j129322m54254j223926j154767q24184j246548j267109j449546j548481
1405.1B18886948j052971p84436j029300q43945p14531j030140j101036q26053n40333
1413.8B10964203o22864n23243n71709l39927l967j614666k13356O50672L25356K25334
1423.4B08275833l63273K81867N92728J48945L86276M92459L26557L5286N42659P93992
1433.1B11513329N92880J005993R15603k2182J023579J271209L11089N07908Q05397
1441.8B17924805K63729O16627P64751O99329L29438L77369L39565P09991Q27332O0959
1451.4B22913895Q5334J95084O31943j83068q00762M0722P67822K653180J267891J405124
$$ plain form
1461.1 228977165 229678192 230717049 232543526 233135719 234414845 235817757 238089657 240095253 242121372
1469.7 242121372 244432850 246047325 248498440 251404648 255315132 258022385 260598526 263181076
1477.5 263181076 265243816 267105465 268892155 270807400 272054462 273533382 275291290 276619205
1485.2 276619205 277645969 277757282 277583103 278599052 277945042 277290192 277494259 276992569 275860023
1493.8 275860023 274564095 273071804 268092346 267865353 266608219 264205513 263698387 262214050 261176758
1502.5 261176758 259797821 259193630 257702923 253137112 253687286 254294033 254600468 253402157 254207745
1511.2 254207745 254067688 252992458 252277145 251023693 251139622 249282265 247706547 248931751 250233307
1519.9 250233307 248639717 245647430 247369919 248740063 250370369 249991570 250294781 251281662 252077179
$$ packed form
1461.1B28977165P01027J038857J826477N92193J279126J402912K271900K005596K026119
1469.7B42121372K311478J614475K451115K906208L910484K707253K576141K582550
1477.5B63181076K062740J861649J786690J915245J247062J478920J757908J327915
1485.2B76619205J026764J11313j74179J015949o54010o54850K04067n01690j132546
1493.8B75860023j295928j492291m979458k26993j257134k402706n07126j484337j037292
1502.5B61176758j378937o04191j490707m565811N50174O06747L06435j198311Q05588
1511.2B54207745j40057j075230p15313j253452J15929j857357j575718J225204J301556
1519.9B50233307j593590k992287J722489J370144J630306l78799L03211R86881P95517
$$ plain form
1528.6 252077179 252978554 253405113 253671150 253746510 254505501 254386520 255502853 256242313 256474190 257191792
1538.2 257191792 255079556 255814724 257139225 258764744 258799000 259369564 260384674 259987946 261603298
1546.9 261603298 262654037 263422394 263213348 263346500 264655571 265102215 265853157 264699802 265856857
1555.6 265856857 266794205 266287384 263637218 254818058 261339874 262880554 263706799 262968750 262022991
1564.2 262022991 260499992 258823185 258244419 257150459 256531467 249958820 248883018 248201294 246107292
1572.9 246107292 244222679 242017250 241382141 233779221 232574139 230123634 226927376 224361973
1580.6 224361973 221146641 219083977 214989433 212142830 208539295 205791492 202862873 199247265
1588.4 199247265 196763287 192504845 190464172 186827583 184807816 182264824 178814297 176871643
$$ packed form
1528.6B52077179R01375M26559K66037P5360P58991j18981J116333P39460K31877P17602
1538.2B57191792k112236P35168J324501J625519L4256N70564J015110l96728J615352
1546.9B61603298J050739P68357k09046J33152J309071M46644P50942j153355J157055
1555.6B65856857R37348n06821k650166q819160O521816J540680Q26245p38049r45759
1564.2B62022991j522999j676807n78766j093960o18992o572647j075802o81724k094002
1572.9B46107292j884613k205429o35109p602920j205082k450505l196258k565403
1580.6B24361973l215332k062664m094544k846603l603535k747803k928619l615608
1588.4A99247265k483978m258442k040673l636589k019767k542992l450527j942654
$$ plain form
1596.1 176871643 173345490 171872463 168555508 166986656 164735107 162430782 160983734 158223028
1603.8 158223028 157472181 154827213 153876581 151561317 150466871 149493980 147559004 147560081 145460587
1612.5 145460587 145512190 143709135 143513365 142863474 139258165 140962982 139856548 140693970 139822588
1621.1 139822588 140973625 140879354 139345722 140391989 139842567 141293373 140224323 141558161 141995020
1629.8 141995020 142781620 143729172 143601322 145423965 144806557 145787563 145188570 147713585 149015608
1638.5 149015608 149503851 151063566 151103926 153018980 153100920 154673529 155457458 154522200 156314306
1647.2 156314306 155391016 158771343 159117384 160753212 160771236 156164703 160953388 161515388 164619713
1655.9 164619713 164952583 166655407 167309799 168734455 170257378 171281776 173664532 173812027 176798439
$$ packed form
1596.1A76871643l526153j473027l316955j568852k251549k304325j447048k760706
1603.8A58223028p50847k644968r50632k315264j094446r72891j934976J077k099494
1612.5A45460587N1603j803055j95770o49891l605309J704817j106434Q37422q71382
1621.1A39822588J151037r4271j533632J046267n49422J450806j069050J333838M36859
1629.8A41995020P86600R47552j27850J822643o17408R81006n98993K525015J302023
1638.5A49015608M88243J559715M0360J915054Q1940J572609P83929r35258J792106
1647.2A56314306r23290L380327L46041J635828J8024m606533M788685N62000L104325
1655.9A64619713L32870J702824O54392J424656J522923J024398K382756J47495K986412
$$ plain form
1664.5 176798439 178010483 180055313 181977215 183464451 186480122 187133865 190808640 192481823
1672.3 192481823 195968609 198663006 201170273 204283905 206626434 210708313 213070240 216625519
1680 216625519 218906193 222479038 226546078 227615013 233730946 235441208 240774059 244213028 248033676
1688.6 248033676 252490406 256575394 261417217 265194874 269544640 273344650 278443680 282335224
1696.4 282335224 287332230 292989159 297779655 304009552 305018597 310952225 315415497 319824123
1704.1 319824123 324456635 328582611 332327805 335503540 339780502 343212128 346594315 349689636
1711.8 349689636 352982178 356492271 357972870 360581589 364456749 367029076 364941444 368953514
1719.5 368953514 372823334 375299644 377622528 378998451 380705872 383100777 385364799 387226486
$$ packed form
1664.5A76798439J212044K044830J921902J487236L015671O53743L674775J673183
1672.3A92481823L486786K694397K507267L113632K342529M081879K361927L555279
1680B16625519K280674L572845M067040J068935O115933J710262N332851L438969L820648
1688.6B48033676M456730M084988M841823L777657M349766L800010N099030L891544
1696.4B82335224M997006N656929M790496O229897J009045N933628M463272M408626
1704.1C19824123M632512M125976L745194L175735M276962L431626L382187L095321
1711.8C49689636L292542L510093J480599K608719L875160K572327k087632M012070
1719.5C68953514L869820K476310K322884J375923J707421K394905K264022J861687
$$ plain form
1727.2 387226486 389337196 392069626 393086586 394370232 397742500 400827293 400631485 399713783 404259033
1735.9 404259033 408331871 410742531 413952408 415848618 415862770 420392952 424065933 426179924 429316940
1744.6 429316940 433450165 437531128 440688553 444534760 447500992 452590370 456313133 458712959
1752.3 458712959 464116020 468382416 473042679 477255402 478787117 481905861 485836449 489344673
1760 489344673 493196487 494433441 496282463 500456123 503231773 505985451 508594017 510617638 510327339
1768.7 510327339 512979736 517536316 518513031 518027992 519064178 523800888 526321793 526276970 528773155
1777.4 528773155 530136375 532473335 533775978 534194489 536408539 538924751 541142235 540966835 541696587
1786 541696587 543500938 545003204 546224403 548505936 550268555 551145477 551476059 551708488 555132027
$$ packed form
1727.2C87226486K110710K732430J016960J283646L372268L084793j95808r17702M545250
1735.9D04259033M072838K410660L209877J896210J4152M530182L672981K113991L137016
1744.6D29316940M133225M080963L157425L846207K966232N089378L722763K399826
1752.3D58712959N403061M266396M660263M212723J531715L118744L930588L508224
1760D89344673L851814J236954J849022M173660K775650K753678K608566K023621k90299
1768.7E10327339K652397M556580R76715m85039J036186M736710K520905m4823K496185
1777.4E28773155J363220K336960J302643M18511K214050K516212K217484j75400P29752
1786E41696587J804351J502266J221199K281533J762619Q76922L30582K32429L423539
$$ plain form
1794.7 555132027 556257210 556420975 558465424 560535355 561099281 560916786 564134903 565004425 566171379
1803.4 566171379 568070145 568944435 570401611 570947762 571974983 573434944 575050201 574947662 576258354
1812.1 576258354 578231506 579076042 580736351 581282158 582345543 582424202 583203773 584632568 585069695
1820.8 585069695 586603699 586838760 588321266 589618492 588283348 589062233 591063232 592845726 592551270
1829.4 592551270 590894737 592465057 595374985 596077805 596495667 597428207 598049698 598570518 598285866
1838.1 598285866 599851303 600605736 601407547 602170448 603396339 604441833 600215530 602502441 604655113
1846.8 604655113 605058403 604971695 605858917 607191811 606890564 607853088 608184662 608854599 609169693 609523087
1856.4 609523087 610593185 610387306 611025581 611150970 612060509 612541580 612934685 613431778 613261261
$$ packed form
1794.7E55132027J125183J63765K044449K069931N63926j82495L218117Q69522J166954
1803.4E66171379J898766Q74290J457176N46151J027221J459961J615257j02539J310692
1812.1E76258354J973152Q44536J660309N45807J063385P8659P79571J428795M37127
1820.8E85069695J534004K35061J482506J297226j335144P78885K000999J782494k94456
1829.4E92551270j656533J570320K909928P02820M17862R32540O21491N20820k84652
1838.1E98285866J565437P54433Q01811P62901J225891J045494m226303K286911K152672
1846.8F04655113M03290q6708Q87222J332894l01247R62524L31574O69937L15094L53394
1856.4F09523087J070098k05879O38275J25389R09539M81071L93105M97093j70517
$$ plain form
1865.1 613261261 613928185 613438835 614632263 614232216 613590164 615141830 615945892 616725655 616718864 617525139
1874.8 617525139 617530937 617834244 618544655 618913689 619177361 618796043 619603043 619438553 619870720 620107346
1884.4 620107346 620221062 621212959 621223030 622331276 622291603 621102142 621294937 622170982 622594643 622845306
1894.1 622845306 622825279 622059097 623351021 623883820 624380875 624770622 624661789 624865417 624193611 624590988
1903.7 624590988 624746246 625402565 625790405 625788994 626056442 625939484 626259422 625894547 626847420 626879845
1913.3 626879845 626875801 627385597 627699699 629127388 627448692 627016983 627612572 627927704 628573456 627925720
1923 627925720 628106689 628232498 628657455 628822479 629017372 628922005 628953438 629184113 628402290 628467903
1932.6 628467903 628422432 628837967 629100304 629555550 629798813 629031410 629057083 628541794 629153557 628986969
$$ packed form
1865.1F13261261O66924m89350J193428m00047o42052J551666Q04062P79763o791Q06275
1874.8F17525139N798L03307P10411L69034K63672l81318Q07000j64490M32167K36626
1884.4F20107346J13716R91897J0071J108246l9673j189461J92795Q76045M23661K50663
1894.1F22845306k0027p66182J291924N32799M97055L89747j08833K03628o71806L97377
1903.7F24590988J55258O56319L87840j411K67448j16958L19938l64875R52873L2425
1913.3F26879845m044N09796L14102J427689j678696m31709N95589L15132O45752o47736
1923F27925720J80969J25809M24957J65024J94893r5367L1433K30675p81823O5613
1932.6F28467903m5471M15535K62337M55246K43263p67403K5673n15289O11763j66588
$$ plain form
1942.3 628986969 628078232 629044914 629443626 629331169 628824043 629001007 628679314 628448906 628362961 628421173
1951.9 628421173 628971214 628908195 629134216 628490410 628397789 628350296 628052177 628246193 628157349 628652954
1961.6 628652954 628555298 628830109 628736038 628225365 627895737 627327118 627519608 627783089 628384018 628387642
1971.2 628387642 628705597 628652000 628029594 627733574 627383194 627838593 627625465 627736206 627745056 627962036
1980.8 627962036 628411064 628100319 628190842 627552185 627361755 626839867 626678047 626787643 626543961 627535439
1990.5 627535439 627454681 626971550 626645584 626880455 626612358 625814781 625796013 625305710 625439072 625500221
2000.1 625500221 625951157 625912247 625533524 625215797 624235764 624604034 624544525 624443398 624361191 624450264
2009.8 624450264 624623375 624003639 623767052 623007469 622829590 622511711 622142181 621977730 622126389 622744102
$$ packed form
1942.3F28986969r08737R66682L98712j12457n07126J76964l21693k30408q5945N8212
1951.9F28421173N50041o3019K26021o43806r2621m7493k98119J94016q8844M95605
1961.6F28652954r7656K74811r4071n10673l29628n68619J92490K63481O00929L624
1971.2F28387642L17955n3597o22406k96020l50380M55399k13128J10741Q850K16980
1980.8F27962036M49028l10745R0523o38657j90430n21888j61820J09596k43682R91478
1990.5F27535439q0758m83131l25966K34871k68097p97577j8768m90303J33362O1149
2000.1F25500221M50936l8910l78723l17727r80033L68270n9509j01127q2207Q9073
2009.8F24450264J73111o19736k36587p59583j77879l17879l69530j64451J48659O17713
$$ plain form
2019.4 622744102 622349739 622534790 622178116 621777229 620960808 620158653 620752296 620776329 620934677 620776863
2029.1 620776863 620929604 620416374 619640083 619420853 618845749 619148293 618706703 618483200 618497314 618507423
2038.7 618507423 618540154 617948456 617606659 617162819 617497711 617253761 617104263 617068939 616747322 616995850
2048.4 616995850 616644707 616552505 616109543 616118202 616010475 615639114 615905571 615930519 615982742 615470123
2058 615470123 615579071 615234337 614864426 614743729 614451981 615029907 614943771 615201874 614836006 614544754
2067.6 614544754 614431458 614014473 614064484 613327065 613711777 613888702 613717537 613721962 613751602 613964500
2077.3 613964500 613301888 613348274 613028603 612804794 612764931 612846184 612892952 612409019 612848892 612476540
2086.9 612476540 612034111 611392975 610893478 610922775 610696640 610968666 610493050 610523491 610719032 610854836
$$ packed form
2019.4F22744102l94363J85051l56674m00887q16421q02155N93643K4033J58348j57814
2029.1F20776863J52741n13230p76291k19230n75104L02544m41590k23503J4114J0109
2038.7F18507423L2731n91698l41797m43840L34892k43950j49498l5324l21617K48528
2048.4F16995850l51143r2202m42962Q659j07727l71361K66457K4948N2223n12619
2058F15470123J08948l44734l69911j20697k91748N77926q6136K58103l65868k91252
2067.6F14544754j13296m16985N0011p37419L84712J76925j71165M425K9640K12898
2077.3F13964500o62612M6386l19671k23809l9863Q1253M6768m83933M39873l72352
2086.9F12476540m42429o41136m99497K9297k26135K72026m75616L0441J95541J35804
$$ plain form
2096.6 610854836 610501862 609392586 608960381 608543892 608570709 608416443 608776474 608925095 608559685 608264923
2106.2 608264923 607472763 607602119 607408257 606965790 606645584 606849098 607057915 606691971 606762924 606222420
2115.9 606222420 606087036 606020851 605917320 605715675 605429001 605334435 604915276 605088387 604669342 604761887
2125.5 604761887 604809952 604585037 604728661 604300079 604474030 604258804 604514961 604527779 604254761 604097176
2135.1 604097176 603347206 603487320 603353996 603624382 603669815 603674355 603795738 603340569 603521423 603283844
2144.8 603283844 603414879 603428879 603442802 603213806 602685280 602829170 602777824 603216896 602955780 602778702
2154.4 602778702 602754478 602595940 602815170 602931824 603754311 603558731 603022881 602614288 602542076 602893906
2164.1 602893906 602768593 602791710 602781105 603365746 603390427 603628387 603642387 602780533 602616768 602415619
$$ packed form
2096.6F10854836l52974j109276m32205m16489K6817j54266L60031J48621l65410k94762
2106.2F08264923p92160J29356j93862m42467l20206K03514K08817l65944P0953n40504
2115.9F06222420j35384o6185j03531k01645k86674r4566m19159J73111m19045R2545
2125.5F04761887M8065k24915J43624m28582J73951k15226K56157J2818k73018j57585
2135.1F04097176p49970J40114j33324K70386M5433M540J21383m55169J80854k37579
2144.8F03283844J31035J4000J3923k28996n28526J43890n1346M39072k61116j77078
2154.4F02778702k4224j58538K19230J16654Q22487j95580n35850m08593p2212L51830
2164.1F02893906j25313K3117j0605N84641K4681K37960J4000q61854j63765k01149
$$ plain form
2173.7 602415619 602663612 602630005 603059006 603287163 603060646 603450432 603336716 603198814 602590904 602679062
2183.4 602679062 602625237 602509460 603023834 603120079 603418198 603041039 603295784 603224983 602890091 603160744
2193 603160744 603253212 603691025 603288460 603160324 603286324 603577652 603466606 603064804 603178329 602922592
2202.6 602922592 603445740 603463402 603620033 603938293 603844566 603781395 603283539 603495979 603440552 603862610
2212.3 603862610 603857956 603633614 604172363 604186096 604349327 603831062 603766708 603830414 603822861 603970261 603858109
2222.9 603858109 604207649 604213982 604575539 603993645 603481369 603670387 603547935 604051208 604087677 603983269
2232.5 603983269 603631592 603772888 604000664 603816795 603733749 603206596 603178749 603069229 603310928 603528442
2242.2 603528442 603552094 603484764 602919159 602787781 602758942 602977448 602834702 603059464 603200989 603227806
$$ packed form
2173.7F02415619K47993l3607M29001K28157k26517L89786j13716j37902o07910Q8158
2183.4F02679062n3825j15777N14374R6245K98119l77159K54745p0801l34892K70653
2193F03160744R2468M37813m02565j28136J26000K91328j11046m01802J13525k55737
2202.6F02922592N23148J7662J56631L18260r3727o3171m97856K12440n5427M22058
2212.3F03862610m654k24342N38749J3733J63231n18265o4354O3706p553J47400j12152
2222.9F03858109L49540O333L61557n81894n12276J89018j22452N03273L6469j04408
2232.5F03983269l51677J41296K27776j83869q3046n27153k7847j09520K41699K17514
2242.2F03528442K3652o7330n65605j31378k8839K18506j42746K24762J41525K6817
$$ plain form
2251.8 603227806 603694305 603432350 603306808 602558670 602321854 602497406 602612724 602936478 602695808 603035889
2261.5 603035889 603023987 603209419 602708282 602174187 602638741 602520065 602574654 602283936 602824974 602952957
2271.1 602952957 602290573 602049026 601717300 601811447 601113091 600720673 600676384 600976715 601274452 600991707
2280.8 600991707 601041565 600577545 600328178 599883575 599942665 600376320 600364113 600240326 599856987 600474014
2290.4 600474014 600403786 600077629 600276146 600394249 600387878 599980812 600373688 600345688 600240173 600418892
2300 600418892 600703506 601039619 600572548 600420952 600678406 601312943 601560707 601633568 601830521 601871948
2309.7 601871948 601992340 602048912 602542915 601991158 601523514 602495232 603595848 603543930 603036613 603483734
2319.3 603483734 603918457 604527245 604330215 604714737 605585098 605212250 605152206 605525055 605927124 605173264
$$ packed form
2251.8F03227806M66499k61955j25542p48138k36816J75552J15318L23754k40670L40081
2261.5F03035889j1902J85432n01137n34095M64554j18676N4589k90718N41038J27983
2271.1F02952957o62384k41547l31726R4147o98356l92418m4289L00331K97737k82745
2280.8F00991707M9858m64020k49367m44603N9090M33655j2207j23787l83339O17027
2290.4F00474014p0228l26157J98517J18103o371m07066L92876k8000j05515J78719
2300F00418892K84614L36113m67071j51596K57454O34537K47764P2861J96953M1427
2309.7F01871948J20392N6572M94003n51757m67644R71718J100616n1918n07317M47121
2319.3F03483734M34723O08788j97030L84522Q70361l72848o0044L72849M02069p53860
$$ plain form
2329 605173264 605920792 607177200 606880035 606755753 606440468 605728035 604811592 605494156 605631866 605664787
2338.6 605664787 605567551 605320702 606190681 605357475 605261612 605211411 604855156 603611069 600523109 597210045
2348.3 597210045 596079025 598404808 600582275 602593422 603955879 604783821 606592827 606020775 606151772
2356.9 606151772 605168800 606441345 606988182 606000900 606715698 605056458 604846916 604930305 604964256 602205925
2366.6 602205925 599913712 600157890 599108620 597649269 595024529 593044281 591441078 590507011 589513893
2375.3 589513893 588114548 586737556 585212746 584501953 583058701 581610107 580069733 579118385 578654060
2383.9 578654060 577356186 576739922 576271172 576103477 575807495 575415764 574806023 574104614 574268188
2392.6 574268188 573675766 573284187 572938805 572587852 572204170 571587753 571305580 570551758 570428047 569972610
$$ packed form
2329F05173264P47528J256408k97165j24282l15285p12433r16443O82564J37710L2921
2338.6F05664787r7236k46849Q69979q33206r5863n0201l56255j244087l087960l313064
2348.3E97210045j131020K325783K177467K011147J362457Q27942J809006n72052J30997
2356.9F06151772r82972J272545N46837r87282P14798j659240k09542Q3389L3951k758331
2366.6F02205925k292213K44178j049270j459351k624740j980248j603203r34067r93118
2375.3E89513893j399345j376992j524810p10793j443252j448594j540374r51348m64325
2383.9E78654060j297874o16264m68750j67695k95982l91731o09741p01409J63574
2392.6E74268188n92422l91579l45382l50953l83682o16417k82173p53822j23711m55437
$$ plain form
2402.3 569972610 569553642 569179840 568556442 568356438 567696533 567680969 567359352 567125130 566817894 566077652
2411.9 566077652 565769348 565232620 564976196 564229507 563944397 563726768 563243523 563053627 562499123 562152023
2421.6 562152023 561442642 561120987 560642128 560321655 559975624 559089203 559046211 558595657 558223686 557633476
2431.2 557633476 557039833 556706276 556121979 555890503 555463791 555345345 554871826 554321365 553460960 552712288
2440.8 552712288 552809715 552152214 551555367 551168137 550771866 550137367 550004158 549949989 549164009 548788719
2450.5 548788719 547898788 547152863 546540947 546276665 546243591 545382233 544746132 544261513 544052734 543514748
2460.1 543514748 542792892 542114639 541506805 541070404 540445023 540120697 539394722 539034195 538611755 537912750
2469.8 537912750 537355232 536614075 536384125 535721092 535152588 534559631 534069099 533738937 533043900 532783966
$$ packed form
2402.3E69972610m18968l73802o23398k00004o59905j5564l21617k34222l07236p40242
2411.9E66077652l08304n36728k56424p46689k85110k17629m83245j89896n54504l47100
2421.6E62152023p09381l21655m78859l20473l46031q86421m2992m50554l71971n90210
2431.2E57633476n93643l33557n84297k31476m26712j18446m73519n50461q60405p48672
2440.8E52712288R7427o57501n96847l87230l96271o34499j33209n4169p85980l75290
2450.5E48788719q89931p45925o11916k64282l3074q61358o36101m84619k08779n37986
2460.1E43514748p21856o78253o07834m36401o25381l24326p25975l60527m22440o99005
2469.8E37912750n57518p41157k29950o63033n68504n92957m90532l30162o95037k59934
$$ plain form
2479.4 532783966 532029648 531159286 530380249 529940071 529680252 529201851 528796577 528059273 527585831 526873512
2489.1 526873512 526005859 524909248 524179878 523999138 523537712 523168602 522253761 521962738 521697693
2497.7 521697693 520838394 520133858 519295387 518685646 518087883 517868156 517131805 516221008 515331917 514541435
2507.4 514541435 514383240 513595734 513058586 512473373 511875229 511500206 511207008 510755081 509768028 509561272
2517 509561272 508915100 508170357 507570114 506940117 506706696 506049004 505665054 505104294 504821968 504402504
2526.7 504402504 503414993 502467766 501816711 501851349 501255569 500854797 500652199 500524330 500306587 499207306
2536.3 499207306 498452225 497845650 497636147 497212410 496518669 496177635 495724716 495450897 495028496 494723434
2546 494723434 494271469 493424301 492643204 492093887 491555252 491264153 490967827 489882050 489273224 489070320
$$ packed form
2479.4E32783966p54318q70362p79037m40178k59819m78401m05274p37304m73442p12319
2489.1E26873512q67653j096611p29370j80740m61426l69110r14841k91023k65045
2497.7E21697693q59299p04536q38471o09741n97763k19727p36351r10797q89091p90482
2507.4E14541435j58195p87506n37148n85213n98144l75023k93198m51927r87053k06756
2517E09561272o46172p44743o00243o29997k33421o57692l83950n60760k82326m19464
2526.7E04402504r87511r47227o51055L4638n95780m00772k02598j27869k17743j099281
2536.3D99207306p55081o06575k09503m23737o93741l41034m52919k73819m22401l05062
2546D94723434m51965q47168p81097n49317n38635k91099k96326j085777o08826k02904
$$ plain form
2555.6 489070320 488925819 488546677 487882957 487714539 487247009 486572227 486023712 485559998 484722176 484079399
2565.2 484079399 483863487 483420181 482986984 482219429 482042122 481937447 481443558 480887947 480116043 479862366
2574.9 479862366 479546700 479114227 478481255 478185310 478115425 477449760 476599579 475805817 475438080 474905968
2584.5 474905968 474502220 474168816 474084053 473827209 472842751 472251472 471415634 471158371 470761795 469942741
2594.2 469942741 469695244 469053116 468620033 468197098 467957726 467363243 466484032 466114235 465659370 465112076
2603.8 465112076 464240990 463783722 463206902 462527580 462108116 461718788 461286659 460348129 459838676 459051552
2613.5 459051552 458453484 458192482 457509041 457035255 456561089 456283379 455399017 454382019 453811913
2622.1 453811913 453539619 453455963 452916183 452224998 451382370 450797386 450014610 449331512 448862648 448462410
$$ packed form
2555.6D89070320j44501l79142o63720j68418m67530o74782n48515m63714q37822o42777
2565.2D84079399k15912m43306m33197p67555j77307j04675m93889n55611p71904k53677
2574.9D79862366l15666m32473o32972k95945o9885o65665q50181p93762l67737n32112
2584.5D74905968m03748l33404q4763k56844r84458n91279q35838k57263l96576q19054
2594.2D69942741k47497o42128m33083m22935k39372n94483q79211l69797m54865n47294
2603.8D65112076q71086m57268n76820o79322m19464l89328m32129r38530n09453p87124
2613.5D59051552n98068k61002o83441m73786m74166k77710q84362j016998n70106
2622.1D53811913k72294q3656n39780o91185q42628n84984p82776o83098m68864m00238
$$ plain form
2631.8 448462410 448395729 447789230 447399063 446601448 445491943 444906578 444605598 444214363 443330460 443145485
2641.4 443145485 442835846 442234612 441680412 441108170 440776787 439947853 439179382 438571129 438263016 437935181
2651.1 437935181 437456093 437081757 436787300 436461906 435529327 434957275 434586296 434251518 433664894 433031044
2660.7 433031044 432786484 432114296 431734467 431033936 430366936 429985428 429668922 429598351 429175758 429149933
2670.4 429149933 428721352 428488312 428500328 427890663 427377892 426844597 426640015 426326599 425939903 425463867
2680 425463867 425074654 424518127 423727913 423500023 422912712 422591705 422382851 422126579 421952667 421456413
2689.6 421456413 421228676 420699615 420123100 419608994 419324989 418964958 418474197 418305550 417726059 417402420
2699.3 417402420 417301826 416945610 416424103 416143074 415824776 415392494 415207100 414622612 414234009 413867455
$$ packed form
2631.8D48462410o6681o06499l90167p97615j109505n85365l00980l91235q83903j84975
2641.4D43145485l09639o01234n54200n72242l31383q28934p68471o08253l08113l27835
2651.1D37935181m79088l74336k94457l25394r32579n72052l70979l34778n86624o33850
2660.7D33031044k44560o72188l79829p00531o67000l81508l16506p0571m22593k5825
2670.4D29149933m28581k33040J2016o09665n12771n33295k04582l13416l86696m76036
2680D25463867l89213n56527p90214k27890n87311l21007k08854k56272j73912m96254
2689.6D21456413k27737n29061n76515n14106k84005l60031m90761j68647n79491l23639
2699.3D17402420j00594l56216n21507k81029l18298m32282j85394n84488l88603l66554
$$ plain form
2708.9 413867455 413685532 413444824 413003082 412749481 412039604 411607056 410806084 410259666 410285683 410366859
2718.6 410366859 410574036 409830208 409458542 409484978 409357071 408795166 408060875 407918854 407555885 407559204
2728.2 407559204 407446709 406844215 406142693 405673332 405510101 405192757 405018158 404780235 404772720 404556923
2737.9 404556923 404334793 404256096 403868904 403660431 403408127 403263435 403005142 402953377 402718163 402105560
2747.5 402105560 401934853 402138481 402010956 400803757 400478096 400475006 399956627 399969826 399710655 399473953
2757.2 399473953 399182167 399019241 398725891 398155975 397755127 397423744 397366333 397165756 396920280 396318893
2766.8 396318893 396128273 396134644 395382385 394617691 394194069 394492569 394211540 393539734 393403168 393145714
2776.4 393145714 392441444 391713829 391321716 390427933 389901085 389502373 389050064 389203644 389008827 388290596
$$ packed form
2708.9D13867455j81923k40708m41742k53601p09877m32548q00972n46418K6017Q1176
2718.6D10366859K07177p43828l71666K6436j27907n61905p34291j42021l62969L319
2728.2D07559204j12495o02494p01522m69361j63231l17344j74599k37923p515k15797
2737.9D04556923k22130p8697l87192k08473k52304j44692k58293n1765k35214o12603
2747.5D02105560j70707K03628j27525j207199l25661l090n18379J3199k59171k36702
2757.2C99473953k91786j62926k93350n69916m00848l31383n7411k00577k45476o01387
2766.8C96318893j90620O371p52259p64694m23622K98500k81029o71806j36566k57454
2776.4C93145714p04270p27615l92113q93783n26848l98712m52309J53580j94817p18231
$$ plain form
2786.1 388290596 387450066 387302437 386993256 386304741 385492134 384899788 384941254 384269371 383639946 383145370
2795.7 383145370 382584419 381767235 380729675 380293617 379551735 379049606 378668823 378135452 377688599
2804.4 377688599 376984138 376089592 375142479 374441757 373720436 373393669 372516098 371364899 370805244
2813.1 370805244 369870338 369317780 368815727 368022766 367192459 366182518 365229912 364485207 363820648
2821.8 363820648 363060684 362555466 361739883 360619278 359357147 358188591 357106438 356059608 355570030
2830.4 355570030 354638939 353434105 352141647 351057625 350251122 348855667 347297859 345660400 343965302
2839.1 343965302 341826286 339903488 338057556 335705414 333341751 330870476 328729172 326003456
2846.8 326003456 323416481 321246948 318768978 316497955 314277458 312920933 311645184 310846615
$$ packed form
2786.1C88290596q40530j47629l09181o88515q12607n92346M1466o71883o29425m94576
2795.7C83145370n60951q17184j037560m36058p41882n02129l80783n33371m46853
2804.4C77688599p04461q94546r47113p00722p21321l26767q77571j151199n59655
2813.1C70805244r34906n52558n02053p92961q30307j009941r52606p44705o64559
2821.8C63820648p59964n05218q15583j120605j262131j168556j082153j046830m89578
2830.4C55570030r31091j204834j292458j084022q06503j395455j557808j637459j695098
2839.1C43965302k139016j922798j845932k352142k363663k471275k141304k725716
2846.8C26003456k586975k169533k477970k271023k220497j356525j275749p98569
$$ plain form
2854.6 310846615 310787849 310645657 310815487 310972061 311477852 311754761 312209435 312342606 311528378 311022091
2864.2 311022091 310530357 310166664 309731159 309145908 308209362 307340317 306625805 305720177 305576496 305124435
2873.8 305124435 304587307 304462719 304005566 303220787 302330456 301974182 301923790 301487713 300369015 299666939
2883.5 299666939 299054871 297854443 296732788 295780258 295249329 294330044 293469296 292679005 291268406
2892.2 291268406 289992580 288842850 288017921 287221241 286074390 284683933 283814297 283376465 282752743
2900.8 282752743 281967716 280693512 280051956 279272633 277736206 276420650 275089169 274177189 273228970
2909.5 273228970 271871777 270278511 268580151 266828499 264941063 263175106 261205215 259112530
2917.2 259112530 257211971 255645065 254177723 253069878 252169209 250982590 250220890 249788609 249829826
$$ packed form
2854.6C10846615n8766j42192J69830J56574N05791K76909M54674J33171q14228n06287
2864.2C11022091m91734l63693m35505n85251r36546q69045p14512r05628j43681m52061
2873.8C05124435n37128j24588m57153p84779q90331l56274n0392m36077j118698p02076
2883.5B99666939o12068j200428j121655r52530n30929r19285q60748p90291j410599
2892.2B91268406j275826j149730q24929p96680j146851j390457q69636m37832o23722
2900.8B82752743p85027j274204o41556p79323j536427j315556j331481r11980r48219
2909.5B73228970j357193j593266j698360j751652j887436j765957j969891k092685
2917.2B59112530j900559j566906j467342j107845r00669j186619p61700m32281M1217
$$ plain form
2925.9 249829826 250026035 250154400 250698776 251464615 252267971 252751846 253580437 254594402 255406437
2934.6 255406437 256219788 256708908 257623882 259053249 260225430 261104755 262202587 263408127 264335232
2943.3 264335232 265234203 265898342 266292000 267038345 267799911 268181400 268494263 268739548 269375191 269808445
2952.9 269808445 269911575 270039291 269895878 270661774 271534004 272090874 272600765 273000774 274094086
2961.6 274094086 274848404 275536709 276561260 277854137 279187279 280027866 280771618 281374245 282593880
2970.3 282593880 283833752 284839516 285977192 286874714 287542992 287756920 288735809 289922485 290268097
2979 290268097 290593910 291243420 291591492 291642532 292469788 293276634 293747787 294160309 294604206 294707642
2988.6 294707642 294224663 294359665 294613323 294942284 295183544 294890079 294823494 294969444 295055981 295048943
$$ packed form
2925.9B49829826J96209J28365N44376P65839Q03356M83875Q28591J013965Q12035
2934.6B55406437Q13351M89120R14974J429367J172181Q79325J097832J205540R27105
2943.3B64335232Q98971O64139L93658P46345P61566L81489L12863K45285O35643M33254
2952.9B69808445J03130J27716j43413P65896Q72230N56870N09891M00009J093312
2961.6B74094086P54318O88305J024551J292877J333142Q40587P43752O02627J219635
2970.3B82593880J239872J005764J137676Q97522O68278K13928R78889J186676L45612
2979B90268097L25813O49510L48072N1040Q27256Q06846M71153M12522M43897J03436
2988.6B94707642m82979J35002K53658L28961K41260k93465o6585J45950Q6537p038
$$ plain form
2998.2 295048943 295167542 294838524 294221840 293732586 293508263 293574409 293575077 293419571 292578773 292104130
3007.9 292104130 292012253 291835728 291543884 290839653 290477180 289683342 289102421 288995991 288575726 288109226
3017.5 288109226 287566643 287219448 286587029 285760593 284851894 284304466 283897572 283194809 282651348 281921921
3027.2 281921921 281581020 280965023 280042019 279038887 278098946 278003845 277472916 276783657 276170292 275776310
3036.8 275776310 275270576 274373131 274111137 273592224 272546158 271149063 270231762 269813499 269121342
3045.5 269121342 268473644 267640247 267128620 266464539 265446243 264472980 263642979 263136635 262357635
3054.2 262357635 261744690 261146965 260167961 259284649 258596153 258013096 257753239 257656364 256994019 256092663
3063.8 256092663 255428944 254973640 254472218 253969364 253303204 252599163 251982956 251162319 250784607 250387669
$$ packed form
2998.2B95048943J18599l29018o16684m89254k24323O6146O68j55506q40798m74643
3007.9B92104130r1877j76525k91844p04231l62473p93838n80921j06430m20265m66500
3017.5B88109226n42583l47195o32419q26436r08699n47428m06894p02763n43461p29427
3027.2B81921921l40901o15997r23004j003132r39941r5101n30929o89259o13365l93982
3036.8B75776310n05734q97445k61994n18913j046066j397095r17301m18263o92157
3045.5B69121342o47698q33397n11627o64081j018296r73263q30001n06344p79000
3054.2B62357635o12945n97725r79004q83312o88496n83057k59857r6875o62345r01356
3063.8B56092663o63719m55304n01422n02854o66160p04041o16207q20637l77712l96938
$$ plain form
3073.5 250387669 249935074 249307060 248321800 247635937 247124538 247054214 246260166 245403843 245231533 244905434
3083.1 244905434 244947052 244575596 243927536 243126335 242404747 242152462 241934109 241513519 240349350 239642677
3092.7 239642677 239239635 238433208 237603283 237058964 236859608 236349754 236222439 235741959 234470348
3101.4 234470348 233807259 233752937 233457279 232685833 232197990 231788139 231335049 230919952 230353928 229588547
3111.1 229588547 228836689 228341103 227939739 227986641 227414532 226254063 225582256 224951801 224432926 224188385
3120.7 224188385 224316826 223897038 222745380 221765194 221119232 220591373 219873199 219239674 218441315
3129.4 218441315 217834263 217364426 216968346 216846008 216127625 215425262 214900188 214400215 213846989 213027859
3139 213027859 212359276 211638889 211123085 210722446 210113564 209565887 209086952 208351631 207658024 207344971
$$ packed form
3073.5B50387669m52595o28014r85260o85863n11399p0324p94048q56323j72310l26099
3083.1B44905434M1618l71456o48060q01201p21588k52285k18353m20590j164169p06673
3092.7B39642677m03042q06427q29925n44319j99356n09854j27315m80480j271611
3101.4B34470348o63089n4322k95658p71446m87843m09851m53090m15097n66024p65381
3111.1B29588547p51858m95586m01364M6902n72109j160469o71807o30455n18875k44541
3120.7B24188385J28441m19788j151658r80186o45962n27859p18174o33525p98359
3129.4B18441315o07052m69837l96080j22338p18383p02363n25074m99973n53226q19130
3139B13027859o68583p20387n15804m00639o08882n47677m78935p35321o93607l13053
$$ plain form
3148.7 207344971 206665344 205951538 205508938 204889336 204251175 203613777 203125210 202728367 202132816 201608353
3158.3 201608353 201058369 200398216 200163116 199580173 198504868 197848911 197550259 197270412 196255322
3167 196255322 195421772 195227985 194599686 193836231 192929306 192351894 192210369 191583786 191020412 190966473
3176.6 190966473 190520344 189446259 188787308 188713379 188583126 187994633 187122135 186501026 185991211 185112724
3186.3 185112724 184299088 183798065 183315220 183024979 182780571 182574978 182173328 181758194 181491718 180612278
3195.9 180612278 179922237 179382095 178824673 178768921 178380585 177740803 177233582 176728401 176210670 176062794
3205.6 176062794 175880413 175290203 174852467 174261570 173683491 173449326 173418465 173109055 172470188 171962013
3215.2 171962013 171306877 170854931 170482273 169793892 169285812 169204216 169050064 168442497 167645340 167212391
$$ packed form
3148.7B07344971o79627p13806m42600o19602o38161o37398m88567l96843n95551n24463
3158.3B01608353n49984o60153k35100n82943j075305o55957k98652k79847j015090
3167A96255322q33550j93787o28299p63455r06925n77412j41525o26583n63374n3939
3176.6A90966473m46129j074085o58951p3929j30253n88493q72498o21109n09815q78487
3186.3A85112724q13636n01023m82845k90241k44408k05593m01650m15134k66476q79440
3195.9A80612278o90041n40142n57422n5752l88336o39782n07221n05181n17731j47876
3205.6A76062794j82381n90210m37736n90897n78079k34165l0861l09410o38867n08175
3215.2A71962013o55136m51946l72658o88381n08080q1596j54152o07567p97157m32949
$$ plain form
3224.9 167212391 167458439 167270432 166547680 166128941 165961494 165745564 165110703 164399548 163882313 163994198
3234.5 163994198 164051075 163368340 162583790 162099819 162051620 161729851 161498547 161074810 160588837 160581818
3244.2 160581818 160208988 160331116 159737062 158683834 158750448 158598557 158067656 157327681 157128029 157161751
3253.8 157161751 156608610 156164312 155939522 155820065 155327320 154725027 153950081 153235083 153391018 153656321
3263.4 153656321 153570185 153186655 152572727 152091074 152046947 151930408 151459761 151179934 151197901 151162729
3273.1 151162729 150518961 149886160 149820709 149688139 149144669 148819447 149072838 148922119 148630371 148548050
3282.7 148548050 147879734 147373857 147392206 147077236 146520538 146121740 146243658 147022009 147531271 147054977
3292.4 147054977 146074705 145528555 145571995 145577879 145228863 144794559 144523239 144414911 144456673 144121132
$$ packed form
3224.9A67212391K46048j88007p22752m18739j67447k15930o34861p11155n17235J11885
3234.5A63994198N6877o82735p84550m83971m8199l21769k31304m23737m85973p019
3244.2A60581818l72830J22128n94054j053228O6614j51891n30901p39975j99652L3722
3253.8A57161751n53141m44298k24790j19457m92745o02293p74946p14998J55935K65303
3263.4A53656321q6136l83530o13928m81653m4127j16539m70647k79827J7967l5172
3273.1A51162729o43768o32801o5451j32570n43470l25222K53391j50719k91748q2321
3282.7A48548050o68316n05877J8349l14970n56698l98798J21918P78351N09262m76294
3292.4A47054977r80272n46150M3440N884l49016m34304k71320j08328M1762l35541
$$ plain form
3302 144121132 143804903 143850803 143752337 143753309 143390636 142954798 142771730 142430716 142284889 142259207 142154684
3312.6 142154684 141700478 141617632 141641932 141293087 141359119 141127357 140846548 140575476 140093756 139909697
3322.3 139909697 139270954 138352232 137961807 138255777 138433914 137960863 137323923 136800709 136715069 136673422
3331.9 136673422 136058655 135523167 135548172 135363207 135015774 134533091 134166126 134522572 134198570 133516169
3341.6 133516169 133325958 133171787 133296585 132944670 132267857 132139530 132159195 131661606 131209497 131240940
3351.2 131240940 130913410 131083117 131615467 131282511 130821629 130565777 130829506 131181889 130893412 130677032
3360.8 130677032 130239706 129875383 130065355 129742270 129326591 129119005 128926678 129310741 129552984 129273396
3370.5 129273396 129053783 128943691 128366814 127839146 128367357 128791227 128502216 127865324 127455788 128031311
$$ packed form
3302A44121132l16229M5900r8466R72l62673m35838j83068l41014j45827k5682j04523
3312.6A42154684m54206q2846K4300l48845O6032k31762k80809k71072m81720j84059
3322.3A39909697o38743r18722l90425K93970J78137m73051o36940n23214q5640m1647
3331.9A36673422o14767n35488K5005j84965l47433m82683l66965L56446l24002o82401
3341.6A33516169j90211j54171J24798l51915o76813j28327J9665m97589m52109L1443
3351.2A31240940l27530J69707N32350l32956m60882k55852K63729L52383k88477k16380
3360.8A30677032m37326l64323J89972l23085m15679k07586j92327L84063K42243k79588
3370.5A29273396k19613j10092n76877n27668N28211M23870k89011o36892m09536N75523
$$ plain form
3380.1 128031311 128257008 127808952 127607822 127507486 127644157 127997046 128301849 128189192 127972260 128084755
3389.8 128084755 128256359 128628578 128748598 128276987 127584648 127411337 127816582 127832012 128018398 127910700
3399.4 127910700 127577076 128007288 128004332 127600536 127353220 127779627 128339252 127911148 127843428 128225718
3409.1 128225718 128330288 128185263 127839708 127605104 127636690 128332663 129031878 129104404 128966036 128620062
3418.7 128620062 128420191 128952866 129437056 129636106 129927940 129632645 129349098 129574480 130110579 130610075
3428.3 130610075 130439892 130690823 131205692 131310978 131376305 131279240 131605062 132270231 132499857 132278471
3438 132278471 132392845 132561703 132395315 132865868 133420944 133729582 134119682 134509878 135199833 135295439
3447.6 135295439 135024834 135394535 136123810 136717749 136792240 136717930 136878204 137393551 137985783 138081636
$$ packed form
3380.1A28031311K25697m48056k01130j00336J36671L52889L04803j12657k16932J12495
3389.8A28084755J71604L72219J20020m71611o92339j73311M05245J5430J86386j07698
3399.4A27910700l33624M30212k956m03796k47316M26407N59625m28104o7720L82290
3409.1A28225718J04570j45025l45555k34604L1586O95973O99215P2526j38368l45974
3418.7A28620062j99871N32675M84190J99050K91834k95295k83547K25382N36099M99496
3428.3A30610075j70183K50931N14869J05286O5327r7065L25822O65169K29626k21386
3438A32278471J14374J68858j66388M70553N55076L08638L90100L90196O89955R5606
3447.6A35295439k70605L69701P29275N93939P4491p4310J60274N15347N92232R5853
$$ plain form
3457.3 138081636 138174372 138653526 139222174 139756927 140142002 140336456 140715599 141499500 142125082 142604179
3466.9 142604179 143239431 143849277 144357815 144199896 144266205 145135279 145564470 145938931 146452770 146881762
3476.6 146881762 147460604 147637386 147924881 148631954 148987617 149463978 150515137 151168795 151462412
3485.2 151462412 152091446 152794504 153589153 154498262 155063047 155060673 155129671 156179266 157329712 158210001
3494.9 158210001 159073839 159378567 159690685 160231743 160919437 161945686 162804413 163198795 163496056
3503.6 163496056 164082718 164692955 165467644 166340504 167215614 168064098 168358212 168826885 169804058 171068840
3513.2 171068840 172111359 172821922 173645706 174073410 174613609 175594978 176326828 176920357 177681103
3521.9 177681103 178686771 179612160 180503063 181298409 182089005 183263817 184429665 185005455 185307159
$$ packed form
3457.3A38081636R2736M79154N68648N34753L85075J94454L79143P83901O25582M79097
3466.9A42604179O35252O09846N08538j57919O6309Q69074M29191L74461N13839M28992
3476.6A46881762N78842J76782K87495P07073L55663M76361J051159O53658K93617
3485.2A51462412O29034P03058P94649R09109N64785k374O8998J049595J150446Q80289
3494.9A58210001Q63838L04728L12118N41058O87694J026249Q58727L94382K97261
3503.6A63496056N86662O10237P74689Q72860Q75110Q48484K94114M68673R77173J264782
3513.2A71068840J042519P10563Q23784M27704N40199R81369P31850N93529P60746
3521.9A77681103J005668R25389Q90903P95346P90596J174812J165848N75790L01704
$$ plain form
3530.6 185307159 185952587 186965847 188063412 188849010 189801674 190844021 191973572 193273754 193766613
3539.2 193766613 194399548 195432091 196687317 198288326 199419880 199974556 200723457 202674370 203817062
3547.9 203817062 204567604 205982151 207287045 208455544 208924294 210480499 211999912 212968025 214212570
3556.6 214212570 214869995 216097031 217709389 219382153 220839214 222260094 223332520 224514923
3564.3 224514923 226695786 226769218 227580776 229652042 231132202 233267345 234424000 235761890 237522430
3573 237522430 239354210 240767708 242203388 243953552 244969025 246595459 248448334 250397053 252038879
3581.7 252038879 253547802 254900112 256314621 259566593 261124535 261441784 263493595 264472084 267070656
3590.4 267070656 269566193 271772594 273330688 274251499 276355171 277316856 279429836 282105026 283653984
$$ packed form
3530.6A85307159O45428J013260J097565P85598R52664J042347J129551J300182M92859
3539.2A93766613O32935J032543J255226J601009J131554N54676P48901J950913J142692
3547.9B03817062P50542J414547J304894J168499M68750J556205J519413R68113J244545
3556.6B14212570O57425J227036J612358J672764J457061J420880J072426J182403
3564.3B24514923K180863P3432Q11558K071266J480160K135143J156655J337890J760540
3573B37522430J831780J413498J435680J750164J015473J626434J852875J948719J641826
3581.7B52038879J508923J352310J414509L251972J557942L17249K051811R78489K598572
3590.4B67070656K495537K206401J558094R20811K103672R61685K112980K675190J548958
$$ plain form
3599 283653984 286323814 288155212 289723167 292242641 294253750 296962051 299850521 301458893 302051868
3607.7 302051868 305064144 307187347 308400936 312482357 313746357 314674129 317821445 318537750 322499847
3616.4 322499847 325957870 326915398 329101372 331016960 334056473 337102509 339951057 342588730
3624.1 342588730 345552444 348685303 351929398 356743279 357726784 354836082 358822746 363652039
3631.8 363652039 368816833 371498299 372473793 376097069 379833183 383045807 385893478 388236923
3639.5 388236923 390805893 393706818 396891670 400109100 403558540 407364120 411484604 412649803
3647.3 412649803 413596992 418183823 420133362 422094650 424939346 430130005 434435921 438322296
3655 438322296 443964958 442417641 445615921 450972366 453402443 456359253 458569336 461890564 464842682
$$ packed form
3599B83653984K669830J831398J567955K519474K011109K708301K888470J608372N92975
3607.7C02051868L012276K123203J213589M081421J264000R27772L147316P16305L962097
3616.4C22499847L458023R57528K185974J915588L039513L046036K848548K637673
3624.1C42588730K963714L132859L244095M813881R83505k890702L986664M829293
3631.8C63652039N164794K681466R75494L623276L736114L212624K847671K343445
3639.5C88236923K568970K900925L184852L217430L449440L805580M120484J165199
3647.3D12649803R47189M586831J949539J961288K844696N190659M305916L886375
3655D38322296N642662j547317L198280N356445K430077K956810K210083L321228K952118
$$ plain form
3663.6 464842682 467641182 470525627 472973099 477655067 480093231 481049232 481911621 479786644 484819641
3672.3 484819641 491912880 498441887 497649422 487681770 492425804 500058289 504418411 504508820 506967278
3681 506967278 510231094 512767181 514645615 516107826 517852745 521868896 526702805 519483299 519313240
3689.7 519313240 526502533 523306465 524714775 529591179 530536728 532315445 533526573 533645821 535529594
3698.4 535529594 536624527 538790245 541168137 537668953 537367020 541392059 543484039 544792175
3706.1 544792175 545621185 547726707 550435791 545390854 549331398 552940331 543596039 548821716
3713.8 548821716 552486916 552816582 554159012 555874367 556808662 554776459 556749420 561576080 559992294
3722.5 559992294 557928276 561207314 561758804 561402931 560271187 561739807 564792061 564536057 567537346
$$ packed form
3663.6D64842682K798500K884445K447472M681968K438164R56001Q62389k124977N032997
3672.3D84819641P093239O529007p92465r967652M744034P632485M360122R0409K458458
3681E06967278L263816K536087J878434J462211J744919M016151M833909p219506j70059
3689.7E19313240P189293l196068J408310M876404R45549J778717J211128J19248J883773
3698.4E35529594J094933K165718K377892l499184l01933M025039K091980J308136
3706.1E44792175Q29010K105522K709084n044937L940544L608933r344292N225677
3713.8E48821716L665200L29666J342430J715355R34295k032203J972961M826660j583786
3722.5E59992294k064018L279038N51490l55873j131744J468620L052254k56004L001289
$$ plain form
3731.2 567537346 565218239 561651077 568886604 566533165 560866470 564283295 566596146 566345367
3738.9 566345367 567509308 569603386 566439896 569243088 577189980 566453934 557835312 567074203
3746.6 567074203 572726669 576612053 571015663 562434349 571056061 567790146 565309715 571244164
3754.3 571244164 574877396 577451210 573577843 575548935 579929924 573299522 572254982 575866623
3762 575866623 577242966 577648773 580456963 578458405 574909630 577873535 581604042 580533066 574048271
3770.7 574048271 577405357 579876976 579960289 581093483 580638580 581320763 581493416 583659973 583219566
3779.4 583219566 577124062 579932289 582169456 583410683 584966621 582734756 582087784 582942924 583368263
3788 583368263 583584175 583850288 584508667 584736633 584925919 584867935 586269569 588647652 584542236 581345634
$$ packed form
3731.2E67537346k319107l567162P235527k353439n666695L416825K312851k50779
3738.9E66345367J163941K094078l163490K803192P946892j0736046q618622R238891
3746.6E67074203N652466L885384n596390q581314Q621712l265915k480431N934449
3754.3E71244164L633232K573814l873367J971092M380989o630402j044540L611641
3762E75866623J376343M05807K808190j998558l548775K963905L730507j070976o484795
3770.7E74048271L357086K471619Q3313J133194m54903O82183J72653K166557m40407
3779.4E83219566o095504K808227K237167J241227J555938k231865o46972Q55140M25339
3788E83368263K15912K66113O58379K27966J89286n7984J401634K378083m105416l196602
$$ plain form
3797.7 581345634 584139328 587239456 590668526 584886932 578147926 581922112 585070496 589172897
3805.4 589172897 591569633 583697701 582511902 586301956 587569695 587620277 587715569 587927246 589451256
3814.1 589451256 592878838 589948654 580909309 586371231 591044960 593413315 593914032 580860596
3821.8 580860596 583268776 587741089 588819618 590086250 589791107 587154083 587220497 589271126 592019539
3830.5 592019539 592096481 585626678 588590469 594166336 588692589 588674011 594109230 585745049 583931885
3839.2 583931885 590599174 587283516 587664032 593023491 590721626 587961884 590163345 590928574 590641174
3847.8 590641174 591316795 590664902 592536545 596741066 589716721 586570587 578909340 583375511 591407661
3856.5 591407661 589941292 588973007 591058426 592944107 594345741 590000801 590761986 594509926 589056358
$$ packed form
3797.7E81345634K793694L100128L429070n781594o739006L774186L148384M102401
3805.4E89172897K396736p871932j185799L790054J267739N0582R5292K11677J524010
3814.1E89451256L427582k930184r039345N461922M673729K368355N00717j3053436
3821.8E80860596K408180M472313J078529J266632k95143k637024O6414K050629K748413
3830.5E92019539P6942o469803K963791N575867n473747j8578N435219q364181j813164
3839.2E83931885O667289l315658L80516N359459k301865k759742K201461P65229k87400
3847.8E90641174O75621o51893J871643M204521p024345l146134p661247M466171Q032150
3856.5E91407661j466369r68285K085419J885681J401634m344940P61185L747940n453568
$$ plain form
3865.2 589056358 585935440 589825096 594163132 597227249 589854355 583861847 587265396 591132812
3872.9 591132812 592369576 586491585 588309898 591107597 590859795 592878571 595573616 590684814
3880.6 590684814 585821495 590433922 592262383 593680420 595957718 586029892 587840843 590518532
3888.3 590518532 590902824 594075623 592456589 587290421 589016571 590927734 589621391 590587578 591510429
3897 591510429 593043900 593334808 586469307 590680923 590418701 586296005 589849243 587507210 587926750
3905.7 587926750 588687477 588830948 590230560 591008873 591041870 590218735 590431099 590194664 589803734 590460739
3915.3 590460739 591632881 588940926 586701660 589646721 588982887 587373772 589087524 589846878 590211716
3924 590211716 588899803 587343826 588104248 589501381 590757446 590433388 589886551 590580177 588204575
$$ packed form
3865.2E89056358l120918L889656M338036L064117p372894n992508L403549L867416
3872.9E91132812J236764n877991J818313K797699k47802K018776K695045m888802
3880.6E90684814m863319M612427J828461J418037K277298r927826J810951K677689
3888.3E90518532L84292L172799j619034n166168J726150J911163j306343R66187R22851
3897E91510429J533471K90908o865501M211616k62222m122696L553238k342033M19540
3905.7E87926750P60727J43471J399612P78313L2997q23135K12364k36435l90930O57005
3915.3E90460739J172142k691955k239266K945061o63834j609115J713752P59354L64838
3924E90211716j311913j555977P60422J397133J256065l24058n46837O93626k375602
$$ plain form
3932.7 588204575 587058067 589005852 589170609 588848724 588421478 587948418 587615204 587123680 588356018
3941.4 588356018 588789978 586478767 586679955 588198814 588627548 588391457 587365494 588272400 588267708
3950.1 588267708 586290474 586995354 586999969 586957245 587686310 587796249 587867050 587303123 587369843 587154999
3959.7 587154999 587399406 587533226 586958847 587311211 586833801 586426849 586551399 587092476 587597847 587622375
3969.3 587622375 587664146 587134972 586661720 586502075 586745644 586833954 586828766 586814842 586879654 586998367 586442261
3980 586442261 586500626 586802292 586940308 586821136 586898651 586918297 586066628 586588745 587602348 587450943
3989.6 587450943 586427879 586513252 587432289 587097816 586891136 586693230 586796761 586952782 587017136 587515411
3999.2 587515411 586904488
$$ packed form
3932.7E88204575j146508J947785J64757l21885m27246m73060l33214m91524J232338
3941.4E88356018M33960k311211K01188J518859M28734k36091j025963R06906m692
3950.1E88267708j977234P04880M615m2724P29065J09939P0801n63927O6720k14844
3959.7E87154999K44407J33820n74379L52364m77410m06952J24550N41077N05371K4528
3969.3E87622375M1771n29174m73252j59645K43569Q8310n188j3924O4812J18713n56106
3980E86442261N8365L01666J38016j19172P7515J9646q51669N22117J013603j51405
3989.6E87450943j023064Q5373R19037l34473k06680j97906J03531J56021O4354M98275
3999.2E87515411o10923
$$ plain form
4000.2 586904488
$$ packed form
4000.2E86904488
##END=$$ End of the data block
