##TITLE=$$ Begin of the data block
##JCAMP-DX=5.00 $$ ACD/SpecManager v 10.08
##SPECTROMETER/DATA SYSTEM=Varian
##DATE=15 Jan 2013 15:29:42
##DATA TYPE=INFRARED SPECTRUM
##DATA CLASS=XYDATA
##ORIGIN=
##OWNER=
##NPOINTS=3735
##FIRSTX=399.26403809
##LASTX=4000.35498047
##MAXX=4000.35498047
##MINX=399.26403809
##MAXY=67.56799316
##MINY=24.54460716
##XFACTOR=1.0000000000
##YFACTOR=0.000000100000000
##FIRSTY=39.79777908
##DELTAX=0.96440572
##XUNITS=1/CM
##YUNITS=TRANSMITTANCE
##XYDATA=(X++(Y..Y))
399.3 397977791 396077232 404170227 414361954 419162064 411586342 402281494 406525421 410678406
407 410678406 407258492 400828514 392338982 390383263 393755150 399813652 408248520 413970413 418813667
415.7 418813667 418966522 410441170 402402382 402145309 394589310 398708801 403497505 403036575 404812508
424.3 404812508 406988792 407719879 406972237 407382622 406147499 403004303 400746918 395502357 393038788
433 393038788 395196114 398795738 403480034 407214432 405994911 403156471 404514046 404107857 399011383
441.7 399011383 399059486 402881165 401072731 397955208 400756645 404985199 403764381 401102028 399948769
450.4 399948769 398686523 397794418 398388214 398788300 400297546 400809135 392856216 386895294 394914093
459.1 394914093 395652809 395356522 396266289 393027115 393207474 396745758 397913399 394145470 393053284
467.7 393053284 399293709 400412407 395799904 391403999 392012215 395168228 394825478 393877525 392448196
476.4 392448196 392469940 392201462 388585091 386202507 389693642 392894554 390729179 386126213 384722404
485.1 384722404 389764481 393340721 389210091 387008095 387038422 384826736 385604706 386897659 386876907
493.8 386876907 389753799 391163750 388534393 383763008 381352310 383398972 382883835 380929489 384721680
502.5 384721680 387409744 388656464 391368408 389876289 387018051 387191544 388252029 388189392 384650269
511.1 384650269 383369675 385212975 384469337 381739082 380067711 379388237 378647423 380217094 381971054
519.8 381971054 381933022 381191025 379364853 379394951 380381165 379882050 379587402 379648743 378979874 378227005
529.5 378227005 377286453 376879349 378393707 380399475 382192574 382205658 379766273 377241669 376828957
538.1 376828957 377658653 377574539 377066689 375780373 375477028 376156654 375425644 374023666 372420883
546.8 372420883 372122078 372875595 374418526 374871216 372905350 371201477 371168289 372760887 372095451
555.5 372095451 370056801 369080086 367550201 366577988 367822227 370311165 371038475 371307411 372473717
564.2 372473717 372349358 369786644 368321686 369842873 369955635 369811096 369464493 369247246 369787827
572.9 369787827 369299393 369807930 369014740 367367554 367602119 368044548 369092407 370030823 369441299
581.5 369441299 368054924 368095398 369366837 370049515 369574547 368915138 368383255 368503265 369486122 368697968
591.2 368697968 369079323 371116829 371372681 370389748 368964310 370013542 371374130 370726013 370926094
599.9 370926094 371866417 372052193 371323318 370396767 369687119 369081650 367949715 366640739 366322021
608.5 366322021 366966743 367860641 368010216 367421608 366561623 366556358 366177254 364603043 364263420 365062103
618.2 365062103 365737648 366296043 366824303 366991425 367911186 368540115 367716675 367429619 368316040 370462685
627.8 370462685 371937790 372044945 372664261 374061394 375730286 377370872 379042015 379932137 379554710
636.5 379554710 378425293 378934059 380663795 381088982 382567291 384366379 385132370 386626892 388578415
645.2 388578415 389180489 388083992 387856865 388907509 389656219 389480438 389911003 392126884 392364883
653.9 392364883 391171761 391723938 392422638 391945763 391289139 391247292 390559616 389998703 389869347 389549599
663.5 389549599 389413109 389054451 389931450 390025177 384927826 388715591 390406380 389976044 390980034
672.2 390980034 392548790 393752747 394750443 395174828 396242142 397048569 396846924 397708168 398788757
680.9 398788757 399363213 400183678 400433960 400771332 402531471 404681206 405213509 405221596 405847054 406001701
690.5 406001701 406440010 406625633 406665268 408130417 409183540 409361649 409835243 410978317 412325401
699.2 412325401 412181168 411702614 411600647 411193542 412129097 413554573 414085274 414295044 415009880 416661224
708.8 416661224 417546425 417646599 417456360 416549797 416706696 418678513 420556755 421190147 421416435
717.5 421416435 421655312 422032242 422159958 421709480 421505280 421242371 422032356 424338531 425668373
726.2 425668373 425807381 426615181 427836800 428183022 427981033 428084717 429093475 430266380 430592728
734.9 430592728 430639381 430857735 431099319 432069206 433071404 431882896 430847244 431286507 431673546
743.6 431673546 432413597 433462982 435021133 436215172 436820335 437266273 437983971 439144897 439038620
752.2 439038620 438707047 439024773 440337181 441532822 441842194 443207436 444000053 444112015 444759483
760.9 444759483 445619812 446012573 446135368 447516975 449186516 450381699 450921593 450772934 450156975
769.6 450156975 449795113 450040817 450032043 450223694 451085091 451800003 451068153 450322456 449988899 450307846
779.2 450307846 450995827 450399246 451099586 451460304 450913582 451552658 452012901 452377586 452386894 452976990
788.9 452976990 453972473 454389648 454106140 453674202 453967590 454149933 453624039 452903900 454190216 454949760
798.5 454949760 453926506 453098679 451957626 450688858 448535652 447162933 447056732 447150955 446045532
807.2 446045532 444261398 443731728 442093315 440150146 438624458 437844543 438000793 437871857 437419281
815.9 437419281 436447220 436257286 435431442 434378471 434595375 435747375 437196693 437301598 437914505
824.6 437914505 439843521 442656097 444782715 446526260 449039879 450795746 453190727 455415382
832.3 455415382 458499107 462035484 464237976 466988945 468648529 468937263 468927078 470471153 473254852
841 473254852 475945396 477801361 478752899 480512047 481497383 482588158 484157562 485755272 486365929
849.6 486365929 485716019 486516953 487501945 488548660 489866409 491154938 492579842 494170532 495109520
858.3 495109520 496198540 498094292 498077011 499112015 500762711 501474152 502218399 502399902 501961288
867 501961288 500120354 499718399 499089966 497986336 497200661 496171532 496463242 495440788 494291649
875.7 494291649 493577347 492821846 491911430 490655632 489999466 489127197 488641815 487896843 487234039 486493683
885.3 486493683 486410751 486178741 484737053 484255791 483509941 483623123 483561440 483223686 483287010 482633438
895 482633438 483035851 483321686 484121323 484062996 482881088 482581787 482361183 482050858 481048317 481227417
904.6 481227417 482191849 483469238 485409698 487692528 490119209 491130943 492217064 492578926 491937675
913.3 491937675 491542435 491260223 490518532 488954964 487136307 485026665 483700638 481710205 478955803
922 478955803 476277199 473855705 471917191 469087868 466443062 463529968 460292206 457818298 455825310
930.7 455825310 453482895 451097069 449923973 448778572 447438240 445904350 444645462 443912392 443251190
939.3 443251190 442780075 441786537 441341972 441183510 440480232 439155045 438076401 437541161 436535072
948 436535072 436663857 437053566 437116814 436851387 436420555 437071800 436690407 435740089 434960861 433810043
957.7 433810043 432347794 430537453 428965378 427676163 426717873 425078392 423460274 422524948 420932617
966.3 420932617 418867340 417225647 415676613 413443184 411685371 410469933 408600464 406321220
974.1 406321220 404016418 401395531 398295212 395015602 391469040 388337059 385571938 382030411
981.8 382030411 378334389 375194778 372020264 368603439 364920807 361018448 357294426 354877548
989.5 354877548 352748146 349380760 346764183 344775009 343225365 341603584 339074326 337190933
997.2 337190933 335025330 332787361 330808334 328124123 325532303 323873978 322966080 322062950 320812912
1005.9 320812912 319408073 318400097 316922531 315632114 314865704 313415928 311699677 310707645 310206299
1014.6 310206299 308429203 306675224 304949379 302914410 301290207 299627419 298398781 296477432
1022.3 296477432 295337639 294381561 293190117 292334595 290494785 289170666 287641773 286729794 285654945
1031 285654945 284653931 284782124 284289742 284468975 284503059 285376930 286775513 287474957 288450127 289880543
1040.6 289880543 291519108 292445354 293050957 292963753 293450832 293393288 291955719 291061535 290490322 290034428
1050.2 290034428 288713989 287836494 287484550 287595425 286743374 284571648 283980217 283578110 284098988
1058.9 284098988 284593430 284908257 286282673 288710728 291144962 291980305 293612404 294638977 295540257
1067.6 295540257 296408825 296954632 298653908 299915676 300972347 301669445 302484207 301821384 300973225
1076.3 300973225 301431828 302106533 303452263 303403645 303616276 303980045 304810581 305909615 306451588
1085 306451588 307553883 307316189 308150692 308885098 308767738 309666481 311457729 313558521 314024506
1093.6 314024506 314806767 315725861 317101440 318177547 318194714 319176884 320081367 321507378 322988701
1102.3 322988701 323960152 324479637 325214577 326396942 326665573 326703033 327034836 327936707 328531303 329263039
1112 329263039 330152359 330734787 331648369 332122574 332303696 332445259 333044815 332909584 332358322 332791290
1121.6 332791290 333193779 332625122 331771851 333139839 334300385 334551239 335063782 335463943 336859093
1130.3 336859093 338539276 341192436 343112068 343828964 344850998 346356506 348919411 351247330
1138 351247330 353342323 354766769 355985832 357577667 358721199 359441986 359807892 360367813 360870476
1146.7 360870476 361765862 362575951 362714386 362776642 362619667 362821999 363040085 363090057 362647934 361985664
1156.3 361985664 361657639 360829887 360271454 360100555 359503746 358471680 358552704 359281883 358979416 359605026
1166 359605026 361610909 363780098 365646515 367579651 369794312 371935463 374140434 376356354 378655853
1174.6 378655853 380962563 382776146 384672012 386958504 389312744 391765900 393914261 395817299
1182.4 395817299 396957588 397790565 398808632 400005989 401674805 402927895 404222717 404832497 405049095
1191 405049095 405489349 405115547 404820518 404250870 403486710 403131790 402550049 401701546 401148911 400855293
1200.7 400855293 400250931 399243851 397610550 396253281 395460701 394657784 394384956 394205475 393978767
1209.4 393978767 393926888 393604546 393121834 392539940 392051163 391453438 390676956 390535431 390629768 390513382
1219 390513382 390673752 390600700 390213242 390112343 389769211 388811378 387717133 387205353 386974945 386464043
1228.6 386464043 386124496 385841637 385288887 384586029 383998642 383587646 382906380 382244568 382091904 382545128
1238.3 382545128 382873001 382520027 382173653 381968040 381758766 381190414 380489044 380087509 379898796 379893074
1247.9 379893074 379482956 379054184 378880463 379090157 379470367 379175072 378779831 378343468 378003197 378026466
1257.6 378026466 377964478 377690544 377648277 378191109 378506241 378691978 378898277 379089890 379531555 379944763
1267.2 379944763 380294380 380634193 381196861 381934242 382697716 383275223 383630714 384358330 385343857 386169052
1276.9 386169052 386981812 387655373 388352242 389115067 389752388 390866814 392200279 393303566 394014359
1285.5 394014359 394933128 396255798 397005501 397997551 398972511 399403687 399835510 400588188 401468849
1294.2 401468849 401944771 402418861 402939796 403680649 404316826 404720192 404736404 404385948 404444580 404611435
1303.9 404611435 405090294 405126572 404504166 403872681 403414383 403454514 403207359 402404251 401156387 400414352
1313.5 400414352 400285645 400088387 400101013 399960022 399920578 400174904 400955772 402025108 402583275 403012238
1323.2 403012238 403576241 404237251 404831161 405323105 405661011 405803299 405454140 405084724 404773178 403908730
1332.8 403908730 403513412 403425865 403061523 402987518 403264732 403452797 403806496 404848480 405259781 405479012
1342.4 405479012 406002960 406770401 407889900 408619385 408842659 408877068 409258842 409515762 409399109 409268265
1352.1 409268265 409559898 409759903 408857422 408295746 408223457 407980003 407622299 407733498 407459831 406198730
1361.7 406198730 405589218 405145798 405658493 405981522 405589218 405106163 404409828 404658737 404517784 403956757
1371.4 403956757 403812256 403616104 403039665 402544975 402923355 403341675 403379593 402887802 402849236 402543869
1381 402543869 401625671 400586319 399283447 398511162 397497406 396605492 395190125 394016800 393463402
1389.7 393463402 392046242 390617561 389202919 387886810 385039062 381886063 380970421 379965172
1397.4 379965172 379026413 376407928 374585495 373709984 371881561 370328293 368966904 366489754 364263077
1406.1 364263077 363459053 362424278 360773888 359593468 358675842 357661743 356305885 355294266 354394951
1414.8 354394951 353404121 352897873 352488670 352710533 350979996 350814438 351963692 352149773 352542343
1423.4 352542343 351878738 352478638 353776474 354212875 354733047 354663773 355314598 356562157 358326721
1432.1 358326721 359710274 360822411 362384911 362769661 362893372 364207077 366651955 368365288 369620628
1440.8 369620628 371318436 372292862 373558426 374301300 375456848 376429672 377121849 378059044 379309158
1449.5 379309158 381195297 382088814 383114815 383908691 385421600 387229919 388497353 390048523 388123436
1458.2 388123436 390570869 393087921 395877914 397911072 398946381 400289879 400245743 402493706 404687271
1466.8 404687271 407104568 409119034 410914917 413550987 415725555 417391357 417910118 421303978
1474.6 421303978 424091873 425630112 428329849 430794029 432873497 434425926 435515785 436560707
1482.3 436560707 438071976 439458008 440418472 441225357 441467209 442344780 443605232 442947426 442396736
1491 442396736 443481483 444237938 443856621 443356056 442624741 439049759 439618301 438683968 436326904
1499.6 436326904 436118851 434933395 433798256 433175201 433497009 432553368 427841988 424921074 426379242
1508.3 426379242 428376656 427892151 428321609 427269478 426060104 426024399 424982224 424294510 421756439
1517 421756439 420290031 421500587 422819939 421361427 417905884 418853416 420027695 421049767 419656639
1525.7 419656639 420493622 421447754 421212349 421801071 422230377 422950363 423585625 423089409 421180611
1534.3 421180611 422908020 424078598 424605064 425690422 422618866 421088104 422001534 423005905 423042145
1543 423042145 424207687 425053101 423985901 425391312 425761681 426133614 424888878 423506889 425074730
1551.7 425074730 425991211 426662254 423453445 423830528 425201874 425123253 418260231 406648178 416570473
1560.4 416570473 418190994 419004707 417890701 416673470 413803902 411400414 411110268 409410362 407860451
1569.1 407860451 400826111 399977036 398849525 395946121 393488464 390965385 389343376 379554176
1576.8 379554176 379629898 377745361 374722595 371835709 368014526 365526466 361359138 359431114 355680084
1585.5 355680084 352488899 349435463 345389137 343183479 338880959 336364059 332248268 330079231
1593.2 330079231 327474213 324047546 322395668 318766460 317226639 313895283 312304001 309833660
1600.9 309833660 307351379 305442638 302224236 301967030 299542770 298605747 296129723 295014725 293926868
1609.6 293926868 291689358 292199039 290295715 290258446 288835335 289409485 289159107 284991741 287241688
1618.2 287241688 286149902 286843567 285726624 286682491 286571770 284561558 286103878 285801144 287426128
1626.9 287426128 286292133 287030010 287500267 288233051 288999596 288304310 290017128 290056782 291556149
1635.6 291556149 290449467 292046356 293518715 294696751 296733437 297036228 299066677 299367008 301011715
1644.3 301011715 301921597 300462837 302047729 302005653 305204773 305707169 308078327 309394398 307203026
1653 307203026 307708435 307436657 310965481 311695309 313238335 313736267 315123749 316858692 318003826
1661.6 318003826 320209770 319743023 322423325 323973770 326203537 328542442 330293388 332657509
1669.4 332657509 333658524 337394066 338788414 342306976 345540581 347595596 349624863 351915245
1677.1 351915245 355510979 357808075 361376419 363549690 366710777 370149956 370452652 377646599
1684.8 377646599 379501076 384047585 386957474 389496880 392998657 396509018 400590401 403932838
1692.5 403932838 408044777 411598854 414768715 417119141 422391396 427237740 431520500 436015892
1700.2 436015892 435579491 441275597 445533829 448919487 451400452 454414368 457324066 460014572
1707.9 460014572 464052773 466721268 468831329 471255417 473865509 476491280 477300644 478663025
1715.6 478663025 481492348 484226341 482409706 484777794 487582550 489595222 491618156 492676582
1723.4 492676582 494107170 495817642 497357979 498921127 500523682 502325211 502238846 503340569 506728058
1732 506728058 509109726 506490021 504794922 510221672 514201431 516176071 518743401 519871559 519760513
1740.7 519760513 523677368 526355858 527259903 529729614 533315544 536471329 538829498 541953735
1748.4 541953735 544748802 549263802 551033745 552552872 557824631 561464539 565438652 569072266
1756.2 569072266 570136147 572576332 575784531 579181404 582487602 582606773 583706741 586903687
1763.9 586903687 589035416 591426125 593995590 595604057 594450150 597132492 601455765 601743011
1771.6 601743011 600076103 599789619 604185829 606828537 606638184 609089127 610404205 612053680 612547646
1780.3 612547646 612031975 614041328 616404610 618283539 617723312 618382950 620517883 621634827 622619553
1788.9 622619553 624306030 624766159 625203209 624334641 624162865 627928047 628969231 628518105 630151939
1797.6 630151939 632064476 632515526 631445389 633563919 634175949 634961739 636740570 637577438 638796387
1806.3 638796387 639188957 639588699 640544128 641632080 641054840 641513367 642789078 643666840 645062408
1815 645062408 645270233 646183472 646411438 646863480 647749939 647831802 648644485 648263931 649733582 651192245
1824.6 651192245 649002762 649620514 652116547 654151688 653468018 650383682 651665726 654037399 654439468
1833.3 654439468 654940567 655657043 656206512 656626892 656428833 657641830 657936554 658416824 658769760
1842 658769760 659938431 660488586 655254288 658256760 661320496 661251221 660535431 661149292 662292633
1850.7 662292633 662218323 662918701 662973404 663589554 664012070 664060898 664739838 664533997 665014648 665116425
1860.3 665116425 665546188 665716095 666075897 666279602 665916672 666774521 666877060 667865448 666923828 665520248
1869.9 665520248 666657791 667570572 668517914 668540268 668813553 668752365 669184875 669279175 669184418 670096970
1879.6 670096970 670101242 670412979 670373611 670647736 670139236 669665375 670580215 671008377 672221298 671604385
1889.2 671604385 669837494 670503235 671695709 672096863 672141571 671907043 670993118 672103653 672779694
1897.9 672779694 672744980 672898483 673017578 673246841 672971039 673373032 673193054 673320847 673518372 673608322
1907.6 673608322 674006119 673728561 673656387 673682175 674396057 674094543 674149399 674255676 674163208 675132217
1917.2 675132217 673069763 672885666 674243698 675095673 675679932 674441376 674190140 674632874 675164795
1925.9 675164795 675030289 675082932 675339508 675171967 675121918 675060349 675397949 674729233 674678116 674802628
1935.5 674802628 674725113 674786911 674387817 674929886 674990311 675454941 674722824 673120956 674116135 674458618
1945.2 674458618 674005280 673819275 674333115 674227219 673938370 673948135 673851852 673885498 673718262 673868790
1954.8 673868790 673342361 673403015 673646622 673673325 674086151 673723907 673825226 673873596 673702545 673286667
1964.5 673286667 673195953 673553848 672883148 672380295 672585602 673016815 672888412 673068771 673112183 672857513
1974.1 672857513 672895279 672401505 672313614 672362671 672760086 672881241 672853088 672902374 672450562 672362518 671989136
1984.7 671989136 672217178 672482681 672572861 672263870 671328278 671504593 671316681 670629196 670520325 671148758
1994.3 671148758 671306839 670970230 671007919 670693054 670733566 670425034 670141449 670011520 670056000 669998550
2004 669998550 669403229 669504700 669312210 669120483 668876648 668944931 669162750 668751602 668631973 668455276
2013.6 668455276 668655319 668622742 668489075 668039246 667641525 667569962 666995850 666985550 666897736 667161026
2023.3 667161026 666613693 665983200 666209717 665666199 665802917 665584564 665343246 664995499 664424133 664502106
2032.9 664502106 664238815 664228058 664288101 664579773 664192352 663801498 663728943 663233719 663145523 662857208
2042.6 662857208 663043747 663003311 662855148 662576904 662312622 662475739 661801987 661649094 661690903 661841965
2052.2 661841965 661665573 661138992 661071930 660758209 660604172 660335999 660703278 660733414 660323563 660016708
2061.9 660016708 659647598 659988327 659653091 659501953 659619904 659820938 659927979 659478760 659332352 658961029
2071.5 658961029 658784637 658657532 659014969 658997421 658465729 658591843 658618774 658701019 658323517 658256073
2081.1 658256073 658250122 658088379 658004379 657607727 657538986 657230682 657169342 656659012 656116409 656085434 656055984
2091.7 656055984 656228256 655895233 655928726 655805817 655582581 655352707 655150909 655051651 654462738 654449615
2101.4 654449615 654358521 654594193 654571304 654393463 654598389 653912582 653307495 652700500 652677460 652820282
2111 652820282 652653122 652385025 651825943 651924667 652081223 652053680 651719437 651592178 651216888 650736847
2120.7 650736847 650847244 650770874 650970840 650963211 651080551 650699387 650219727 650294647 650018158 650019150 649671097
2131.3 649671097 649861908 650120010 649927750 649852829 649710922 649976959 649752579 649492416 649241714 649307480
2140.9 649307480 649484787 649440689 649477463 649260941 649549103 649397812 649199524 648942642 648874130 649214478
2150.6 649214478 649004898 649244308 649160080 649138718 649164276 649453430 649904404 649441071 648895035 648487701
2160.2 648487701 649201584 649334717 648869781 648887787 648997574 649431305 649177170 649297562 649225845 649049911
2169.9 649049911 649106140 649179916 649437561 649051743 649111862 648936615 649027863 649222870 649225616 649279556 648720169
2180.5 648720169 648980179 649099731 649434662 649610596 649414215 649636612 649301987 649227219 649036560 649033813
2190.1 649033813 649036560 649241791 649536057 649272308 649151535 648713303 649064636 649423752 649443970 649427948
2199.8 649427948 649331741 649796829 649846039 649965897 649816437 649591599 649489822 649649200 649972382 649669266
2209.4 649669266 649750137 649717178 649787369 649884720 649929733 649856949 649720688 649854431 649275970 649402084 649752502
2220 649752502 650037003 650371017 650239029 650271149 649798126 649451447 649296875 649574966 649713974 649686737
2229.7 649686737 650032425 650102081 650374603 649984436 649730682 649599762 649354553 649412994 649334793 649455719
2239.3 649455719 649220200 649375610 649287720 649273148 649308853 648894882 649071960 648755188 648842392 648915253
2248.9 648915253 648773651 648994904 649117203 649320602 649057159 648754196 648163834 648168106 648174286 647923737
2258.6 647923737 648330917 648242645 648368607 648571396 648750458 648657837 648482513 648475571 648208618 648253098
2268.2 648253098 647979889 647962112 648116684 648110428 647725983 647540359 648027039 648123703 648274231 647828445
2277.9 647828445 647699585 647732925 647447662 647636566 647586136 647708893 647408752 647109222 646611862 646281281
2287.5 646281281 646560287 646620712 647067184 646923599 646714706 646265488 646020660 646205063 645588913 645300751
2297.2 645300751 645210953 645356216 645052872 645092087 645443115 645117645 644869766 644399261 644401627 643927231
2306.8 643927231 643516312 643076477 642686005 643207245 643186493 643551712 643124466 642887497 642934265 642404633
2316.4 642404633 642498856 641614227 640835190 640720367 641066513 641200714 641085510 640554886 640211868 641077805
2326.1 641077805 640467148 640016174 639750099 639349632 639181213 638707695 638372726 638214874 639455147
2334.8 639455147 639160500 638569031 637987480 637252998 637971191 637836647 637613640 637479591 637839966 636703529
2344.4 636703529 636030426 637208519 637143745 637049103 637440186 637794685 636658363 636230011 636552124 635750580
2354.1 635750580 635193939 634894829 636007347 634845390 633757057 633114281 633310890 634030075 631561775
2362.7 631561775 631393089 630782204 630314445 630706940 631100082 631523819 631126060 632326393 633007812
2371.4 633007812 633447075 633048172 632449570 632543488 632606392 632529411 631918755 632194214 632196770 632118416 631982574
2382 631982574 631843567 632191696 632075043 631969528 631067352 630557404 630627556 630480423 630521812 630158386
2391.7 630158386 629872093 629229126 629184113 629433746 629418907 629487038 628883018 628570442 628327141 627848206
2401.3 627848206 627250710 626830673 626105843 625746727 626346436 626210823 626227379 625992050 625502396 625024338
2410.9 625024338 624319115 624129066 623841248 623853149 623617897 623389893 623254433 622734528 622329865 621947289
2420.6 621947289 621695633 621187744 621120911 620878105 620391273 620064774 619545288 619574585 619279137 618765182
2430.2 618765182 618269501 618087959 617954292 617423706 617073097 616701088 616760139 616459160 616186943 615834427
2439.9 615834427 614974937 614794350 614675789 614492874 613835564 613085098 612934380 612880630 612555542 612193718
2449.5 612193718 612013474 611484604 610941582 610328255 610186386 610066986 609777336 609792519 609239311 608903008
2459.2 608903008 608351784 607656326 607114220 606645889 606571808 606320038 606333466 605968590 605392609 604827614
2468.8 604827614 604431686 604321060 603845901 603572273 602897110 602303429 602131882 601931610 601501694 600850525
2478.5 600850525 600518379 600116844 599798546 599090233 598477058 598117676 597635727 597425652 597121353 596839790
2488.1 596839790 596227493 595915375 595410995 594714432 594344559 593497238 593186035 592901764 592518082 592179642
2497.7 592179642 591742096 591369209 590752106 590359001 590021667 589891167 589238014 588705254 588479691 587537918
2507.4 587537918 587013130 586631966 586196671 585876694 585804443 585487099 584868660 584443855 583781433 583398514
2517 583398514 582856750 582533607 582294044 581728897 581414261 581087532 580954056 580570869 580291061 579733772
2526.7 579733772 578923645 578677711 578328590 577878342 577608681 577555656 576805992 576229706 576148109 575665741
2536.3 575665741 575308533 574906883 574548492 573730354 573273773 573314934 573012161 572955322 572554741 572033501
2546 572033501 571490326 570682335 569913101 569634438 569634438 569490662 569266434 568694305 568528786 568300400 567747803
2556.6 567747803 567110023 566369629 565974121 565614357 565461273 565106812 564848557 564469185 564023247 564022713
2566.2 564022713 563526955 562934380 562261391 562219887 562365913 561798782 561500816 561215515 560653000 559837532
2575.9 559837532 559593277 559415169 558762398 558179131 557543983 557258301 557049522 556810989 556376495 556018448
2585.5 556018448 555775528 555348511 554949493 554526443 554526749 554278297 553880882 553551903 552949753 552465897
2595.1 552465897 552317200 552181358 551384659 550945892 550599823 549983597 549433937 548886147 548665161 548157501
2604.8 548157501 547994385 547622414 546980705 546933289 546609535 545935936 545242462 544989166 544532509 544070930
2614.4 544070930 543879089 543462639 542917671 542228127 542022133 541538696 540942726 540788841 540509453 540026321
2624.1 540026321 539523964 539280853 538627853 538034439 537604218 537054176 536609116 536350250 536291466 535499268
2633.7 535499268 534476585 533747330 533450546 533390503 533194923 532889519 532285995 531721802 530961876 530791931
2643.4 530791931 530818367 530256424 529626884 528826332 528260536 527798691 527672005 527395554 526978531 526480064
2653 526480064 525572472 525344963 524957848 524462738 524163094 523732414 523364220 523077927 523018646 522434769
2662.6 522434769 522045784 521891861 521214256 520493088 520179749 520063553 519781723 519576530 519204407 519136887
2672.3 519136887 518908081 518345032 517831917 516928902 516515541 516548157 516472931 515856705 515394135 515141907
2681.9 515141907 514382935 514075890 514086800 514066162 513736916 513261261 512500114 512182503 512518692 511944733
2691.6 511944733 511475449 510915604 510473404 510474014 510075760 509646835 508969650 508765221 508620148 508191071
2701.2 508191071 507827988 507692566 507605476 507104111 506847191 506124153 505832748 505996971 505519676 505055809
2710.9 505055809 504361763 504135818 504100647 503739548 503569717 503495979 503058434 502732849 502979240 502655716
2720.5 502655716 502307701 502330818 502260780 501757240 500949402 500566254 500153084 499929161 499856491 499683037
2730.2 499683037 499365997 498996162 498757477 498470535 498635826 498850708 498585014 497959023 497528458 497251854
2739.8 497251854 497156715 497425995 497234726 497173996 497157707 496860733 496652336 496584854 496651993 496546936
2749.4 496546936 496302147 495597916 495408287 495479851 494705200 494089088 494119263 494215050 493712463 493492126
2759.1 493492126 493712502 493794098 493555107 493105850 492731209 492195816 492415123 492371941 491570473 491292610
2768.7 491292610 491192703 491100502 490750961 490265846 490160866 490372887 489949837 489341354 489221230 488807869
2778.4 488807869 488292580 487596359 487220612 487143860 487067947 487044296 486687927 486277428 485787086 485664673
2788 485664673 485374184 484874802 484397125 483771362 483456535 482856293 482410240 481877289 481425819 481261063
2797.7 481261063 480688667 480204315 479680977 479534950 479242592 478445053 477843704 477610321 477325020 476666222
2807.3 476666222 476269073 475598259 474995918 474487991 473845177 473093300 472196617 472092514 471512871 470821953
2816.9 470821953 470396080 469584885 469064636 468431473 467923393 467515411 467133980 466335106 465368958 464866524
2826.6 464866524 464274750 463784218 462838287 461929398 461443748 460660973 459679642 459132271 458879814 457740364
2836.2 457740364 456597443 455475960 454092636 453237801 452346535 451078339 449354782 447862549 446739883
2844.9 446739883 445298271 443570023 441940346 440303841 438125420 436364365 435685387 435010834 433879395
2853.6 433879395 433224983 433045883 433102188 433529587 433493729 433240967 433087120 432826920 432607574 432396126
2863.2 432396126 431902542 431193542 430791893 430230904 429556351 428968277 428202934 427494659 427031364 426873703
2872.9 426873703 426531830 426016998 425710793 425278740 424571457 424331207 424099541 423361244 423031578 422522545
2882.5 422522545 421893044 421480293 420746384 419946022 418991165 418258820 417796898 416971016 416168518 415752182
2892.2 415752182 414968147 414211464 413894119 413119926 412310867 411489754 410785065 410482903 409945297 409258080
2901.8 409258080 408747063 408313751 407379799 406456261 405781097 405160446 404783974 404267921 403452873 402308388
2911.4 402308388 401589432 400964584 399856262 398570900 397424088 396658058 395331917 394145279 393379593
2920.1 393379593 392430573 391738129 391230011 391016693 390706558 390326309 390041771 389883728 389991417 390426674
2929.8 390426674 391054573 391302071 391520233 391591339 391601410 391884422 392299728 392655373 393074150 394028130
2939.4 394028130 394941750 395566788 395774536 396172676 397030525 397746964 398327942 398483276 398840065 399085426
2949.1 399085426 399451866 400379410 400752983 400604362 400365105 400679893 401121979 401567764 401827545 401789513
2958.7 401789513 402371712 402932701 403598175 404417915 404931259 404926376 404959831 405591469 406087379 406797752
2968.3 406797752 407511559 408258362 409174919 409841194 410298958 410589905 411170807 411441231 411728745 412537270
2978 412537270 413077431 413134727 412943268 413075027 413297081 413344727 413811417 414297485 414191055 414563026
2987.6 414563026 414899979 414655876 414715385 414568863 414599762 414497375 414364891 414643326 414452095 413808250
2997.3 413808250 412798920 412648888 412955246 412588959 412205734 412347679 412351494 411425171 411028290 410861778
3006.9 410861778 410763206 411002121 410490189 409832001 409445496 409340057 409156609 408759003 407866669 407291451
3016.6 407291451 407417946 406708527 406071243 405590439 405050926 404682465 404317818 404021950 403178215 402467003
3026.2 402467003 401756210 401157303 401005783 400920639 400451736 399285698 398761063 398501015 398063889 397444038
3035.9 397444038 396636429 396118736 395611839 395651932 395591850 394626350 393451500 392920074 392779045 392190704
3045.5 392190704 391527519 390842514 390109596 389657288 389388123 388777962 388118095 387572594 386823349 386230125
3055.1 386230125 385432205 385010147 384850235 384134064 383480911 382754669 382159271 381855927 381276054 380849533
3064.8 380849533 380787468 380236473 379689331 379344521 378707962 378153191 377493744 377320366 377025032 376261559
3074.4 376261559 375694466 375014191 375040512 375153885 374959412 374147377 372845154 372570610 372223854 371752243
3084.1 371752243 371271858 370303078 369867821 369852180 369622383 369161797 368679047 368152351 367534409 366782036
3093.7 366782036 366135025 365903778 365938759 365640221 364935036 364451447 363942947 363446999 362844925 362128258
3103.4 362128258 361798744 361367798 360730247 360210419 359994850 359607773 359064217 358588600 357994041 357735825
3113 357735825 357799988 357781944 356973991 356020012 355553589 355117836 354726257 353892899 353219376 353064156
3122.6 353064156 352847557 352464561 351738434 350820122 350312233 350159035 349534340 348704376 348016701 347620888
3132.3 347620888 347122841 346376915 346006432 345395393 345228310 345300026 344604454 344026146 343547897 342736855
3141.9 342736855 341831894 341046486 340446320 340341721 339925957 339412270 339216728 338446846 338118019 337917404
3151.6 337917404 337443237 336652794 335561943 335188179 334662895 334275093 333884392 333253441 333113365
3160.3 333113365 332573280 331747894 331116219 330738907 330227165 329281464 328543663 328347282 328000221 327079048
3169.9 327079048 326412659 325933685 325349045 324931793 324808235 324550629 323826485 323108215 322438316 322086449
3179.5 322086449 321879272 321280708 320510712 319965096 319532700 319032040 318682861 317989483 317162304 316963615
3189.2 316963615 316749592 315814495 315104809 314957085 314601402 314165726 313478756 312875919 312301540 311718159
3198.8 311718159 311361065 310695267 310327759 309913788 309572468 309312000 308915806 308968906 308194389 307191772
3208.5 307191772 306927280 306674328 306117973 305746861 305627689 305013618 304896297 304801483 304014816 303623333
3218.1 303623333 303430176 302808475 301956463 301537666 301362286 301009407 300419731 300102119 300029297 299728928
3227.8 299728928 299510689 298693676 297816086 297859745 297863770 297166634 296241207 295927029 296121807 295981998
3237.4 295981998 295351562 294822865 294407940 293936100 293121567 292590504 292520370 291872292 291915627 292060108
3247 292060108 291575546 291403618 290842190 290390396 290190659 290121403 289903927 288875790 288548813 289136925
3256.7 289136925 288886909 287878971 287407646 287154541 286960201 286775932 286299400 285789089 285196686
3265.4 285196686 284702759 284396420 284443855 284300156 284092884 284286041 284119492 283714905 283086834 282371025
3275 282371025 281526871 281331558 281856384 281683311 281565037 281281643 280769920 280581169 280040398 279243450
3284.7 279243450 278728065 278764191 278802776 278759308 278692837 278577957 278536263 278478260 278157482 277350483 277252865
3295.3 277252865 277574406 276895676 275900707 275720882 275670948 275244751 275201836 274992962 274650688 274379807
3304.9 274379807 273901691 273809547 273967686 273843479 273225822 272585030 271951332 271589508 271509247 270976410
3314.6 270976410 270491486 270458965 270543766 270030613 269645691 269838886 269776993 269247169 267999535 267055531
3324.2 267055531 266791382 266766148 266720181 266269684 265737648 264719124 263708439 263654575 263822002 263359890
3333.8 263359890 262865620 262450180 261842175 261848564 261808014 261325455 260669994 260047626 259733162 259180470
3343.5 259180470 258469563 257881317 257692146 257375431 256804790 256648350 256517944 256429596 256018982 255439720
3353.1 255439720 255423679 255418549 255309830 255047607 254112282 253600712 254016876 253928719 253387299 252706718
3362.8 252706718 252205544 252425175 252582836 252302036 252173729 252418079 252092056 251523666 251191158 250744572
3372.4 250744572 250428581 250078125 250188770 250110703 249624939 249460049 249217644 249414463 249425449 248943615
3382.1 248943615 248606453 248289776 248244572 248286133 248142452 247924557 247946224 247842197 247468395 247432194
3391.7 247432194 247608547 247476234 247022400 247037106 247427692 247505417 247210083 246665649 246109734 245613327
3401.3 245613327 245565548 245741768 245457668 245609989 246175213 246260662 246369381 246171436 245866776 246306553
3411 246306553 246439037 245837917 245446072 245730057 245685825 245539265 245823841 245873604 246431541 246722851
3420.6 246722851 246594353 246891708 246714287 246406536 246338768 246893139 247496471 247423439 247086716 246681328
3430.3 246681328 246945267 247702236 248208103 248231087 248359394 249000244 249350433 248970108 248660030 249186440
3439.9 249186440 249553699 249753265 250062294 250137901 250729141 251374035 251275501 251023197 251662331 252317905
3449.6 252317905 252419701 252663898 253182735 253641357 253941727 254405060 254419308 254623604 255434914 255485897
3459.2 255485897 255751457 256262321 256361618 257017040 257942371 258835468 259422550 259228687 259358921 259831181
3468.8 259831181 259782562 260124855 260887337 261495075 262082253 262853203 263425541 263408775 263776493 264309769
3478.5 264309769 264581947 264955235 265936794 266739101 266647644 267319660 267581635 267762241 269292278 270676003
3488.1 270676003 271253223 270910568 271168976 272177238 272680740 273135033 273659630 274223785 274190197 274309025
3497.8 274309025 275393219 276482639 277048397 277756100 278676548 278718529 279066353 280020828 280506020
3506.5 280506020 281081734 281928234 282033901 282373848 283692684 284486275 285140934 285638103 286056728
3515.1 286056728 286942883 287470856 287828178 288679485 289802132 290387249 291194344 292102013 292465248
3523.8 292465248 293276005 294096947 294719563 295222359 296316452 297029762 297433834 298188953 298444843
3532.5 298444843 299480133 300930729 302445850 302992172 302607841 303648338 304674072 305577374 306763382
3541.2 306763382 308159771 308931370 309545612 310478497 310755386 312067604 313030376 314350414 315655594
3549.9 315655594 316562881 317660217 317330532 318427410 319393444 320522156 322555885 323571014 324497948
3558.5 324497948 325178299 326303024 327265663 328715591 329494743 329856949 332272644 332980957 334354401
3567.2 334354401 334975624 335814743 338684235 339673653 340519028 341693916 342995872 343754158 345113411
3575.9 345113411 347345695 348261032 349786949 350711555 351619682 353316307 355087700 356631851 357589149
3584.6 357589149 360251465 361388969 361569862 363515434 363988914 366082840 368027916 369954491 371413231
3593.2 371413231 372774849 374840012 375335846 377984390 379973717 380215073 382296257 383187599 384243927
3601.9 384243927 386323280 388516426 391177254 393116226 393995209 394551849 397601814 398203239 399262085
3610.6 399262085 404168739 404535561 404871941 408725281 409483376 413380318 416644897 417360382 419337692
3619.3 419337692 419331017 421451836 424241257 426179276 428682175 431426964 432830696 434813538 440632095
3628 440632095 440779915 434599075 439933777 445124512 449138222 450406685 451215248 454465256 458096275
3636.6 458096275 461282082 462669678 464761734 468294563 471499138 472885437 473537102 476257324
3644.4 476257324 480018501 484303818 483577843 482213249 487362862 488805466 488417397 490105896 495596352
3653 495596352 500015182 504015388 508774261 504804916 507824020 513073540 515473633 517902870 519066925
3661.7 519066925 521331177 522901154 525045013 526960220 528300858 533196831 535615082 535543137 536068192
3670.4 536068192 532592888 536480598 543654327 551226158 550638161 537153511 541243553 548828850
3678.1 548828850 553792191 552613831 552657356 555246658 557529869 559475098 560628319 561203270 565011063
3686.8 565011063 570904427 562626076 560977631 569173889 565174332 565735741 570136070 570166740 571719398
3695.5 571719398 572937126 573252220 574474602 574939728 577283592 579888458 576331329 575264130 579095764
3704.1 579095764 580429077 580964050 581858406 583558350 585134354 579448318 584772377 588732910 577413788
3712.8 577413788 581557045 584860191 585729561 587028236 588831024 589829254 586600075 588846817 594836311
3721.5 594836311 591888885 588368149 592228279 592571068 591729469 590387726 591179466 593872337 594305420
3730.2 594305420 598449745 595760765 590352097 598092461 598949089 592275276 592805824 595120773 595540276
3738.9 595540276 597105484 598877831 595053940 598047333 607038155 595494919 585098000 594118042
3746.6 594118042 599036751 604453850 601097832 592620163 602757339 598236122 592859001 598098831
3754.3 598098831 601731911 604473343 600550728 603466034 608691673 601176300 599190941 602591972
3762 602591972 603911629 604137878 606630898 603818665 599499245 602840080 607431335 607339478 599948387
3770.7 599948387 601911736 605224571 606207886 607257957 607120476 607885056 608006287 609506035 607454643
3779.4 607454643 600789871 604126854 606355286 607650337 609781761 607136154 606484261 607455139 607732811
3788 607732811 608221588 608084946 608272362 608176155 608571548 608573532 609466095 612321281 608995552 605675201
3797.7 605675201 608330307 611901360 615879555 608394203 600231667 604533577 607907143 612517204
3805.4 612517204 616603928 607801132 604509697 608387947 609832726 610594635 611024361 610393524 612131615
3814.1 612131615 617250175 614229927 603073997 608227081 613448868 617709961 617018394 600944519
3821.8 600944519 605236740 610130692 611098061 612745094 612292938 608567772 609010201 611309090 614216919
3830.5 614216919 615087585 608013687 611069679 616802979 609836960 610049438 617195511 609130135 606962624
3839.2 606962624 613104897 607566948 608619690 614461975 611075211 608124428 610691414 611746864
3846.9 611746864 611922417 613263359 612750359 615073433 619277115 613600197 614949417 599832497
3854.6 599832497 603143806 613685722 611740685 609059563 611348457 614234200 616252098 610967484
3862.3 610967484 611498833 616856194 610827141 606089058 609632912 614463654 619467506 610312958
3870 610312958 602250061 607285843 613454857 616081352 607844658 609249496 612326660 611792488 613830109
3878.7 613830109 616986465 611803131 606673355 611272621 611338921 612751617 616742325 605938644
3886.4 605938644 607157669 610452461 611993828 616361008 615848122 609029541 609046288 610516396 609252434
3895.1 609252434 611202164 612549820 614023437 614432182 606386223 611152420 612270241 608019943
3902.8 608019943 611978607 609764481 608773003 608382339 609625816 611770172 610870438 610285492 609575691
3911.5 609575691 610252991 611046333 610851364 611618347 611401558 607215271 606234741 611221046 611522293
3920.2 611522293 608068047 609263153 610783615 612017784 610151253 607676888 608703384 609936180
3927.9 609936180 610885735 609387283 608999939 611177063 609489899 608210907 608871651 608346062 608140182
3936.6 608140182 608700829 609126778 609122925 609330139 610327568 610141487 606862030 606908493 608429222 608903809
3946.2 608903809 609669037 608181839 607998695 607667274 606565437 607994690 607662277 607266350 607801819
3954.9 607801819 608408051 608657303 608028259 607872353 607435303 608785133 609252548 607635841 607766457
3963.6 607766457 608084145 608047523 607773972 607597809 607560081 607458878 607236710 607562256 607389259 605937996
3973.2 605937996 606207733 606594429 606162224 605920372 606356544 607202301 606688080 606336098 606339226 606331406
3982.8 606331406 606700249 607278709 607407951 607169533 607232552 606635323 607004395 607223549 606117287 606038055
3992.5 606038055 607124748 607930489 606649857 606094971 606872559 606969299 607157707 607291183
4000.2 607291183
##END=$$ End of the data block
