##TITLE=$$ Begin of the data block
##JCAMP-DX=5.00 $$ ACD/SpecManager v 10.08
##SPECTROMETER/DATA SYSTEM=Varian
##DATE=15 Jan 2013 15:29:36
##DATA TYPE=INFRARED SPECTRUM
##DATA CLASS=XYDATA
##ORIGIN=
##OWNER=
##NPOINTS=3735
##FIRSTX=399.26403809
##LASTX=4000.35498047
##MAXX=4000.35498047
##MINX=399.26403809
##MAXY=67.79702759
##MINY=24.56121063
##XFACTOR=1.0000000000
##YFACTOR=0.000000100000000
##FIRSTY=38.18193436
##DELTAX=0.96440572
##XUNITS=1/CM
##YUNITS=TRANSMITTANCE
##XYDATA=(X++(Y..Y))
399.3 381819344 399105721 411465111 410249023 406401978 406928787 406563873 404030457 399450722
407 399450722 402546120 408828659 404341469 397110596 396585732 401188507 402493782 401188965 399941750
415.7 399941750 400195541 397393417 379251480 383326530 397066917 397069321 396801262 401263123 407569199
424.3 407569199 412709236 410127640 408698273 412042542 408394547 403242302 400843086 400733986 403223801
433 403223801 403281822 403712502 400763168 397199554 399323921 399791222 399131012 398510742 396920242 397644882
442.7 397644882 399186592 398213997 398456612 398817291 400915298 405204773 405745506 404124031 400310745
451.3 400310745 397605171 396938286 393853035 394567833 398258247 396878014 393171806 400987816 403336411
460 403336411 395901070 391117249 391369934 393722801 395787392 397237701 396133308 391216545 393488007
468.7 393488007 397400322 393178444 390349960 393313103 393615837 393979416 395509796 393737106 390202446
477.4 390202446 390238686 391778603 391246147 389944077 389239349 389161186 385538025 384623756 389057961
486.1 389057961 391045494 390524826 389594650 387985115 385104866 387379417 391322899 389368401 390258484
494.7 390258484 392039871 390200768 385861282 384001350 385790672 385133705 386235695 390555534 390345726
503.4 390345726 387968788 387706184 386469002 385066566 387086830 385791359 384010277 383003082 381499062
512.1 381499062 381744385 382697945 384678459 383670082 379440079 377516060 377923126 378881683 380612755
520.8 380612755 381051140 380768700 382110901 380792122 378817673 379349442 379199677 379546204 379593506
529.5 379593506 378845444 378881683 378682518 377606354 379016228 380319824 379585075 379150047 377123146
538.1 377123146 376158180 377089043 377991943 377096138 374516449 373806496 373457985 372841606 372872009 373990555
547.8 373990555 373618965 372644844 374165344 374279938 374281120 374342995 373243294 371674232 369202499 367796936
557.4 367796936 367179298 367992592 369102707 369354172 370886574 371997757 370992966 369679565 369365654
566.1 369365654 369728775 370231857 368609581 367369995 369934082 371288757 370684967 371105843 371221046
574.8 371221046 370568733 368952026 367721558 368234062 369033546 369262505 369102821 368960838 368338928
583.5 368338928 367534676 367591934 367001305 367202415 368797493 370232849 370989761 370718918 371289062 371388474
593.1 371388474 371270409 371803360 371277351 370212860 369403648 370385933 371714668 371778526 371524811 371719131
602.8 371719131 372382698 371552277 370537682 369560394 367868423 367330742 367425804 367158432 366364098 366014824
612.4 366014824 366642227 366739731 365883904 365519905 365058289 365316010 366611214 366394806 366748962 367701454
622 367701454 368076744 368635559 369571953 370475578 369555473 369188690 370249367 371002808 371486473 372811279
631.7 372811279 375244637 376961174 378414459 379191971 379369431 379978714 380750351 381836662 382688751
640.4 382688751 384441528 385812988 386001167 386762848 386846237 386841469 388143654 389770088 390343781 389890976
650 389890976 389518585 390013809 390911484 391158104 392275543 393142242 391780090 390340958 390857010 392273560
659.7 392273560 391154938 389548378 390145378 391426277 391674194 390786209 391124191 392066803 391305199
668.3 391305199 391190910 390279007 390426865 392178688 393302879 393360329 393936577 396254120 398007050
677 398007050 397551422 397123909 398502235 400282707 400812645 400544930 400320015 400770454 402197304 404490814
686.7 404490814 406535873 406893463 407420845 408265724 406928864 405967293 406667404 407468071 408945580
695.3 408945580 409983330 410645523 411404457 411432915 411810303 412663422 413381691 413530693 413205986 413103561
705 413103561 413965454 415382195 416784477 418625679 418855362 418232384 418594093 417977066 417518158 418350258
714.6 418350258 419636192 421229248 421951065 422096252 422564201 422024117 421917267 423655930 424118576
723.3 424118576 423927002 425052719 425856133 426357002 426963921 427493629 428693275 429736328 429936905
732 429936905 430375175 430931549 431494179 431242065 430813065 432422409 433978348 434526062 434764786 434405785
741.6 434405785 433507576 432665215 433118324 434428062 435822105 436316261 436449814 436967278 437659378
750.3 437659378 438777504 439053535 438922997 439724998 441197243 441567841 442382812 444681511 445796738
759 445796738 446832314 447041626 446805382 447143173 447190819 448245888 449512825 451133995 451984138 451466751
768.6 451466751 450696297 450384827 450630569 449997635 450166740 450321808 450629921 451919899 451537247 450792236
778.3 450792236 450665092 450552101 450599556 450898972 451320953 451637878 451691666 452032852 452584686 452589035
787.9 452589035 453293991 454269905 454625320 454395943 454451218 454861259 455100937 455636292 454942894 454711456
797.6 454711456 454966660 454281120 453628998 452765160 452036819 450394287 449170685 449297256 448568077
806.2 448568077 446172867 444399567 443618584 441560707 440445747 440069580 439009285 438105392 437758179
814.9 437758179 437558250 436840553 436175499 435184364 435074234 435091705 435048294 435781746 436801910 439276390
824.6 439276390 441466942 443831940 445771179 447211990 449804382 451974869 454939842 456988564
832.3 456988564 459274940 462529488 464814262 467187500 467950783 468815384 470570030 472628288 474660378
841 474660378 475775719 477071152 479112587 480898056 482257996 485059967 486675835 487321320 487253876
849.6 487253876 486368675 487540627 488446579 489565239 491366920 492828331 493573608 494783516 496470299
858.3 496470299 496739883 497259750 497676811 499646530 501417007 501858177 502737885 502521439 502151680
867 502151680 500875816 500172806 499558563 498989296 499030762 497712135 496529198 495021324 494411964 494299431
876.7 494299431 493204422 491798630 491380615 491773338 490432587 488989220 487901955 487638588 487613525
885.3 487613525 487129173 486963844 486122971 485527840 484624519 484449463 484757805 484709358 484892311 484387169
895 484387169 484357758 484295807 484537430 484621925 483505898 482394295 481749725 481333504 480673523 481166306
904.6 481166306 482702751 484640503 486755600 488789215 490487938 491373062 492331161 492532578 492611351
913.3 492611351 492594147 491850739 490862045 489416924 487678871 485369148 483045273 480972099 479357491
922 479357491 477464409 475632706 473270226 469651566 466770401 463873482 460955391 458086967 455883064
930.7 455883064 453953362 451401024 450020065 448780899 447494164 446586838 445871887 445083313 444114227
939.3 444114227 443339462 442220383 442111549 441465683 439713249 438748322 437831726 437271423 436788292
948 436788292 436789360 437630424 437977943 437871704 437728500 437583275 437153053 435981407 434541626 433621788
957.7 433621788 432061882 430027122 428389168 426829605 425570564 424498787 423588371 422445679 420827713
966.3 420827713 419002304 417051392 414909134 413215218 412047806 410445175 408576088 406409035
974.1 406409035 404159279 401554298 398599854 395438576 391657372 388396873 385322762 381850128
981.8 381850128 378171921 374432755 371284027 368610840 365094261 361511421 359057121 356006470
989.5 356006470 352307968 348950310 346798363 345245972 343034248 340670509 338266449 336333656
997.2 336333656 334679718 332558136 330119209 327822456 325939980 324839401 323795547 322372093
1004.9 322372093 320933266 319139786 317981472 316955624 315878010 314431019 313001995 312829456
1012.6 312829456 311825275 310293980 308571701 307228374 305979748 303710136 301769352 299936314
1020.3 299936314 298479671 296672306 295377445 294651947 293592815 292486401 290652084 289743156 288583794
1029 288583794 287282715 286379013 285201397 284549408 283931446 283909397 284343719 285774174 287539673
1037.7 287539673 288729515 289257679 290093231 291169319 291110706 291498833 291450672 291914425 292854500 292425919
1047.4 292425919 291766605 290920582 290681076 290339241 289081821 287239494 286379414 285688858 284258461
1056 284258461 284053478 283886986 283920536 283698902 284673882 287043076 289095154 290761719 291712646 294344177
1065.7 294344177 295860462 296088409 297363720 298615971 300065098 300927353 301161270 301071072 301508408
1074.4 301508408 301526661 301934357 303040771 302588215 302485485 303229618 303806667 303714638 304302635 305498390
1084 305498390 306266861 307152901 308075829 309038563 309099770 309594936 310019207 311306763 313821087 314560261
1093.6 314560261 315212631 316121254 317176533 318095379 319096165 320240517 320720596 321651268 322657394
1102.3 322657394 323962936 324820633 325138016 325467567 326438179 327972069 328686485 329459343 329654694
1111 329654694 329651031 329880028 330639992 331768303 332297020 333403587 333798256 333196602 332538872 332753792
1120.6 332753792 333346977 333384514 333448334 332984848 333305092 333805008 334331894 335141602 336010704 337913933
1130.3 337913933 339550095 341154366 342769699 344349861 345864105 347826500 349902534 351418571
1138 351418571 353178215 353937836 354979057 356492996 358094711 359825554 359933815 359821205 360560150
1146.7 360560150 361975594 362767067 362524261 362710381 363454247 363890610 363339462 362825203 362301598
1155.4 362301598 361735573 361517792 361279869 361012077 360358467 359771957 359253540 359095306 359214211 359540825
1165 359540825 360271568 361181107 363195610 365624199 368081055 370172615 371897964 374074783 376236649
1173.7 376236649 378340683 380989265 383741035 385638580 387522278 389795380 392229195 394522247
1181.4 394522247 396034241 397317696 399055443 400158386 400544815 401730003 402984238 404006767
1189.1 404006767 405156326 405720482 405485649 405096474 404554214 403654861 403365059 403330574 402768211 401712875
1198.8 401712875 400868187 400503845 399871902 399031258 398341255 397641525 396122780 394692421 394459610
1207.4 394459610 394283638 394036942 393890686 393717499 393751945 393475113 392792625 392051086 391344604 390712166
1217.1 390712166 390450401 390672989 390949593 390840263 390533447 390401192 389836540 388970261 388349838 387659950
1226.7 387659950 387120514 387041817 387021904 386278725 385212593 384757462 384242210 383484688 383109245 382919731
1236.4 382919731 382718735 382602310 382533035 382622223 382787933 382761841 382453995 381721649 381159439 380961800
1246 380961800 380769997 380314522 379652061 379594078 379568443 379064865 378660927 378686638 378728638 378440094 378400536
1256.6 378400536 378107185 377762642 377714844 377917480 378597145 378739471 378689995 378968925 379442024 379859276
1266.3 379859276 380166016 380564575 380800209 381429634 382048531 382221260 383031540 384064560 384466553
1274.9 384466553 385341377 386640167 387557678 388473053 388959961 389339752 389975052 390940056 392519455
1283.6 392519455 393868904 394718323 395829239 397036438 397660065 398304100 399076920 399767494 400254898
1292.3 400254898 400978241 402025299 402436676 402802773 403552322 404221802 404377251 404411430 404710617 405135040
1301.9 405135040 405407257 405025444 404713821 404545555 404473801 404369926 404162865 404183617 403491707 402381287
1311.6 402381287 401556396 401000175 400868111 401018257 401030617 400968323 401130981 401314430 401793251 402425537
1321.2 402425537 402980995 403466949 404106522 404899635 405154762 405584717 406231880 406346626 405829811 405272102
1330.9 405272102 405067558 404650002 404040794 403689957 403970184 404321404 404163857 403986473 404331207 405073471
1340.5 405073471 405637054 406263390 406494789 406918526 407720184 408433723 409368057 409719048 409831963 409867516
1350.2 409867516 409819374 409458313 409123421 408952789 408326416 408598900 408891754 408598175 408265457 408309441
1359.8 408309441 408074913 406919098 406287804 405982933 406585541 406549263 405975990 405784149 405034370 404825020
1369.4 404825020 404493027 404279633 404303360 403805237 403082199 402943268 403844223 404258728 404073715 403394432
1379.1 403394432 403107872 402934418 402453537 401736908 400184555 399095726 398000793 396715126 395194130
1387.8 395194130 394316788 393474998 391838951 390730667 389308128 387912254 385890617 383353043 381848030
1396.4 381848030 380168114 379012146 376470566 375026360 374416656 372524948 370893021 369387550
1404.2 369387550 367100372 365081520 363978882 362769623 361345940 360283623 358907585 357814789
1411.9 357814789 356953163 356141815 355278931 354379654 353863449 352718430 352072258 350526428 350995026
1420.6 350995026 352450066 352628212 353048363 352862587 353368378 354227295 354542122 355342789 355604591
1429.2 355604591 356440964 357347870 359037285 360547981 360935745 362330437 363820267 364416733 365133781
1437.9 365133781 367443275 369068069 370270767 371906471 372998848 374319992 374936447 375869370 376769791
1446.6 376769791 377412682 378086967 379438057 381322517 382302017 383878098 384967232 386346054 388003426
1455.3 388003426 389074249 389684029 389100456 392108879 394089508 396426735 397698898 399032440 401422234
1464 401422234 401465225 403371086 405564079 407896957 409595757 411325836 414179955 416178665 418104401
1472.6 418104401 419160309 422280502 424941673 426685753 429153786 431084824 432798843 434233818
1480.3 434233818 435709534 437305069 438797684 439968071 440950394 442204819 442848167 443270836 444063416
1489 444063416 443220367 443125229 444436340 445023155 444464760 443805237 442883987 439421272 439722595 438570557
1498.7 438570557 436861877 437023735 436265068 435407906 434429703 434617233 434525070 429440002 425177116
1507.3 425177116 427720947 429409218 428570251 429102173 428113251 426699905 426604500 425434799 424845047
1516 424845047 422903404 421268463 422561073 423821411 421659241 418339157 419062653 420503731 422043381
1524.7 422043381 420485992 420435944 421133003 421564178 422707558 423536148 424227829 424162140 423950653 423300667
1534.3 423300667 424570389 425223732 425518265 426109238 421208076 419081993 421568451 423704185 424131203
1543 424131203 425602875 426808853 425798988 426878510 426777725 426980057 426116982 425064812 426296425
1551.7 426296425 426895027 427699165 425059700 424921074 425742760 425403175 418500900 409819450 418678436
1560.4 418678436 419105759 419571724 418503189 417567291 414843407 412669029 412148705 409966240 408505974
1569.1 408505974 402020531 400968895 399293060 396541290 394337540 391162262 389249916 380599251
1576.8 380599251 380940590 378611794 375398293 372877426 368912582 366561241 362283745 359602547
1584.5 359602547 355744972 352611046 349653053 345702133 343392143 339495468 337494698 333347321
1592.2 333347321 330901031 328104172 324326897 322472992 319179420 317963982 314619656 312579536
1599.9 312579536 309610596 307522697 306427670 303125057 302058430 299341812 298793697 296730595
1607.6 296730595 295607738 294479942 292579460 293019390 290894432 290886726 289053440 289179821 288916702
1616.3 288916702 285011635 287317467 286343040 287320881 286430740 287271175 286945305 284908009 286018066
1625 286018066 285623474 287340660 285941868 287061558 287359238 287414455 288238792 288067684 289860630
1633.7 289860630 289194202 290356979 290469685 292888298 294058151 294497166 296315327 296838150 299334698
1642.4 299334698 299549866 301086712 302454376 301683750 303320827 302234058 305578785 306326103 308276711
1651 308276711 308861618 303553467 306009808 307499218 311315384 311893253 313465595 314065399 315153008
1659.7 315153008 316805363 317857323 319899197 320348778 323184357 324330406 326417847 328594627
1667.4 328594627 330212173 333238297 334215813 337713585 339275703 342637711 345174370 347179070
1675.1 347179070 350894165 352955360 356075478 358381691 361844788 364000359 367729149 371656914
1682.9 371656914 371826859 376473351 378909645 384131660 387194366 390585976 394658661 397487144
1690.6 397487144 401464462 404984245 409041634 412975922 417308350 418206711 422506104 427911987
1698.3 427911987 432243233 436499062 436000481 441681519 446321449 450161781 452773437 455730019
1706 455730019 459052620 461574059 464918442 467168503 469410591 471986961 474584961 477268600 478178139
1714.7 478178139 479652252 482791786 485805779 483415985 485837517 488964539 490995941 492966843
1722.4 492966843 494106178 495391731 496912384 498528671 500286446 501821289 503630180 503778343
1730.1 503778343 504672127 507859726 510442657 508423805 506418304 511278877 514904785 517033920
1737.8 517033920 519812202 520922089 520827332 524822807 527897682 528717499 530858154 534542465 538105125
1746.5 538105125 540905380 543586807 546043625 550465202 552502708 554641800 559855537 563384972
1754.2 563384972 567117081 570672951 571608810 573866272 577142525 580478783 583813553 583680458 584823837
1762.9 584823837 588600426 590855637 592905960 595241508 596768265 595732231 598487129 602739105
1770.6 602739105 603397598 602253571 601722336 606077003 608685303 608478508 611027489 612454681 614271126
1779.3 614271126 614991684 614302139 615841713 617930641 619667168 619262886 620003090 622103539 623461227
1788 623461227 624151344 625328407 625996246 626334839 625144005 625655441 629788742 631023865 630390320
1796.7 630390320 631684227 633449516 633797150 633252983 635548439 635491867 636258736 638464012 639456558
1805.3 639456558 640735474 641247330 641534424 642489700 643660889 642511063 642971268 644770355 645594635
1814 645594635 646675568 646646271 647532883 647897720 648499527 649886856 650362778 650753250 650057068 651626129
1823.7 651626129 653026428 651125870 651701736 653890228 656064606 655722198 652775650 653737259 655900803
1832.3 655900803 656398163 656794662 657225952 657633896 658287125 658304977 659362717 659697113 660584793 661278915
1842 661278915 662245712 663059692 658337936 660256729 662673187 662988281 662974854 663645782 664357758 664013214
1851.6 664013214 664619675 664538727 664975433 665445175 665876160 666751251 666233673 666662750 667169342 667347107
1861.3 667347107 667130280 667543793 667951813 668047714 669042282 668917007 669593201 668720779 667925491 669073105
1870.9 669073105 669777985 670664215 670662842 670852509 670785065 670943146 670829010 671072845 671998138 671995087
1880.6 671995087 672273788 671939392 672490540 672584915 672669067 673627548 673361053 674076691 673762360 672422943
1890.2 672422943 672960587 674014130 674273300 674298248 674230118 673365097 674130096 674557266 674988632 675289917
1899.8 675289917 675258026 675521393 674820557 675052567 675151978 675379028 675520782 675607071 676103287 675779877
1909.5 675779877 675771866 675671082 676270523 676272354 676261597 676234589 676380386 677970276 676424408 675627594
1919.1 675627594 676719055 677515030 677904510 676358871 675917587 676657867 677035217 676538773 676703110
1927.8 676703110 677029343 676909714 677091675 677217255 677694931 677282791 677168121 676929398 676531982 676707993
1937.5 676707993 676835556 677300491 677172089 677814331 677178040 675643768 676520462 676666565 676035690
1946.1 676035690 675746994 676198578 676223679 676267014 676439133 676532135 676792145 676360321 676010056 675687790
1955.8 675687790 675981064 676121750 676014786 676104889 676174698 676491241 676027527 675951157 675565948 675307312
1965.4 675307312 675665283 675266266 674949341 674747086 674825821 674696579 675212021 675507507 675092545 675011368
1975.1 675011368 674845734 674919586 674330215 674428253 674600296 674476471 674960785 674769669 674653778 674687119
1984.7 674687119 675054550 674754562 674393692 674207840 673481979 673934174 674016037 673016434 672599182 673293991
1994.3 673293991 673533096 673143234 673179703 673104858 673080521 672388382 672195663 672264709 672186813 672313766
2004 672313766 672024612 672016830 671715546 671635132 671399994 671098709 670917740 670699615 671066360 671076813 671139755
2014.6 671139755 670823517 670571365 670258789 669943695 670094223 669739227 669730988 669413071 669130478 668560562
2024.2 668560562 668059998 668251114 668126678 668432007 668166428 667798309 667554245 667285309 666982422 666522598
2033.9 666522598 666639938 666539536 666681213 666500168 666242523 666017761 665774994 665715179 665156631 665108032
2043.5 665108032 664693680 664678497 664761658 664564667 664710999 664163971 663756180 663504868 663827362 663602219
2053.2 663602219 663267136 663484802 663270493 663228912 662808914 663143997 662945938 662387466 662559662 662538147
2062.8 662538147 662843475 662146835 661639481 661844406 662200623 662304687 661857452 661817245 661795502 661816711
2072.5 661816711 661434097 661471024 661237030 660754318 660882339 660534744 660635681 660742645 660585861 660119934
2082.1 660119934 659933472 660085678 659952240 659839401 659280701 659329071 659217300 658989563 658815765 658447647
2091.7 658447647 658514328 658250885 658283615 658221970 658189850 657663116 657087708 657153397 656760559 656922302
2101.4 656922302 657022400 657095718 656993561 656724625 656531906 656265945 656099167 655040054 654798050 654917908
2111 654917908 654936447 654897079 654428101 654542542 654090195 654044495 654229431 653848114 653320160 652967072
2120.7 652967072 653093414 653162460 653590546 653426743 652995682 652857437 652843704 652809143 652568283 652436600
2130.3 652436600 652038651 652253418 652131348 651855011 652199249 652465439 652492447 651921463 651769409 651784821
2140 651784821 651885223 651704865 651753769 651923447 651494293 651947021 651973190 651911087 651794510 651431732
2149.6 651431732 651457443 651460495 651747971 651499557 651684875 651728363 651762772 651747131 651002808 651117096 651266861
2160.2 651266861 651515350 651266937 651116943 651321564 651341858 651706696 651557007 651695557 651380844 651282272
2169.9 651282272 651479263 651494293 651677551 651279602 651663818 651721344 651686935 651763000 651572952 651580429 651333771
2180.5 651333771 651654434 651665802 651864395 651831818 651556015 651624908 651473846 651684494 651368866 651192627
2190.1 651192627 651252975 651658630 651988144 652044830 652079086 651232758 651474228 651967392 652036438 652007828
2199.8 652007828 651919022 652157898 652109833 652233734 651801224 651727142 651631699 651497498 652016983 652234192
2209.4 652234192 652561188 652386093 652412720 652150421 651947861 652148590 652216492 652652817 652259598 652209091
2219 652209091 652313614 652775574 653190460 652667084 652574310 652152100 652140961 652347946 652418594 652104568
2228.7 652104568 651824341 652155457 652085648 652595978 652661743 652334900 652199097 652094879 652075348 651887360
2238.3 651887360 652191238 652151566 652111740 651862488 651858063 652155609 651909332 651744156 651350327 651444473
2248 651444473 651402664 651374741 651272964 651043243 651475372 651381454 651339417 651164398 651034088 650793076 650475082
2258.6 650475082 650804596 650907440 650929260 650795441 650999985 650934753 650561829 650356369 650411224 650900650
2268.2 650900650 650729904 650718384 650633621 650575409 650720139 650749130 650787201 650456619 650442886 650453491 650771637
2278.8 650771637 650455551 650051880 650246887 649872284 649632339 649458542 649834366 649470215 649035034 649180603
2288.5 649180603 648882980 649018478 648685989 648858261 648820114 648720016 649067535 648643875 648185425 647551651
2298.1 647551651 647702332 647381058 647094345 647365417 647235718 647419510 647038651 647115097 647042847 646784973
2307.8 646784973 646272125 646011200 646827927 646396179 646055374 645731888 645493546 645533371 645316620 644956436
2317.4 644956436 644221268 644015732 643135376 642831192 642745590 643029175 643582001 643210220 643266144 642299957
2327.1 642299957 642220993 642758865 642912674 642524796 641936111 641641388 640889130 641528473 640506363 639402313
2336.7 639402313 639315948 638998718 639365654 638945312 639160194 639481316 639913979 638628082 638064804 639135704
2346.3 639135704 638927460 639256058 639591980 639827042 639288445 639082069 639406815 638916740 638304024 637082748
2356 637082748 637540207 637582054 636634293 634143333 633738480 635772820 635992126 636933861 635945053 636041145
2365.6 636041145 635751457 634454727 634146118 633340912 633844185 634600601 635619011 635002670 634608688
2374.3 634608688 635294418 635009041 634525986 634121284 634481277 634537773 634913826 634851418 634198952 634129333
2383.9 634129333 633942680 634052696 633619576 633562012 633546257 633067207 633055954 632788391 632718697 632454834
2393.6 632454834 632213020 631675453 631451111 631582451 630967178 630779381 630500641 630232239 629927292 629740486
2403.2 629740486 629493103 629172668 629401970 628814392 628225822 628035202 628015900 627852631 627551270 627140007
2412.9 627140007 626527786 626556282 626062279 625756569 625424957 625123444 625341682 624776993 624360542 623842850
2422.5 623842850 623587265 623256721 622769699 622588272 622070160 621927567 621632004 621265488 620695038 620498619
2432.2 620498619 620464668 619837532 619803848 619711342 619447632 618922157 618321953 617641144 617100296 617185631
2441.8 617185631 617033501 616885033 616444817 616073074 615498199 614804382 614781189 614866333 614770622 614020462
2451.5 614020462 613496170 612888794 612236862 611959877 611784859 612001762 611665878 611410408 611130295 610508804
2461.1 610508804 609881363 609302979 609062958 608475571 607932167 607647896 607537155 607298317 607020988 606636925
2470.7 606636925 606005745 605662003 605141068 604882278 604416847 603718300 603235207 603019943 603165131 602755089
2480.4 602755089 602464371 602017212 601269608 600572243 600029945 599711914 599298935 599262276 598701744 598163872
2490 598163872 597710762 597031746 596762924 596383476 596072960 595372047 594740143 594236870 593868942 593779945
2499.7 593779945 593301926 592717400 592056656 591896324 591377983 590674744 590345955 589842186 589533005 588762589
2509.3 588762589 588207054 587998161 587765007 587628593 587165108 586540489 586294174 586313515 585502243 584923897
2519 584923897 584821281 584518089 584281273 583925514 583438377 582810402 582501869 581727753 581056290 580772934
2528.6 580772934 580116806 580093307 580206642 579932175 579287720 578805656 578376961 577908325 577739754 577049789
2538.2 577049789 576297073 575888786 575773430 575335312 574905014 574724960 574252129 573967781 573362045 572861595
2547.9 572861595 572445641 572144394 572161369 571786690 571241112 570848656 570872421 570213127 569327736 568901520
2557.5 568901520 568482857 568226433 567906113 567826233 567549400 567111893 566645699 566672401 566659050 565863113
2567.2 565863113 565499840 564886703 564326401 563865929 563447266 563232956 562731781 562586098 562196503 561871223
2576.8 561871223 561407661 560860252 560467796 559779549 559395485 559079475 559012413 558737411 558516159 558211060
2586.5 558211060 557594604 557107086 556351166 556252289 556103096 555897179 555569611 554647903 554157524 554200287
2596.1 554200287 554382706 553590927 552922287 552445107 551695824 551456451 551214638 551194572 550934105 550668144
2605.7 550668144 550230446 549469070 549062729 548537712 547772255 547256355 547299309 546862602 546406975 545907784
2615.4 545907784 545174332 544985580 544575386 544123230 543371811 542697639 542383423 542229958 542076454 541618347
2625 541618347 541508026 540895653 540178032 539560204 538983307 538745270 538376732 538122826 537308693 536553917
2634.7 536553917 535921783 535547600 535645065 535142365 534613266 534129295 533707809 533218460 532820358 532360153
2644.3 532360153 531659050 531251755 530615692 530152245 529873085 529650841 529417725 529034538 528268394 527374840
2654 527374840 527394295 527210007 526714058 526268196 525951958 525704727 525112419 524896355 524611206 524288254
2663.6 524288254 523859711 523285561 522911720 522563591 522281494 521873360 521529083 520908508 520619850 520409088
2673.3 520409088 519930000 519854507 519355965 518813553 518284225 518014221 518051872 517560272 517121964 516817894
2682.9 516817894 516454315 516146393 515839653 515228462 514820175 514734192 514634705 514322777 513501244 513203087
2692.5 513203087 513157349 512850075 512464027 512201309 512082710 511497955 511018066 510880470 510937386 510580673
2702.2 510580673 509859657 509223785 508689842 508757973 508494034 507894325 507312775 506896324 506929169 506707611
2711.8 506707611 506378212 505974884 505625038 505494766 505283279 504960251 504849663 504601974 504209595 504257088
2721.5 504257088 504009361 503742981 503608055 503382950 502981148 502403069 502294960 502028198 501678238 501428757
2731.1 501428757 501305733 501113396 500824585 500928497 500867729 500781631 500095215 499324684 499268456 499366951
2740.8 499366951 499450188 499203682 499208679 498753700 498236313 498476448 498292084 498146515 498410606 498281746
2750.4 498281746 497729645 497569313 497369652 496935310 496612167 496552315 496730003 496311340 495938225 495660820
2760 495660820 495413170 495304413 495017395 494711952 494207611 494131622 494030609 493844109 493618355 493100891
2769.7 493100891 492813416 492421989 492300529 492336502 492313995 491901512 491346359 490888100 490238380 490209808
2779.3 490209808 489819603 489399109 489281693 488755341 488650246 488647385 488397560 487871552 487391129 486876297
2789 486876297 486309891 486071968 485673370 485087357 484721794 484556999 484074936 483864136 483761749 482930412
2798.6 482930412 481812019 481242371 481377945 481099815 480396156 479498978 478852119 478478966 478101311
2807.3 478101311 477952995 477475929 477038460 476202507 475649605 475459099 474616547 474162560 473509941 472886620
2816.9 472886620 472376480 471558456 470684509 469887466 469789085 469502678 468821182 468032150 467435074 466724777
2826.6 466724777 465846863 465441322 464549713 463590012 462824135 461971436 461287537 460839348 460396042 459596596
2836.2 459596596 459073067 458326073 456997643 455386086 453960724 452884827 451502991 449988937 448554611
2844.9 448554611 447320404 445640259 443606758 441882210 440300789 438896637 437869530 436996193
2852.6 436996193 435794563 435426445 435098648 434439774 434568405 434379578 434562492 434887924 434463959
2861.3 434463959 433998985 433848724 433806610 433322792 432778053 432197189 431504135 430700912 430208130 429810791
2870.9 429810791 429343872 429392052 428744888 427885590 427462158 426979561 426527176 426119690 425721550 424724159
2880.6 424724159 423916397 423522339 423169479 422993240 422444687 421616325 420925217 420564308 419670143 418319244
2890.2 418319244 417500725 417033195 416566277 416065331 415548477 414474068 413491478 413158379 412599869
2898.9 412599869 411788445 411244164 410958862 410666695 410392380 409685631 408450737 407418060 407188301
2907.6 407188301 407085533 405872269 404719543 404406357 403633194 402477913 401470490 400308876 399415932
2916.3 399415932 398333397 396932259 395822334 394721489 394432831 394093590 393260422 392717438 392191734
2925 392191734 392166367 391818848 391549797 391766815 392103233 392589912 392663994 393300781 393678551 393217506
2934.6 393217506 393216820 394116325 395064049 395126839 395525322 396306152 396981277 397768250 398341255 398739929
2944.2 398739929 399218636 399458809 399440498 399931717 400309372 400889435 401801834 402045517 401927032 401921692
2953.9 401921692 402514458 402806702 403177261 404079323 404446297 404870720 405410652 405798378 406258965 406786690
2963.5 406786690 406973190 407086258 407427788 408041801 408983994 409447899 410128670 410980568 411273918 411461601
2973.2 411461601 412108574 413132820 413463364 413614540 413803520 413975334 414327812 414584236 415187035
2981.8 415187035 415652809 415611763 415547714 415611343 415562859 416020432 416530571 416342392 416599274 416859550
2991.5 416859550 416729317 416493797 416452789 416623993 416537895 416359024 415825615 415237503 414633522 414401703
3001.1 414401703 414568787 414461708 414079857 413350410 412988091 412742195 412799416 412776222 411966782 411494064
3010.8 411494064 411325798 411322823 411009750 410615196 410232582 409318657 408620224 408417892 408372917 407666016
3020.4 407666016 407080994 406776962 406070595 405515099 404843025 404424667 404424095 404212608 403427277 402798119
3030.1 402798119 402419968 401598854 401064682 400348396 399593315 399218750 398672867 398200226 397572021 397002296
3039.7 397002296 396912231 396610374 395839958 395162163 394265099 393254395 392798996 392576256 392115440 391656837
3049.4 391656837 391559906 391059837 390310936 389587631 388899498 388432617 387506905 386912918 386476669 385746346
3059 385746346 385323486 384972572 384755745 384180527 383364601 382894669 382581406 382328110 381991463 381317444
3068.6 381317444 380552826 379997101 379471245 379163818 378729935 378165016 377696037 377173538 376733894 376325874
3078.3 376325874 376229553 375797615 375148582 374900246 374664879 374250565 373370171 372413445 371777267 371886482
3087.9 371886482 371775780 370954285 370576134 370059090 369356117 368671951 368053360 367676811 367432404 367205467
3097.6 367205467 366685982 366418762 366072197 365340309 364646568 364380112 364266472 363688965 363321915 362764816
3107.2 362764816 362099953 361954155 361546783 360615120 359545708 359095230 359388657 359289818 358279152
3115.9 358279152 357687187 357426262 356703110 356256447 355916748 355268974 354437561 354001846 353866844 353456001
3125.5 353456001 352952461 352448616 351861610 351082458 350565376 350406799 350198288 349490395 348596802 348122902
3135.2 348122902 347557907 347260742 346813698 345982132 345638466 345211716 344575996 343720818 342849236 342561188
3144.8 342561188 342240486 341620598 341167641 340793228 340393143 339786148 339158859 338941078 338389626 337823181
3154.5 337823181 337274323 336162376 335271950 334949303 335342140 335218544 334227715 333554840 332875252
3163.1 332875252 332252159 331805305 331408386 330934181 330253830 329393311 328585243 328335609 327950287 327190590
3172.8 327190590 326715813 326465073 326296310 326091347 325329132 324307251 323727531 323237190 322730026
3181.5 322730026 322116776 321263046 320464859 320075264 319743938 319166927 318912792 318636322 318132553 317519760
3191.1 317519760 316711121 315945415 315622272 315338898 314439869 314220428 314188557 313458576 312980862 312678661
3200.8 312678661 312245293 311126347 310373135 310345135 310028000 309756775 309747047 310001087 309429531 308416634
3210.4 308416634 308031807 307603512 307319260 306955681 306551704 306287155 305522346 304771366 304531689 304335728
3220 304335728 303939953 303452778 302883968 302262096 302003193 301906071 301213188 300534706 300267315 299937325
3229.7 299937325 299471378 299188061 298937130 298373089 297975731 297232800 296843204 296953754 296319523 296124477
3239.3 296124477 295959778 295545921 295258102 294904575 295038986 294960499 294372425 293486195 292829227 292189789
3249 292189789 291706619 291832619 291316948 290896358 290784721 290386200 290110073 289743576 289359283 289243507
3258.6 289243507 289096565 288352776 287709618 287260666 287368660 287747688 286923256 286138535 285868778 286004314
3268.3 286004314 286081390 285441151 285164051 284987011 284534931 284022846 283640804 283312740 282943153 282921028
3277.9 282921028 282573566 281986942 282059135 282196445 282012348 281739960 281188927 280938835 280528545 279781361
3287.5 279781361 279785919 279640026 279233780 279040527 278970394 278923569 278515968 278230515 277961464 277731552
3297.2 277731552 277484646 276975517 276694794 276624756 276435432 276120262 275850410 275594425 275585060 275369892
3306.8 275369892 275038204 274748917 273949471 273580112 273439789 273049278 272651577 272481937 272222824 271427040
3316.5 271427040 271179256 271052265 270773869 270568752 269965878 269489803 269213238 269039822 268671036 268112850
3326.1 268112850 267602139 267153339 266585293 265802116 265249844 264697170 264309330 264213791 264283924 263711662
3335.8 263711662 262336273 261798458 261704006 261276245 260615215 260234528 260224190 260056343 259750767 258906765
3345.4 258906765 258317299 258219700 258230267 258114586 257325516 256961746 256915913 256428833 255838394 255292797
3355.1 255292797 254776649 254633503 254949150 254926720 254694195 254390621 254043560 253517151 252773418 252755013
3364.7 252755013 252837315 252530270 252322369 252001705 251651306 251487312 251128445 250615406 250704746 250693054
3374.3 250693054 250287647 250512371 250631599 249888306 249443417 249604931 249341869 248947487 248931751 248873787
3384 248873787 248585835 248122997 247659893 247499237 247835197 248337193 248523808 248041134 247275085 246930065
3393.6 246930065 246725426 246612663 246610909 246471920 246528511 247043934 247075386 246282272 246132011 246513863
3403.3 246513863 246589203 246341896 245909348 245938282 246058331 246098995 246401520 246599216 246458626 245856094
3412.9 245856094 245612106 245773754 245618420 245688877 245752468 245639267 245829391 246115780 246095791 245858402
3422.6 245858402 245955734 246339512 246808949 247268944 247539749 247301235 247083759 247771225 248105335 248359280
3432.2 248359280 249024639 248675785 248291397 248578892 249151344 249502048 249337864 249411888 249629135 249798336
3441.8 249798336 250076141 250447540 250613594 251118374 251631203 250898247 250820541 251486053 252125645 252816868
3451.5 252816868 253162918 253659191 254136391 254407215 254499645 254768810 255434151 255496063 255527935 256292877
3461.1 256292877 256959953 256977310 257206459 258006172 258492222 259174900 260321712 260787983 260735683 260847187
3470.8 260847187 261566753 262321453 262371044 262677040 263149662 263888454 264917412 264904537 265144978 266085606
3480.4 266085606 266776123 267165146 267511425 268388462 268500271 268421993 269462528 270730038 271417332
3489.1 271417332 271202755 271191483 271992512 273114758 273933296 274202385 274392548 275076275 276038685 276288185
3498.7 276288185 276458015 276845665 277704754 278802719 278909111 279499397 280395775 281010780 281806602
3507.4 281806602 282773666 283564034 283943748 284869919 285796223 286409473 286814957 287394238 288339863 288843994
3517.1 288843994 289169331 289236488 289778175 291274433 292628307 293332577 293582134 293905201 294783096
3525.7 294783096 295874767 295956097 296527100 297771740 299141693 300425663 300381088 300716362 301768379
3534.4 301768379 303113518 303809566 304157333 305478668 305859108 306272087 307270679 308518715 309886208
3543.1 309886208 310837650 311619663 312539082 314101105 313913708 314482880 316250343 317656345 318891277
3551.8 318891277 318522015 319924431 321399536 322187119 323497620 324069901 325288200 326583328 328146667
3560.5 328146667 329182701 330164108 331077423 332064629 334486580 334401169 335720978 337203789 337502174
3569.1 337502174 340223503 341591454 342338829 343592186 345251732 346047859 347364082 349424248 349934731
3577.8 349934731 351826859 353203964 353952370 355926857 358016434 359030762 359298592 361787987 362093086
3586.5 362093086 361461601 363826332 364987526 367498512 369940529 372722015 373987770 374883156 377519112
3595.2 377519112 378019638 380562019 382643127 383023605 385542107 387036362 388321571 389919014 391279373
3603.9 391279373 393233528 395340195 396939812 397686729 400674858 401036453 402002907 407464218 408704224
3612.5 408704224 408334732 411322479 411906281 415674667 419484749 420725746 422067070 422143936 424423218
3621.2 424423218 427669640 430232391 431917953 434230499 436863136 439208870 444135971 444004631
3628.9 444004631 438774300 443735580 448422737 452518959 454175835 455110779 458276863 461333504
3636.6 461333504 463514786 464751549 467065849 470373383 473690376 475606804 476845474 479684372
3644.4 479684372 483333511 487623749 487337189 487197037 492654495 494428825 494901543 495631142 500100937
3653 500100937 503964157 507518463 512067108 509051018 512416840 516956863 518576927 521103897 522816315
3661.7 522816315 525566750 526864700 528071709 530335083 532614479 537648773 540401230 539603844
3669.4 539603844 538505859 536409569 541239357 548160706 554544754 551220703 539135056 545019226
3677.1 545019226 553082657 557606468 556240387 557372589 559937553 561628227 563389969 564331131
3684.9 564331131 564766426 568183670 574191284 567335129 565659904 573634872 569728394 569942856 574199257
3693.5 574199257 574897652 576672325 577376556 577633705 578927269 579447098 581993752 584212685 580062180
3702.2 580062180 579488602 583438835 584658394 584861984 585357208 587654762 590012550 583865929 588324928
3710.9 588324928 593227539 582555161 585558472 588838768 589504929 591475410 594668808 595359573
3718.6 595359573 591371078 593497429 599150696 595530090 592245255 596798859 597679482 597370758 595395699
3727.3 595395699 595433922 598025780 598405304 602810555 599670448 593116951 600980797 602039833 594782448
3736 594782448 596063652 598065147 597898407 600956802 604085350 600536308 603960152 613553467 602373657
3744.7 602373657 590889015 599841957 604314117 608529472 605026779 598055229 607739029 601682739
3752.4 601682739 596817398 602489777 606197815 608946495 605232964 608282433 612972145 605623817
3760.1 605623817 603891335 606423378 607376022 608160934 610488091 607323074 604673653 608486481 612500153
3768.8 612500153 612893944 606211128 607876892 610237579 610749969 611768723 611016579 611750488 612134590
3777.4 612134590 614036522 612629929 606375122 609746361 611645241 612627411 614402313 611884346
3785.2 611884346 611361694 612467422 613058357 613330994 613029671 612993813 613235168 614065018 613952904 614794731
3794.8 614794731 617057953 613735275 610611839 612476006 615778236 620079231 613337173 605891495
3802.5 605891495 609711418 611972618 616483421 621215973 612597885 609411163 613551903 614517822
3810.2 614517822 614227371 615182037 615298042 616418915 620863342 617945099 608057098 613503571 618878059
3818.9 618878059 623165627 623458672 606714668 608824196 614157295 616353531 618566399 617891731
3826.6 617891731 614283562 614834480 616427383 618851280 619318352 612255936 615304413 621306763 616145363
3835.3 616145363 616115723 621704788 613218613 611545486 617551689 612801895 614036255 619489403 616543198
3844 616543198 613727112 616031876 617008858 616613541 617172890 616451607 618276711 622125969 618370895
3852.7 618370895 621338234 607332573 608306618 617225952 615645638 613723412 615759850 618322678
3860.4 618322678 620541115 615118484 615968819 622595024 616709518 611256332 615153580 620427971
3868.1 620427971 625065956 615479774 608098145 612317657 617300301 619782372 612546883 614042549
3875.8 614042549 617101250 616283226 618338776 622374268 617099037 610630989 615197983 616399956
3883.5 616399956 618547249 622531509 611535263 612751236 616266594 617118797 620355453 619447060
3891.2 619447060 613926582 614711647 615961533 614176445 615573349 616876450 618629303 619559975 611889114
3899.9 611889114 616094055 617345810 613481293 617234230 614384346 613228798 613944168 615112457
3907.6 615112457 616193428 615355186 615494156 615434303 615944252 615606651 615348129 617150803 618052902
3916.3 618052902 613987694 612336082 616912651 616179962 613021584 614952469 615911903 616173477 613501167
3925 613501167 611353378 613126602 614746590 615918045 615103455 614945259 616174889 613881798 612828789
3933.7 612828789 614190445 614334564 613977699 613780403 613682098 613603745 613685074 615199585 615635338 612382393
3943.3 612382393 612295990 613305130 613856544 615058708 613188629 613217583 613378906 611829567 613966599
3952 613966599 614330292 613379211 613641663 613443336 613203392 612600021 612620811 612637138 613502846 613678513
3961.6 613678513 611738014 611424980 612213020 612868614 613026733 612957726 612685089 612083664 612190247 612642593
3971.3 612642593 612294617 611651268 611937790 612213631 611954613 611032181 610837402 611898575 612255440
3980 612255440 612469864 612653885 612130928 611478615 611330147 611285095 611585007 612056885 611627388 612056274
3989.6 612056274 612487221 611846046 611441841 611609497 612161560 611716537 611828957 612644501 612378807 611997299
3999.2 611997299 612125778
4000.2 612125778
##END=$$ End of the data block
