##TITLE=$$ Begin of the data block
##JCAMP-DX=5.00 $$ ACD/SpecManager v 10.08
##SPECTROMETER/DATA SYSTEM=Varian
##DATE=15 Jan 2013 15:29:32
##DATA TYPE=INFRARED SPECTRUM
##DATA CLASS=XYDATA
##ORIGIN=
##OWNER=
##NPOINTS=3735
##FIRSTX=399.26403809
##LASTX=4000.35498047
##MAXX=4000.35498047
##MINX=399.26403809
##MAXY=67.93964386
##MINY=24.53700066
##XFACTOR=1.0000000000
##YFACTOR=0.000000100000000
##FIRSTY=40.32727051
##DELTAX=0.96440572
##XUNITS=1/CM
##YUNITS=TRANSMITTANCE
##XYDATA=(X++(Y..Y))
399.3 403272705 402282867 401728020 397808914 393279800 395146408 397244682 397715034 400482445 405105972
407.9 405105972 407366409 406333618 402667999 405107689 410110168 407613411 406018677 399286804
415.7 399286804 393439293 396320953 396317482 398378029 403709145 407033501 406327934 401033249 398769569
424.3 398769569 399568291 402719040 403422661 402985001 402158966 404477577 404180870 400210037 400224800
433 400224800 400539246 402028160 399904823 399501648 403243790 402674561 404620628 408632507 408919868
441.7 408919868 406331177 405263176 404497795 405473137 406240807 402392998 401024055 401095581 399141121
450.4 399141121 398608360 401756935 399803696 397907219 399825478 398294716 399981117 397705002 395219879
459.1 395219879 398199348 400002441 401576653 400048828 399824257 401665649 401374474 396133766 392218819
467.7 392218819 396066055 394845848 393445320 394977989 392660942 389743843 391885490 395953369
475.5 395953369 393933678 392038918 395557709 396403885 390626640 387277489 388442993 387158623 387646408
484.1 387646408 388598022 386763802 385764198 386826057 387059326 387973480 393298149 395494156 392093620
492.8 392093620 389946747 390450745 390626717 387108459 385857964 388459244 390420532 390839386 388771286
501.5 388771286 385567436 385499954 386368370 387425346 387204285 384393044 384619560 385842781 384284019
510.2 384284019 383226967 383589630 382259331 380744247 381544685 381213379 379970627 380011101 380170746
518.9 380170746 380242348 380472527 380596771 379499130 379856606 381419830 380663834 379933205 380178719 379773827
528.5 379773827 379971313 380481606 380610809 380196877 378846054 379215355 380554543 380055847 379101601
537.2 379101601 377162743 375804672 377351418 378733139 377763634 376020470 375099220 375535851 376251068
545.9 376251068 374762650 372455025 371580696 372364769 372599640 371810188 372723846 372929077 371867180
554.5 371867180 371605721 370593491 369187012 368903999 368708458 368610039 369692345 369506226 369322662
563.2 369322662 370337486 369233551 368622742 369456596 368966293 369162827 370470505 371333122 371272507
571.9 371272507 369815331 369369507 369419250 368393669 368316307 367661324 367291183 368474541 369064713 368979416
581.5 368979416 368450089 368607826 369057808 368137436 367116623 368110275 370388985 371372337 372205544
590.2 372205544 372823448 370824852 369459419 370374680 370669250 370517044 370687904 369941216 369640427
598.9 369640427 370528488 371361465 371494102 371577797 371202888 369213371 368211021 369104233 368799973 367662659
608.5 367662659 368609886 370125618 369632492 367834358 366239853 366404457 367059364 366589012 365285645
617.2 365285645 364964180 366197128 366894531 367463646 367677574 368282623 369320946 369600449 370206757
625.9 370206757 370674477 371885872 372615776 371887512 372110443 373432770 375720139 377697487 378641663
634.6 378641663 379308052 380026093 380645142 380808449 381633110 383351059 384941711 385518761 385988312
643.3 385988312 386981659 387731056 389279404 390115509 389697533 390088005 390073242 390387077 391762581 392802010
652.9 392802010 392667999 391762543 392291451 392834053 392059097 391995049 391502571 390259552 390452614 390602074
662.5 390602074 390157547 390059929 390607414 392446098 393426170 388668365 389334869 390637474 390670471 390792809
672.2 390792809 392221222 394340096 396043243 397090034 398169670 399046364 398510742 398317566 399600830
680.9 399600830 400647545 401256943 402427483 403467674 403984146 404662666 405334816 406118164 407131462
689.6 407131462 407733917 407167816 407024727 408002968 408464050 409146690 409918900 410702438 411580353 412074966
699.2 412074966 412556534 412561836 412586288 412544174 413406868 414843597 415462112 416507797 417411423 418281441
708.8 418281441 419164047 419634056 419402122 419010773 419651794 419751968 420363884 421823463 422316666 422735481
718.5 422735481 423632927 423493805 422399406 422527084 422914085 423559303 424904976 425778885 426194344
727.2 426194344 426698036 428186417 429473610 429721718 429465866 429780617 431003685 432161446 433243561
735.8 433243561 433710289 434235001 434559441 433842468 433524208 433724289 433488846 434036064 435126610 435012398
745.5 435012398 435449944 436364555 437708588 438705902 438382301 439485512 440004654 439440994 439968910
754.2 439968910 441601791 443210716 443794327 444248009 444662209 446466217 447946739 448044205 447945709
762.8 447945709 447344437 448021011 449297180 450802917 451715050 451376038 451263962 451372452 451253052
771.5 451253052 451162720 451291313 450104904 449713821 450636368 451692657 452706032 452018127 451617165
780.2 451617165 451638641 451828613 452305107 452277069 451613884 451282005 453008080 454464684 455208778 455004044
789.9 455004044 454472160 454681320 454495888 454838028 455086365 455692825 455834351 455413322 455250854 454575577
799.5 454575577 454000359 452735710 451318398 450048828 449599380 449286003 448040352 446333771 444253922
808.2 444253922 443380547 442421227 441232834 440190735 439265442 439404793 439131508 437783089 435895004
816.9 435895004 434926414 434618988 434931641 435657959 435995445 437099457 438493500 440272942 442031174
825.5 442031174 443697586 445243225 446904221 449658051 452322884 455156822 457327805 459589310
833.3 459589310 462188530 464666367 466973343 467908211 469874268 471799583 473445854 474990730 475683670
841.9 475683670 477457771 480193214 482428093 483285522 484590874 485023155 485434036 486866302 487492981
850.6 487492981 488401947 489336357 490700340 491515770 493288956 495338936 495737801 496615181 497227402
859.3 497227402 498037567 498744278 500170135 501191635 501650543 502692528 502197647 501855392 501243210
868 501243210 500522614 499997139 499441452 498644295 497727013 497248840 495454407 494889412 494965248 494408569
877.6 494408569 493235855 491510201 491072807 490250282 489122391 488102951 487729797 487198753 486939087
886.3 486939087 486988068 485239067 484152794 484222794 485448112 485136681 483655815 483922272 483951569 484984016
895.9 484984016 485308914 484562492 484258919 483825874 483468437 482564697 481961021 481229248 481448288 483347054
905.6 483347054 485137024 486533737 488025093 489542961 490646744 491973038 492625809 492586937 491909828
914.3 491909828 490830612 490409622 489807930 488180733 485721436 483495522 481277161 479558105 477768517
922.9 477768517 475559654 473163605 469746780 466687317 464256744 461992187 458868637 455669365
930.7 455669365 453664703 451905937 450405769 449043388 448009949 446809044 445522232 444412498
938.4 444412498 443396111 442655678 441764641 441587372 441185455 440128593 439018707 437931023 437366753
947.1 437366753 437210007 437653351 437388878 436949654 437441101 438001060 438067970 437400780 436577454 435170326
956.7 435170326 433787079 432150154 430251312 429037819 427583618 426269264 424691772 422744179
964.4 422744179 421469040 420488777 418806572 416758194 415009308 413247719 411758766 409833908 407680511
973.1 407680511 405761452 403597031 401254578 398285522 395252609 391745682 387913704 384918747
980.8 384918747 381607285 377915421 374472656 371045609 367777977 364885216 362125092 358477173
988.5 358477173 355361977 352901268 349810753 347165375 344450569 342429810 340691032 339009666
996.2 339009666 337826042 335218849 332623215 330657387 328563843 326304054 325213737 324815865 323202972
1004.9 323202972 321377220 319212627 317763271 316487007 315306492 314495907 312970848 311856956
1012.6 311856956 310568142 309975967 308978977 306931629 305311394 303623829 301786041 299666405 298808327
1021.3 298808327 298174572 296646500 294482727 292822437 292012291 290512180 289581718 288412781 287521152
1030 287521152 287050533 286254101 285377197 284213924 284219475 284774723 285585670 286099968 287063046 288542137
1039.6 288542137 289815426 290900002 291446228 292314129 292433853 292952747 293131466 292389412 291803188
1048.3 291803188 290957336 290716324 290066357 289627380 288275928 287003899 286154079 284308414 283777657
1057 283777657 283027611 282880535 283368549 284726963 286818867 288661079 290552349 291376877 293547153
1065.7 293547153 295279770 296198349 297539463 298902245 299845066 299848328 300805855 301208496 301962109
1074.4 301962109 302561703 302786751 303273849 302413673 302107601 302014217 303025513 304138298 304562378
1083 304562378 305105801 305710487 306896591 307383785 308547421 309455967 310631886 312072353 312814331
1091.7 312814331 313747578 314057446 315331879 316001663 316774750 318275948 318881874 319401684 319671745
1100.4 319671745 321206856 322699814 323855934 325267029 325913315 326261177 326604271 327277908 327752686
1109.1 327752686 328636665 329610977 329999199 330185204 330982056 332438660 333270073 333922844 333926430 333668442
1118.7 333668442 333649635 333443108 333346100 333279800 333283195 332889099 333234634 334087944 334475212 335121765
1128.4 335121765 336489868 338379517 339726257 341013794 342832870 344477501 345824318 347980003
1136.1 347980003 349885368 351527786 353734589 355284233 356592140 357320976 358037376 359124413 359993477
1144.8 359993477 360557365 361160889 362434464 362755051 362780457 363155327 363423347 363615379 363252068 363174324
1154.4 363174324 363109322 362654266 361739998 361201134 360732498 360139198 360139084 359121017 358946724 359236526
1164 359236526 358932304 359947472 361387787 363471718 365693550 367549629 369637566 372131538 374240341
1172.7 374240341 376027489 378596992 381326447 383663673 385646248 387960358 390055771 391834335
1180.4 391834335 394056015 396454849 398186111 399111099 400171776 400982056 401924896 403279419 404430962
1189.1 404430962 405125084 405237999 405320663 405325775 404853020 404079514 403775864 403707504 403312035 402657890
1198.8 402657890 401788788 401161423 400384750 399223900 398277969 397432861 396224060 395053062 394683228
1207.4 394683228 394534721 394515457 394546585 394245224 394075203 393479729 392756653 392066536 391189194 390947456
1217.1 390947456 391476212 391988144 391617699 391401520 391237907 390560722 390094948 389363327 388503609 387548256
1226.7 387548256 386899910 386874313 386755791 386606636 386111679 385205612 384384651 384157066 383873062 383174820
1236.4 383174820 382813034 382838745 383142166 382993774 382620201 382405167 382202682 382000465 381427536 381102600
1246 381102600 380953064 380449638 379879532 379680061 379795723 379817734 379619598 379348183 379421883 379266891
1255.7 379266891 378755951 378602524 378597069 378486481 378594551 378786430 378887901 379231606 379505043 380028229
1265.3 380028229 380669212 380886650 380886765 381000519 381583138 381907501 382337494 383246651 384086342 385035934
1274.9 385035934 386041603 386778450 387182388 388103676 389151878 389646530 390190392 390950279 392264404
1283.6 392264404 393886452 394964790 395909462 397120476 398065758 398671989 399204292 399968910 400633621
1292.3 400633621 401166000 401975594 402770157 403259430 403647079 404392624 405020065 405119553 404873657 404995384
1301.9 404995384 405400238 405371132 405509186 405745811 405610085 404998817 404498672 404202805 403595619 402888870
1311.6 402888870 402114830 401455536 400741158 400661736 401025925 400816422 400881119 401502838 402266312 402843399
1321.2 402843399 403399048 404025879 404611015 405217476 405550079 405967522 406298943 406544075 406491203 405967789
1330.9 405967789 405648384 405314865 404967995 404871483 404816742 404626884 404518051 404334526 404393272 404960899
1340.5 404960899 405396004 406068115 406786613 407630920 408414154 409019737 409636078 409697266 409954300 410226898
1350.2 410226898 410321617 410240860 409975204 409785118 409504242 409462852 409481201 409682236 409215698 408791084
1359.8 408791084 408408051 407544098 407223778 406368294 406708870 406828842 406278534 405864944 404927444 404973412
1369.4 404973412 405135307 405056152 404926605 404473076 403974876 404003944 404283905 404086227 404040794 403457375
1379.1 403457375 403246880 403248672 402668648 401873398 400358162 399385147 398759499 397961388 396047745 394803543
1388.7 394803543 394197693 392748260 391410599 390019913 388657913 385813828 383079605 382090073 380497360
1397.4 380497360 379066582 376917458 375715256 374732132 372901764 371146011 369628334 367555046
1405.1 367555046 365222397 364290695 363326035 361939621 360771866 359289055 358150902 357157440 356461182
1413.8 356461182 355654106 354489059 353680954 352985229 353055725 351656914 352056389 353446388 353509712
1422.5 353509712 353499374 353186302 354033775 354922867 355210876 356120682 356357956 356478882 357183762 358697395
1432.1 358697395 360102539 361381340 362898178 363563881 363519592 364927101 367779770 369547081 370692596
1440.8 370692596 371977425 372834740 374225273 375126839 376715660 377891693 378376808 379049492 380463943
1449.5 380463943 382136192 382954178 384558220 385369873 386487541 387954597 388971367 390193901 389744110
1458.2 389744110 392543221 394459152 396894569 398233299 399266701 401133766 401304550 403771172
1465.9 403771172 405802231 408073769 410049324 411938972 414440460 415739746 417702217 419638443
1473.6 419638443 423214073 426044960 427429733 429451942 431651955 433771133 435480385 436993942
1481.3 436993942 438112183 439470482 440856743 441997108 442965775 442582207 442914047 444474678 444317589
1490 444317589 443859062 444556084 445295639 445182495 444635544 443812752 440288849 440437317 439218140 437300797
1499.6 437300797 437315025 436238403 435502243 434970665 435114174 434650345 429765549 424572792 425977974
1508.3 425977974 428102455 428324242 429394073 428434105 426689262 426649437 425893936 425284920 423183937
1517 423183937 421805382 423085442 424591064 423539505 421253319 421006966 421424713 422770500 421956291
1525.7 421956291 422229195 422594604 422840958 423813019 424067345 424565582 425092697 425095253 423908691 425033302
1535.3 425033302 425279312 425218086 426123886 421860237 421288414 424786491 425863228 425306969 426551857
1544 426551857 427157631 425704498 426892700 427160034 427687683 427264099 426091728 426897316 427373047
1552.7 427373047 427816505 424985008 425434227 426383972 425863495 421055336 414151764 418799095 419411850
1561.4 419411850 420380745 419428062 418423462 415933533 413652000 412845917 410733147 409028969 402049255
1570 402049255 401420746 400112572 397339439 395138168 392781258 391389618 381480942 381488380 379304581
1578.7 379304581 376378326 373563499 369291306 366666489 362119560 359766197 356243935 352940750
1586.4 352940750 349550171 346060791 344311752 339860535 337614059 333870010 331476784 328513908
1594.1 328513908 325102425 323364105 319576969 318041477 314674034 313028793 310303116 307812767
1601.9 307812767 306250381 303205967 302667522 299831085 298954639 296535912 295452785 294727898 292686653
1610.5 292686653 292997952 290857410 291059704 289680061 289962482 289703178 285342884 287660351 286756516
1619.2 286756516 287525082 286144562 286468925 286192112 284914246 286341686 285987720 287491817 285684662
1627.9 285684662 286871281 287748985 288005123 288494797 288036404 289805908 289335709 289292030 289361057 292677326
1637.5 292677326 294249744 294867649 296644268 296960964 299342270 299483337 301007347 302238350 301302071
1646.2 301302071 303584061 302868633 305943298 306667099 308948116 310516033 309266129 309189529 308590508
1654.9 308590508 311805325 312342663 313745270 314319286 315680275 317161179 318003407 320135002 320500908
1663.6 320500908 323645210 325165215 327134132 329405823 331675758 334633598 335314636 338841591
1671.3 338841591 340083389 343332672 346414909 348882027 351171570 353451309 356934242 359018097
1679 359018097 362815208 365610504 369025803 372272987 372265396 378157539 379757462 384718513 387870331
1687.7 387870331 390951042 394760246 398208046 402293472 405596161 409627151 413225441 416764526
1695.4 416764526 418258095 423222198 428129082 432055588 436439705 437314415 443336029 447588577
1703.1 447588577 451177444 453740273 456327705 459886017 462529640 465843658 468238602 470602608
1710.8 470602608 472918739 475423698 478529549 479300613 480268936 483136101 484951172 482784576 486563301
1719.5 486563301 490190659 492285576 494215012 495306244 496258545 497643929 499339294 501158028
1727.2 501158028 502868919 504632988 504567871 505658302 508900642 511642876 510354385 508200188 512768440
1735.9 512768440 516321831 518319702 520626183 520977936 521195068 525615501 528881454 529669952 531511040
1744.6 531511040 535027618 538658943 541778564 544754677 547033348 551753311 554171753 555506630
1752.3 555506630 560666008 564369659 568162651 571889954 573057289 575683975 578717728 581606483
1760 581606483 585134087 585437813 586299858 589594154 592056274 594426193 596490669 598270569 597697144
1768.7 597697144 600175476 604241333 604844360 603252068 602298622 606666794 609222717 609316826 612020912
1777.4 612020912 613478470 615495110 615991859 615174980 616987267 619235039 621082916 620883369 621720352
1786 621720352 623474083 624695969 625891342 627523766 628214073 628607101 627531357 627251282 630679359
1794.7 630679359 631734695 631788292 633546066 635400200 635658760 634462814 636760559 637291527 637953987
1803.4 637953987 639654045 640327301 641692123 642504578 643030624 643979492 645282593 644507065 644972687
1812.1 644972687 646433182 646928787 648047943 648295059 649386444 649577942 649974289 651264191 651528549
1820.8 651528549 652000198 651295013 652873459 654364929 651990814 652663651 655125351 657385712 657264938
1829.4 657264938 654627457 655909576 658180313 658275223 658343048 659061432 659672775 660195923 660111542 660998611
1839.1 660998611 661169662 661748962 662275314 663485641 664158859 659582596 662068863 664721909 664877167
1847.8 664877167 664244537 664610214 665469131 665504913 666407394 666231689 666692276 667440262 667807541 668259659
1857.4 668259659 667685242 668362427 668839951 669170837 669066925 669368591 669839478 669861298 670629654 670109253
1867.1 670109253 670741730 670322647 669286194 670210800 671138229 672195282 672154083 672572861 672734222
1875.7 672734222 673017654 673273239 673392715 673938675 673737793 673953629 673817368 674301224 674171219 674104691
1885.4 674104691 674882812 674485092 675270615 675135803 673717957 674297562 675421066 675639191 675632553 675461044
1895 675461044 674635544 675660782 676236267 676586380 677086182 677090683 677195435 676796570 677099762 676994095
1904.7 676994095 676872330 676913376 677441254 677990417 677493744 677626190 677896118 678426132 678061371 678209534
1914.3 678209534 678169937 677851639 678899155 677412567 677334366 678369751 678728104 679063034 677826233
1923 677826233 677426453 678325958 679041290 678626328 678765411 679162674 679349060 679334641 678984146 679281006
1932.6 679281006 678690948 678814011 678890533 678645935 678686447 678301697 678601151 678580933 679396439 678889847
1942.3 678889847 677243576 677968369 678255539 678067551 677920151 678273468 678246460 678288269 678359528 678291016
1951.9 678291016 678294754 677947540 678079910 677507248 677495117 677775192 677634048 677554016 677351532 677768936
1961.6 677768936 677599716 677493134 677066956 677033539 677288132 676490326 676585464 676797943 676977081 676991959
1971.2 676991959 677347946 677325134 677013702 677271423 676764374 676518555 676342163 676732559 676893463 676673050
1980.8 676673050 676891022 676394577 676163025 676025238 676337814 676284790 675986099 675806351 675118179 675376511
1990.5 675376511 675211334 674546814 674554596 675211639 675353851 674696503 674684906 674799728 674717712 674210510
2000.1 674210510 674245834 674328003 674285049 674130936 673345947 673346329 673442383 673376007 672955933 672957382 673121796
2010.7 673121796 672656479 672622223 672554092 672853775 672686462 672160263 671747742 671718063 672010956 671678238
2020.4 671678238 671579437 671148605 670974808 670548706 670253754 670465622 670069580 670129929 669555664 669228668
2030 669228668 669218292 669052505 668977814 668594131 668610001 668373337 668439102 668090439 667909393 667845306 667238159
2040.6 667238159 667273636 666984177 666980515 666849823 667002182 667105865 666598969 666454697 665968246 665816803
2050.3 665816803 665565109 665589905 665303802 664827881 665177078 665145645 665086594 664717636 664583282 664384613
2059.9 664384613 664431992 664529877 663914108 663937073 663723755 663687363 663719940 663880768 664134369 663684692
2069.6 663684692 663326492 663185120 663498077 663170853 662829819 662964172 663066177 663100204 662776413 662671127
2079.2 662671127 662330322 662494812 662476807 662194138 662299728 662104645 661954803 661644363 661667557 661143188
2088.9 661143188 660484009 660398788 660293808 660213852 659999084 660282898 660143890 659847336 659487152 659062576
2098.5 659062576 658847504 658602371 658881531 658772430 658788300 658430405 658143234 658451767 658168411 657686996
2108.1 657686996 657039261 657029190 656869278 656758499 656696625 656341476 656428909 656187973 656165619 655818863
2117.8 655818863 655605621 655533371 655400085 655295334 654983063 655432587 655008316 654698868 654835205 654877090
2127.4 654877090 655073547 654406052 654014435 653934708 654229279 654221802 654252930 654640427 654538651 654266434
2137.1 654266434 653614120 653520737 653448944 653591690 653761139 653791809 653975449 653717194 654098129 654095612
2146.7 654095612 654099731 653861618 653430481 653439713 653181686 653600998 653487778 653522873 653478317 653368988 653813324
2157.3 653813324 653428574 653272247 653171616 653224335 653152771 653307266 653524628 653382797 653630142 653536682
2167 653536682 653999100 653936234 653642654 653712006 653600693 653711700 653157272 652932434 653033218 653490219
2176.6 653490219 653581924 653465042 653629227 653309937 653612137 653759232 654015121 653949203 653763809 653807755
2186.3 653807755 653529587 653941803 653868713 653804321 653710861 653851242 653963852 653471909 653542557 653410721
2195.9 653410721 653806839 653677673 653282242 653603134 653689117 653762512 653782120 654333344 654433289 654354095
2205.5 654354095 654224930 654148407 654592056 654772491 654780273 654153061 654168625 654269943 654265900 654499435 654390182
2216.1 654390182 654448547 653891830 654159393 654698486 654924927 655079956 654631958 654470901 654152603 654279404
2225.8 654279404 654390259 654440536 654472427 654284134 654281158 654205780 654561920 654291229 654100876 654091644 654012222
2236.4 654012222 654068832 653617554 653577728 653481216 653603516 653627777 653907623 654324188 653757095 653285904
2246 653285904 652845078 653127289 653487625 653315277 653067551 653176193 653682327 653538284 653577499 653487015
2255.7 653487015 653352966 653174438 652957611 652974243 652642136 652764969 653010178 653302917 653166885 652867584
2265.3 652867584 652773132 652615128 652673416 652261124 652319794 652556839 652456589 652216263 652416611 652739487
2275 652739487 652183990 652208786 652317505 652314911 652171860 651996918 652022552 651924438 651940918 651488876 651652832
2285.6 651652832 651509933 651160278 651141663 651169662 651752853 651482620 651489029 651061325 650605469 650688324
2295.2 650688324 650190659 650122604 649782562 650123138 650071945 649622269 649577866 649231873 649343796 648907089
2304.9 648907089 648847809 648863068 648601227 648255081 647881546 648006439 647952957 648127747 647464447 647291107
2314.5 647291107 647284317 646652832 646433640 645889359 645692215 645520782 645604401 645118179 645113449 644950638
2324.2 644950638 644549255 645141373 643867035 643464432 643508606 643745422 644368515 643838272 642962112 642324448
2333.8 642324448 643294449 642281494 641857529 642220840 641662216 641608429 640776367 641483383 641659241 642307434
2343.4 642307434 641756821 640343323 640974808 640797195 641318970 642187958 642657318 641590729 640139542
2352.1 640139542 639575958 638900185 639047203 638540726 639137955 639167557 638377800 637270813 636221352
2360.8 636221352 636643829 635931282 636012192 636999626 638298340 637274971 636632500 637246780 636654015
2369.5 636654015 636611443 636185265 636971817 637626114 637921562 637745056 636715355 636332016 635985832 636713486
2379.1 636713486 637376137 637547722 637272339 636704636 636434898 635946312 635802002 635526810 635758476 635552177
2388.8 635552177 634859886 634895515 634614944 634401054 633967972 634122772 634289055 633731537 633271179 632920647
2398.4 632920647 632971992 632416306 632031746 631819000 631511688 631347809 630989304 631024971 630744362 630431976
2408.1 630431976 630203896 629825516 629198112 628748779 628571014 628438263 628827362 628363991 627902107 627756538
2417.7 627756538 627323456 626932411 626368370 626063232 625563278 625450974 625151939 624958115 625089989 624263344
2427.3 624263344 623773079 623665047 623596802 623139687 622579689 622346687 621923294 621638565 621461830 621389580
2437 621389580 620902977 620284424 619733276 619286804 618834610 618632507 618874741 618281898 617783928 617377090
2446.6 617377090 617071190 616980057 616594696 616404724 616009369 615726204 614923744 614452400 614310188 613765602
2456.3 613765602 613641052 613184052 612979965 612539711 612219162 612150536 611520996 611175308 610817757 610481071
2465.9 610481071 609674416 608945580 608677406 608739624 608818588 608280411 607819939 607141991 606967735 606686516
2475.6 606686516 606144028 605829086 604978943 604518394 604051361 603670349 603398705 602926826 602429199 602054291
2485.2 602054291 601725616 601106949 601067390 600592651 599985771 599766998 599290390 598761635 597909660 597718010
2494.8 597718010 597626190 597006874 596254272 595735550 595575027 595218124 594721222 594049225 593802338 593369026
2504.5 593369026 592672653 592194176 591785583 591586914 591065598 590596886 589970360 589578476 589404030 588999748
2514.1 588999748 588549767 587790451 587586823 587481384 587193413 586686325 586109505 585741730 585281563 585086479
2523.8 585086479 584522667 583909340 583234825 582696152 582327614 581930771 582159920 581853752 581347961 580749512
2533.4 580749512 580212059 580136337 579648094 579276466 579180679 578940735 578015251 577283440 577149658 576982231
2543.1 576982231 576812439 576412926 576015015 575317383 574673882 574336395 574213066 574017220 573389244 572984505
2552.7 572984505 572815704 572465286 571646309 571495628 571433945 570762558 570441856 569863358 569358711 569068565
2562.4 569068565 568835602 568298683 567786102 567661095 567293015 566981468 566306190 565864792 565439148 564911804
2572 564911804 564727516 564372292 564145241 563679810 563526726 563166504 562539673 562219658 561837769 561672173
2581.6 561672173 561087036 560635834 560220947 559957848 559787979 559199791 558975296 558676834 558534088 558071404
2591.3 558071404 557561760 557533531 557032890 556296272 556076279 556096458 555130310 554443016 554263458 553749695
2600.9 553749695 553237991 552766075 552676201 552290382 551934853 551489830 550921898 550474968 549841499 549545631
2610.6 549545631 549086189 548834953 548552628 547985115 547514839 547229004 547072678 546202583 545457268 545011559
2620.2 545011559 544666710 544421158 544150925 543930511 543537827 543284454 542495613 541616364 541113091 540735474
2629.9 540735474 540258102 539679031 539671059 539365082 538552437 537530975 536944237 536854286 536729012 536536255
2639.5 536536255 535831413 535353928 535011635 534642372 534039726 533230667 532702484 532319069 532041130 531122932
2649.1 531122932 530842171 530916328 530596733 530415497 529686775 529269905 528711624 528105698 527980118 527934875
2658.8 527934875 527846146 527401543 526889496 525950928 525584869 525599327 525169144 524663963 524108772 523898735
2668.4 523898735 523446884 523118935 522786407 522354774 522044029 521393356 521001816 520528259 520291939 520283089
2678.1 520283089 520073967 520037079 519714584 519078827 518423157 517774353 517271233 517069969 516851196 516884003
2687.7 516884003 516779404 516188812 515792694 515328293 515063820 514764023 514499893 514463196 513968506 513382492
2697.4 513382492 512961082 512648926 512337265 512121544 511813622 511436119 510759888 509989777 510044022 509989395
2707 509989395 509851875 509772530 509323463 508899193 508738861 508652153 508078461 507562332 507284698 507208176
2716.6 507208176 507024765 506671104 506376915 505896606 505869522 505561905 504893761 504490891 504580231 504839439
2726.3 504839439 504331245 504072876 503675385 503099556 503220100 503239746 502824593 502270813 502127724 502298203
2735.9 502298203 502461166 502191162 501648102 501202888 500935516 500783615 500570869 500703545 500283356 499744682
2745.6 499744682 499912643 500078545 500121727 499767914 499392357 499144554 498933105 498580017 498322487 498358345
2755.2 498358345 498094254 497891273 497811279 497721100 497377319 496958618 496533623 496265907 496286163 495759125
2764.9 495759125 495625267 495696297 495469627 495400200 495144768 494748459 493912468 493272438 493233833 493361244
2774.5 493361244 493328247 493257141 493071251 492467957 492204170 491623344 490559349 490016136 490099106 490320473
2784.2 490320473 490271835 490041962 489675598 489344254 488616486 487982559 487532272 486975861 486817474 486534958
2793.8 486534958 486204872 485703926 485275841 484980774 484521523 484104385 483503532 482933311 482150383 481659241
2803.4 481659241 481457405 481228790 480727081 479944534 479846764 479393730 478650856 477922173 477417297 476993828
2813.1 476993828 475911484 475668335 475318565 474418678 473833084 473230209 472593727 471795158 471392326
2821.8 471392326 470817642 469968452 469254265 468566780 467946358 467139969 466406288 465701180 465068893 464494019
2831.4 464494019 464064941 463445663 462633629 462020302 460974655 459940643 459009476 457945175 456652679
2840.1 456652679 455294762 454342461 453036385 451367569 449896545 448652534 447009697 445164490
2847.8 445164490 443744774 442007370 440046272 438848534 438090439 437020378 436638794 436572113 436066742
2856.5 436066742 435907478 435721397 435804138 436001587 435836716 435780716 435677490 435195198 434659767 434445381
2866.1 434445381 433835678 432907677 432074661 431280632 430776749 430745049 430587349 429789543 429323082 428928604
2875.8 428928604 428322754 427870598 427468605 427133980 426357422 425702744 425390739 424895782 424298439 423911133
2885.4 423911133 423430519 422322388 421441765 420793419 419980011 419177589 418287430 417344666 416726608
2894.1 416726608 416468964 415833549 415194969 414687347 413960495 413128738 412339554 411793976 411231689 410785027
2903.7 410785027 410389175 410035133 409440613 408647728 407989655 406846771 405885620 405364342 404682655
2912.4 404682655 403448906 402015419 401304245 400646667 399418831 398169174 397258034 396103554 395256538
2921.1 395256538 394771690 394079895 393928757 393557854 393249092 393201485 392839470 392914505 393442268 394172783
2930.7 394172783 394370956 394320297 394356346 394214516 394459839 394991150 395818596 396727943 397351227 398031120
2940.4 398031120 398732376 399009132 399312057 399984627 400288582 400417023 401093674 401948357 402279854 402632484
2950 402632484 403358498 403689499 403438454 403256416 403566818 403965988 404400482 404890099 405653038 406470108
2959.7 406470108 406580582 406757278 407415314 408022423 408447838 408997498 409510727 409821777 410392685 411112900
2969.3 411112900 411664352 412155571 412894897 413496246 414031258 414400673 414277077 414436226 415102692 416212578
2979 416212578 416742668 416758804 416974220 416941528 416966858 417306519 418075294 418154411 417932243 418202248 418130722
2989.6 418130722 418066826 417819023 417931442 418170357 418096237 418282967 418339844 418214149 417617760 417044525
2999.2 417044525 416485252 415901222 415805016 415747948 415418930 414978561 414980888 414748268 414380417 414290848
3008.8 414290848 414162674 413773346 412758369 412128563 412083282 411910934 410945358 410023575 409906044 409672165
3018.5 409672165 409453163 408985672 408719406 408463669 407811584 407315521 406576958 406039619 405685806 405376129
3028.1 405376129 404901772 404353714 403889961 403252411 402934532 402531281 402176323 401400375 400346107
3036.8 400346107 399959412 399366570 398682671 398303947 397889671 397119560 396379318 395972404 395490036 394781189
3046.5 394781189 394081078 393652420 393126335 392678757 392195396 391645279 391088181 390374641 389837608 388988724
3056.1 388988724 388488960 388401451 387714653 386753998 386052895 385642509 385221901 385025635 384680252 384031982
3065.7 384031982 383484802 383063889 382669258 382206993 381888390 381299210 380521164 379685249 379258957 379476318
3075.4 379476318 379422302 378672142 377464104 377189827 377024422 376126671 375600471 375373383 375254707 374706039
3085 374706039 374117813 373591576 372821083 372268372 372100372 371959648 371219177 370841484 370319824 369437256
3094.7 369437256 369330292 369182129 368739128 368028183 367597237 367526093 366883430 365841446 364980392 364978371
3104.3 364978371 365217781 364771843 364080124 363388214 362541389 362058601 361911812 361537590 360905991 360494347
3114 360494347 360660477 360363579 359546738 358891983 358353729 357978897 357533493 357170715 356375580 355109673
3123.6 355109673 354300842 353964005 353744812 353534851 353224945 352689362 352106552 351314087 350789528 350326576
3133.3 350326576 349668922 349331131 348987045 348841515 348161659 347556839 347460403 346649094 345765648 344724617
3142.9 344724617 344143562 344077797 343624268 343146629 342374229 341746826 341368141 340735626 340164795 339888420
3152.5 339888420 339569817 338933334 338101387 337441864 336901855 336211853 336081047 336152039 335849876 335216484
3162.2 335216484 334439125 333749657 333053169 333052025 332730827 331846199 331228867 330446548 329740868 329013405
3171.8 329013405 328587456 328313141 327989731 327456322 326739845 326275978 325366440 324762611 324214363 323774338
3181.5 323774338 323826141 323257828 322644386 321846809 321107330 320822411 320554161 320284271 319591331 318666515
3191.1 318666515 317679634 317116356 317114258 316663857 315729790 315408287 315395012 315101624 314830990 313972931
3200.8 313972931 313102627 312697811 312401695 312162113 311647968 311117249 310674992 310476284 310158253 309945946
3210.4 309945946 309846020 308962936 308307858 308062553 307805634 307400455 306417542 305778618 305528011 304936199
3220 304936199 304720726 304836521 304575920 304180336 303514481 303060894 302652073 301969337 302061062 301773510
3229.7 301773510 300825768 300432968 300145836 299847565 299636822 299119244 298561382 298220024 297846355 297541828
3239.3 297541828 296954556 296470089 296074944 295219173 294710674 294415989 294515285 294516945 293735313 292970314
3249 292970314 292719936 292791309 292243786 292166996 292433777 292081051 292123241 291460285 290287209 289869652
3258.6 289869652 289706211 289407787 288931980 288525028 288463554 288492870 287917919 287417259 287452621 287274647
3268.3 287274647 286558800 286037922 285997849 285523396 285404797 285624199 285307465 284902382 284262295 283843670
3277.9 283843670 283624744 283340950 283306885 283074780 282598648 282375240 282253380 281736641 281130810 280880184
3287.5 280880184 280617561 280346088 280587883 280761566 280302925 279687557 279325886 279191761 278968849 278722420
3297.2 278722420 278094425 277219410 276871986 276827354 277073803 277366238 277114315 276695194 276552658 275934200
3306.8 275934200 274945145 274405003 274372444 275040474 275067406 274168224 273399582 272863998 272995014 272890530
3316.5 272890530 272228851 271642876 271362896 271273746 270764198 270360909 269908867 269329510 269052029 268715439
3326.1 268715439 268314590 267734909 267090378 266516685 266209431 266140766 265683384 264917164 264279022 263670712
3335.8 263670712 263047485 262954388 262958908 262485409 261708126 260898972 260705566 260369053 259455509 259232063
3345.4 259232063 259296703 258792267 258158913 258095551 258386345 257970390 257401295 257017918 256274433 255935154
3355.1 255935154 255904522 255529385 255167046 255332527 255245876 254341984 253807163 253672771 253632584 253683834
3364.7 253683834 253609848 253170700 252556572 252518120 252192154 251610203 251350365 251493587 251634903 251055470
3374.3 251055470 251040039 251028423 250681248 250380573 249909115 250278568 249960785 249221802 249324398 249218235
3384 249218235 248995342 248768005 248888493 248811321 248468742 248506031 248122139 247575073 247370167 247461720
3393.6 247461720 247272587 246786880 246883316 246997681 246947842 247166824 247015457 246539860 246270714 246181450
3403.3 246181450 246069565 245622501 245370007 245968056 246503887 246347961 245991688 245929756 246241531 246261425
3412.9 246261425 246180782 246254311 245900002 246052799 246614227 246563873 246367035 246140480 246335335 246676006
3422.6 246676006 246507187 246704350 247341957 247426338 247152061 247254047 247417336 247646542 247956562 248155804
3432.2 248155804 248134270 248145561 248582592 248868313 249492168 249850388 249722118 249988441 249741268 249901428
3441.8 249901428 250548840 250904541 251005535 250907536 251115837 251030998 251752052 252697163 252828827 252955513
3451.5 252955513 253193779 253623390 253704681 253865662 254542255 255297318 255654392 255782604 256098690 255996227
3461.1 255996227 256569614 257564392 258163719 258703766 258870029 259304771 259965897 260853539 261256828 261035728
3470.8 261035728 261231689 261572704 262395020 263055573 263277893 264098530 265043144 265474339 265899868 266641216
3480.4 266641216 267168617 267469139 267863064 268425579 268598270 268875465 269803352 270353718 270744209 271452694
3490.1 271452694 272406445 273336067 273954620 274250088 274649220 275606384 276003761 276011448 276643238 277291660
3499.7 277291660 277680016 278294201 278718891 279141655 280252495 281009941 281816273 282874737 283517895
3508.4 283517895 283531017 283792953 285132122 286180782 287148800 288030567 288446255 288953724 289299831
3517.1 289299831 289702740 290057182 290888348 292114639 293059998 293390369 293376312 294289017 294914455 295453148
3526.7 295453148 296782227 298220882 299580650 300212059 300181808 300857086 301852322 302301826 303505497
3535.4 303505497 304351711 304617634 305544643 306321774 307554531 308691425 309970093 311121445 311821651
3544.1 311821651 312515984 312955189 313855343 314065876 315313568 317084522 318833866 319777641 319045162
3552.7 319045162 321095543 322739830 323656311 324825249 325588493 327523766 328696594 329496498 329774437
3561.4 329774437 330664825 331828117 332940559 335559616 335502472 336145859 336361771 337252083 341027489
3570.1 341027489 342484207 343806152 345552940 346491814 347274246 348825798 350692520 351333580 352717514
3578.8 352717514 354022751 355657654 357833290 359459038 360415497 361366348 364038048 364919014 365000038
3587.5 365000038 366334038 367197533 370271072 372621193 374762001 375708618 376466751 379087372 379131813
3596.1 379131813 381013641 383722878 385270309 387965126 388756218 389792557 391902428 393155289
3603.9 393155289 395183830 398242798 400004425 399672813 402513809 402777176 403925629 409580879 410261917
3612.5 410261917 410329170 413784676 414427567 417945557 420915794 422062645 424491501 425396729 427091675
3621.2 427091675 429696045 431760330 433685608 436698303 438938560 441095924 446150818 447203827
3628.9 447203827 443507881 447321091 451445541 455504723 457410126 457862167 460767174 464327126
3636.6 464327126 467164726 469184570 471141701 473257828 475612602 477551498 479577942 482668190
3644.4 482668190 486175308 490339317 490816803 490066643 494647331 497733154 496343498 496611176 502378502
3653 502378502 506752815 510821571 515929222 512108002 514855423 519562798 522046165 525085793 526537132
3661.7 526537132 528959427 530323334 531958351 533588867 535360985 541109695 543834763 543898888 544335861
3670.4 544335861 539752312 543685493 551001358 557788315 554991493 544254227 549842453 556381493
3678.1 556381493 560283318 559514618 560485268 563342094 565548096 567193527 568127899 568532982 572093849
3686.8 572093849 578376198 571522865 569703140 577337570 573065071 572835388 577020607 577953148 579837914
3695.5 579837914 580943718 581719818 583251038 583463287 585832062 588536797 584207611 583410492 588038521
3704.1 588038521 589291992 588503723 588820343 592025146 595492058 589524002 593652344 597978172 585918121
3712.8 585918121 589594193 593497581 593995323 595380630 597752991 598141136 594466934 596657486 602669182
3721.5 602669182 599660683 596113930 600773773 601679344 601015968 599081879 598886795 601679802 602557983
3730.2 602557983 606953201 604229889 598915939 606949844 606872253 599521523 600622292 602980499 603098450
3738.9 603098450 604703484 606415329 602496986 606564522 615522003 601264725 592455177 601501350
3746.6 601501350 607126694 613843842 611180077 601926880 610422020 606097260 601676445 607030334
3754.3 607030334 611056786 613682022 609276085 611773567 616211014 608288155 607386780 611429863
3762 611429863 612423439 612709618 615807266 612956924 608698082 612079887 616000214 615564232 609412308
3770.7 609412308 611791267 614194984 614320183 615238419 614804687 615546875 616157036 618282585 617176399
3779.4 617176399 610987282 613874435 615736160 616878777 618331680 615273933 615113792 616369781
3787.1 616369781 616896362 617239380 616623268 616930504 617219429 617152252 616815681 618323250 620879555
3795.8 620879555 616678658 614366989 617362518 620887260 626437416 620465965 610895844 614860764
3803.5 614860764 617204628 620934753 624665833 615960617 613679695 618069916 619483261 619432335 619401970
3812.2 619401970 619225235 620940895 625987701 624293633 612626343 616466866 621310425 625574570
3819.9 625574570 626702461 611178970 613164902 618601265 620944328 622399101 621091423 617881546
3827.6 617881546 618509293 620124626 622508965 622880096 616090050 618863144 624574280 620096130 620234222
3836.3 620234222 625869522 617257767 615129852 622132339 617636261 618467979 623747864 619589539
3844 619589539 616614418 619834862 621477432 621391487 622040749 620997276 622826996 626689911 621022186
3852.7 621022186 622679443 611365089 614291725 622414474 619683380 618264618 620224495 622583313
3860.4 622583313 624535294 618737831 619856300 625581245 618801956 615025139 619576492 624126663
3868.1 624126663 628612404 620738258 613260269 617923889 623250771 625026054 616778793 617617493
3875.8 617617493 620585213 620519371 622589531 625496750 620127258 615319366 620404778 620994835 622789650
3884.5 622789650 627634583 616819115 617275543 620421410 621690369 625481834 623632469 617013283
3892.2 617013283 618292427 619728508 617557411 618903351 620567818 622830505 623809624 615824509
3899.9 615824509 620709381 622435265 617688293 619831886 616277466 617014618 617818756 618224297 619780426
3908.6 619780426 619369469 619364891 618950691 619838333 620448036 620018921 621091843 621844902 618396187 616442795
3918.2 616442795 620486908 619974747 616394272 617997284 619039383 620014420 618975487 616652107 617493057
3926.9 617493057 618635139 619515343 618591805 618392677 619885178 617729988 616947479 618951607 618673706
3935.6 618673706 617560081 617847061 617980804 617645569 617885246 618979378 619148064 616198730 616042404
3944.3 616042404 617294579 617623672 618051682 616386757 616731300 616900826 615545845 617251625 617787781
3953 617787781 617476616 617545242 617681007 617867699 616921310 616763649 616800957 617808418 618167915 616110344
3962.6 616110344 615953636 616783409 616711426 616430092 616303596 616195145 615763626 615759239 616726875 617048569
3972.2 617048569 616513977 616356049 616047592 615673485 615367584 615736046 616189117 615981598 615920715 616071472
3981.9 616071472 616419258 616369324 616209946 615925751 615910988 615891533 615506706 615969658 615980759 615536423
3991.5 615536423 614812965 615052452 615869522 614934006 614834328 615145416 615456886 616020432 616104889
4000.2 616104889
##END=$$ End of the data block
