##TITLE=$$ Begin of the data block
##JCAMP-DX=5.00 $$ ACD/SpecManager v 10.08
##SPECTROMETER/DATA SYSTEM=Varian
##DATE=15 Jan 2013 15:29:28
##DATA TYPE=INFRARED SPECTRUM
##DATA CLASS=XYDATA
##ORIGIN=
##OWNER=
##NPOINTS=3735
##FIRSTX=399.26403809
##LASTX=4000.35498047
##MAXX=4000.35498047
##MINX=399.26403809
##MAXY=68.17723083
##MINY=24.59210777
##XFACTOR=1.0000000000
##YFACTOR=0.000000100000000
##FIRSTY=41.33956909
##DELTAX=0.96440572
##XUNITS=1/CM
##YUNITS=TRANSMITTANCE
##XYDATA=(X++(Y..Y))
$$ plain form
399.3 413395691 408735695 407012634 404503708 399357719 390398636 383156929 384624100 393098145
407 393098145 400831871 401068764 397843094 395699844 397151756 397411690 396374092 398364105 401844444
415.7 401844444 406441231 400806351 390952034 400384789 396151047 399360199 400875626 398790588
423.4 398790588 400199432 398981552 398715591 402376747 407606430 405068588 400977516 402364922 405098610
432.1 405098610 406028862 401482582 400473824 400729370 397564163 396202087 395786972 399261398 401687584
440.7 401687584 401609154 400958862 397957191 395618439 395662003 396864586 397328720 397971382 399676628
449.4 399676628 399985085 395724258 388830910 387281265 394138832 399982643 400293007 396655922 392763710
458.1 392763710 396814690 397466393 396484680 397701035 393711281 391847191 394485207 397084274 397479630
$$ packed form
399.3D13395691m659996j723061k508926n145989q959083p241707J467171Q474045
407C93098145P733726K36893l225670k143250J451912K59934j037598J990013L480339
415.7D01844444M596787n634880r854317R432755m233742L209152J515427k085038
423.4C98790588J408844j217880k65961L661156N229683k537842m091072J387406K733688
432.1D05098610R30252m546280j008758K55546l165207j362076m15115L474426K426186
440.7D01687584p8430o50292l001671k338752M3564J202583M64134O42662J705246
449.4C99676628L08457m260827o893348j549645O857567N843811L10364l637085l892212
458.1C92763710M050980O51703r81713J216355l989754j864090K638016K599067L95356
$$ plain form
466.8 397479630 395938568 395818634 393094673 392870865 396349449 397140121 394908676 392819633 393051186
475.5 393051186 393931923 395279999 397296715 394717941 390092163 388980827 389470749 390581245 389652290
484.1 389652290 385494576 386800041 391354027 392521133 392988930 392417107 389223061 385010643 384851074
492.8 384851074 386833954 386287422 385368614 384526749 383862038 385007133 385435638 385616302 385369682
501.5 385369682 383801041 384908142 387246628 388538857 388159637 386948395 386461868 387975540 389580460
510.2 389580460 386902428 382392654 381231194 383623810 384343224 383212814 383830032 383703423 383178101
518.9 383178101 380997620 378365746 379992867 383275986 383443336 380435677 377767906 376592026 377313232
527.5 377313232 379196892 379795952 378671074 377562256 377287254 376944313 377747726 379087372 379045753
$$ packed form
466.8C97479630j541062j19934k723961k23808L478584P90672k231445k089043K31553
475.5C93051186Q80737J348076K016716k578774m625778j111336M89922J110496r28955
484.1C89652290m157714J305465M553986J167106M67797n71823l194046m212418j59569
492.8C84851074J982880n46532r18808q41865o64711J145095M28505J80664k46620
501.5C85369682j568641J107101K338486J292229l79220j211242m86527J513672J604920
510.2C89580460k678032m509774j161460K392616P19414j130410O17218j26609n25322
518.9C83178101k180481k631874J627121L283119J67350l007659k667771j175880P21206
527.5C77313232J883660N99060j124878j108818k75002l42941Q03413J339646m1619
$$ plain form
536.2 379045753 377672043 376146851 376112633 376609383 377533607 378335342 377701492 375978699 375124474
544.9 375124474 375425415 374059448 374027824 375847130 375910835 374649925 373785095 373160057 371735497
553.6 371735497 370267563 368917847 368735580 368550835 367909050 369056702 369729042 369988327 371342316
562.3 371342316 372361832 371820526 370807114 370631485 370448341 370096092 369692459 369881248 370946884
570.9 370946884 371968460 371135330 369840050 369541931 368730087 368539124 367658691 367011604 368077698
579.6 368077698 369267807 370222893 369562454 369813652 370456009 369034119 367141075 365771370 367084389
588.3 367084389 369028854 369834747 370321846 370376129 371142654 371229248 370636978 371168938 371496658 371349945
597.9 371349945 371323738 370414429 369975739 371338310 372118530 371045952 369578590 368504486 367675209
$$ packed form
536.2C79045753j373710j525192l4218M96750R24224Q01735o33850j722793q54225
544.9C75124474L00941j365967l1624J819306O3705j260910q64830o25038j424560
553.6C71735497j467934j349716j82267j84745o41785J147652O72340K59285J353989
562.3C71342316J019516n41306j013412j75629j83144l52249m03633J88789J065636
570.9C70946884J021576q33130j295280k98119q11844j90963q80433o47087J066094
579.6C68077698J190109R55086o60439K51198O42357j421890j893044j369705J313019
588.3C67084389J944465Q05893M87099N4283P66525Q6594n92270N31960L27720j46713
597.9C71349945k6207r09309m38690J362571P80220j072578j467362j074104q29277
$$ plain form
606.6 367675209 367828865 368394547 368394012 368330002 367906494 367137184 366656265 366877632 367575417 366985588
616.3 366985588 365136757 365298462 366714211 366951790 367156029 367342033 367338066 367698364 368358650 369076653
625.9 369076653 369968452 370608330 370934753 371984596 373225098 375424156 377633286 378969841 379836540
634.6 379836540 379743576 381070251 381880264 381680031 382546082 383079872 384075394 385342751 386693802
643.3 386693802 388062935 388434677 388287468 387875862 388076859 388986855 389668617 390156059 391083908 391851807
652.9 391851807 391823578 392004509 392378426 392901382 393696022 393970146 393351021 392309456 391388283 390895538
662.5 390895538 391677208 391864662 391121101 391866646 391319923 386495972 389318733 390575104 391012077
671.2 391012077 392031479 393650017 396002502 397432060 397512131 398265266 399180794 399228897 399272575 399318771
$$ packed form
606.6C67675209J53656N65682n35o4010m23508p69310m80919K21367O97785n89829
616.3C66985588j848831J61705J415749K37579K04239J86004l967L60298O60286P18003
625.9C69076653Q91799O39878L26423J049843J240502K199058K209130J336555Q66699
634.6C79836540r2964J326675Q10013k00233Q66051N33790R95522J267357J351051
643.3C86693802J369133L71742j47209m11606K00997R09996O81762M87442R27849P67899
652.9C91851807k8229J80931L73917N22956P94640K74124o19125j041565r21173m92745
662.5C90895538P81670J87454p43561P45545n46723m823951K822761J256371M36973
671.2C91012077J019402J618538K352485J429558Q0071P53135R15528M8103M3678M6196
$$ plain form
680.9 399318771 400064392 401377068 401735573 401926613 403532333 406083260 407338905 407739410 408273926
689.6 408273926 407950401 407893372 408270950 408283272 408736343 409728394 410539398 411152382 412121582 413205986
699.2 413205986 413409042 412809296 412967529 413700981 414117928 414798241 416435165 418803596 419837685
707.9 419837685 419487762 419290924 419039497 419179001 419587669 419346924 419492493 420886841 422269783
716.6 422269783 422442284 422544785 423897438 424547920 423908119 424101982 424819908 425708923 427126007
725.2 427126007 428779335 429117088 428449631 429505539 431207466 431035461 430004997 430134850 430447083
733.9 430447083 431653824 433796616 433557434 433117371 434014091 434339180 434135437 433992996 434110374
742.6 434110374 434357109 434499397 434328194 435379829 437261200 438581467 439125061 439001808 439507942
$$ packed form
680.9C99318771P45621J312676L58505J91040J605720K550927J255645M00505N34516
689.6D08273926l23525n7029L77578J2322M53071R92051Q11004O12984R69200J084404
699.2D13205986K03056n99746J58233P33452M16947O80313J636924K368431J034089
707.9D19837685l49923j96838k51427J39504M08668k40745J45569J394348J382942
716.6D22269783J72501J02501J352653O50482o39801J93863P17926Q89015J417084
725.2D27126007J653328L37753o67457J055908J701927j72005j030464J29853L12233
733.9D30447083J206741K142792k39182m40063Q96720L25089k03743j42441J17378
742.6D34110374K46735J42288j71203J051635J881371J320267N43594j23253N06134
$$ plain form
751.3 439507942 439848251 440181503 441148529 442595177 443926048 444680672 445716858 445796776 446052628
760 446052628 447148972 447867012 448584938 449445190 450825806 451559792 451773224 452213287 452153816 451660690
769.6 451660690 451852837 452160225 451957932 452134705 451862602 452331276 452923737 452591629 453109856 453642349
779.2 453642349 453115654 451863327 451826630 452794571 454097137 454354210 452950897 453240738 454217911
787.9 454217911 454999275 455984192 456721535 457334938 457328110 456838455 456144104 456320305 456085243 455534096
797.6 455534096 455332832 454158134 452931747 452509880 451759758 450026474 449822731 450021820 448731499
806.2 448731499 446841507 444781380 444297409 443880234 442107925 440930939 440656586 440272141 440167961
814.9 440167961 439605904 438266830 436950340 435534172 436099281 436700134 436431732 437327690 438180428
$$ packed form
751.3D39507942L40309L33252R67026J446648J330871P54624J036186P9918K55852
760D46052628J096344P18040P17926Q60252J380616P33986K13432M40063n9471m93126
769.6D51660690J92147L07388k02293J76773k72103M68674N92461l32108N18227N32493
779.2D53642349n26695j252327l6697R67941J302566K57073j403313K89841R77173
787.9D54217911P81364R84917P37343O13403o828m89655o94351J76201k35062n51147
797.6D55534096k01264j174698j226387m21867p50122j733284k03743J99089j290321
806.2D48731499j889992k060127m83971m17175j772309j176986k74353l84445j04180
814.9D40167961n62057j339074j316490j416168N65109O00853k68402Q95958Q52738
$$ plain form
823.6 438180428 439935837 442177811 444313927 445668831 446896515 449486313 451618385 454638748
831.3 454638748 457745552 460360374 463033218 465184479 468246002 470465050 470796623 471545372 473962593
840 473962593 475523453 476950951 479510803 481741905 483305283 483635788 484888763 486339531 487253914
848.7 487253914 487532883 487421455 488575096 489711571 490874100 491928520 493842545 495419350 496456947
857.4 496456947 497548866 497966118 499328995 499770775 500754929 501441765 501102486 502280273 503682289
866 503682289 503657684 501605072 501697731 501978874 500160294 498210449 496931686 496827965 495619736 495100327
875.7 495100327 494949112 494423866 493742638 492419395 491441002 490320663 489891434 488978043 488303146
884.4 488303146 488545341 488889656 488215866 486714783 486233597 484913979 485057297 485488853 484636421
$$ packed form
823.6D38180428J755409K241974K136116J354904J227684K589798K132072L020363
831.3D54638748L106804K614822K672844K151261L061523K219048L31573P48749K417221
840D73962593J560860J427498K559852K231102J563378L30505J252975J450768R14383
848.7D87253914K78969j11428J153641J136475J162529J054420J914025J576805J037597
857.4D96456947J091919M17252J362877M41780R84154O86836l39279J177787J402016
866E03682289k4605k052612R2659K81143j818580j949845j278763j03721j208229n19409
875.7D95100327j51215n25246o81228j323243r78393j120339m29229r13391o74897
884.4D88303146K42195L44315o73790j501083m81186j319618J43318M31556q52432
$$ plain form
893 484636421 484558945 484219780 484701347 484924049 485184860 485209312 484107208 483397408 482508507 481203041
902.7 481203041 480725136 482242775 483552895 484828835 486838646 488952904 491317024 492370071 492625656
911.4 492625656 492501259 492697258 492600136 492527695 492020454 489585114 488198509 486821594 484239540
920 484239540 481621742 479272232 477243690 475418358 473081818 469781456 466546822 462994080 460268135
928.7 460268135 458250084 456037292 453785095 451624870 450443344 448846703 447606926 446723099 445435791
937.4 445435791 445349731 445172615 444033661 442586479 441712151 441336823 440464897 439147568 438605881
946.1 438605881 438882103 438094254 437239990 437450867 437643852 437503281 437787743 438358421 438190269 437415810
955.7 437415810 436143532 434539337 432394943 430412865 428679276 426918564 425931206 424648247 423192253
$$ packed form
893D84636421p7476l39165M81567K22702K60811K4452j102104p09800q88901j305466
902.7D81203041m77905J517639J310120J275940K009811K114258K364120J053047K55585
911.4D92625656j24397J95999r7122p2441n07241k435340j386605j376915k582054
920D84239540k617798k349510k028542j825332k336540l300362l234634l552742k725945
928.7D60268135k018051k212792k252197k160225j181526j596641j239777q83827j287308
937.4D45435791q6060j77116j138954j447182q74328l75328q71926j317329n41687
946.1D38605881K76222p87849q54264K10877J92985j40571K84462N70678j68152p74459
955.7D37415810j272278j604195k144394j982078j733589j760712r87358j282959j455994
$$ plain form
964.4 423192253 422069054 420711250 418882637 417154236 415517998 413102798 411404877 410151787
972.1 410151787 407975044 405387039 403002815 401050568 398631401 395592003 392225266 389010658
979.8 389010658 385581284 381142616 377658539 375031128 371502228 367804451 364075317 360942345
987.6 360942345 358444328 356071587 353166695 349509125 347050018 344658012 342315826 340400162
995.3 340400162 338546143 337168503 334935112 333057060 330790215 327867012 326184616 325129204
1003 325129204 323872833 322345581 321055832 319602337 318360558 317034817 316217747 315401917 313379250
1011.7 313379250 312118454 310969162 309501877 307946129 306785698 305950222 304389496 302443733
1019.4 302443733 300456276 299004536 297441788 296512032 295270691 293354893 291961231 290662251
$$ packed form
964.4D23192253j123199j357804j828613j728401j636238k415200j697921j253090
972.1D10151787k176743k588005k384224j952247k419167l039398l366737l214608
979.8C89010658l429374m438668l484077k627411l528900l697777l729134l132972
987.6C60942345k498017k372741k904892l657570k459107k392006k342186j915664
995.3C40400162j854019j377640k233391j878052k266845k923203j682396j055412
1003C25129204j256371j527252j289749j453495j241779j325741q17070q15830k022667
1011.7C13379250j260796j149292j467285j555748j160431q35476j560726j945763
1019.4C02443733j987457j451740j562748r29756j241341j915798j393662j298980
$$ plain form
1027.1 290662251 289748878 287671604 286113605 285862408 285531292 284697132 283918381 284403610 284967861
1035.8 284967861 286119022 286844845 287457809 288743420 290364418 291332722 291380939 292174587 291937904
1044.5 291937904 292522793 293217564 292692280 291959133 290226688 289836903 289693203 289279861 288351593
1053.1 288351593 287395992 286285267 284418755 283708229 282854195 283966675 285504913 285805206 286398735
1061.8 286398735 287823029 290173931 291682777 293655567 295013504 296565266 298076954 299323978
1069.5 299323978 300996952 301141300 301781521 301890717 301942539 302275467 302295513 302475185 302216053 303044586
1079.2 303044586 303346348 304019184 305271606 306068077 306354141 306036797 306588421 307646847 309015999
1087.9 309015999 309227600 310073318 311409893 312228947 313940220 314591751 314954948 315738640 317102985
$$ packed form
1027.1B90662251r13373k077274j557999k51197l31116q34160p78751M85229N64251
1035.8B84967861J151161P25823O12964J285611J620998R68304M8217P93648k36683
1044.5B91937904N84889O94771n25284p33147j732445l89785j43700m13342r28268
1053.1B88351593r55601j110725j866512p10526q54034J112480J538238L00293N93529
1061.8B86398735J424294K350902J508846J972790J357937J551762J511688J247024
1069.5B99323978J672974J44348O40221J09196N1822L32928K0046J79672k59132Q28533
1079.2C03044586L01762O72836J252422P96471K86064l17344N51624J058426J369152
1087.9C09015999K11601Q45718J336575Q19054J711273O51531L63197P83692J364345
$$ plain form
1096.5 317102985 317650509 317768688 319045620 320130119 321475716 322670593 323983765 325033417 326365318
1105.2 326365318 327696114 327973747 328023987 327574921 328125114 328909569 329837036 330827713 331320610 332479057
1114.9 332479057 333213005 333414879 333059616 333506775 333988838 333416595 333179741 333138504 333656464 333731270
1124.5 333731270 334073524 334647980 334949112 335807991 336802254 338032722 339295082 341180153 342920914
1133.2 342920914 344606628 346089439 347356110 349780312 352172775 353885384 355044441 356656952
1140.9 356656952 358086128 358553391 358980980 359437294 360524063 361944008 363018036 363107567 362885704
1149.6 362885704 363182449 363759193 364281464 363778877 363259773 362736588 362050667 361959915 361478043 360683594
1159.2 360683594 359994354 359343376 358913307 359295349 359823532 360307503 360937195 361497993 363368797
$$ packed form
1096.5C17102985N47524J18179J276932J084499J345597J194877J313172J049652J331901
1105.2C26365318J330796K77633N0240m49066N50193P84455R27467R90677M92897J158447
1114.9C32479057P33948K01874l55263M47159M82063n72243k36854m1237N17960P4806
1124.5C33731270L42254N74456L01132Q58879R94263J230468J262360J885071J740761
1133.2C42920914J685714J482811J266671K424202K392463J712609J159057J612511
1140.9C56656952J429176M67263M27589M56314J086769J419945J074028Q9531k21863
1149.6C62885704K96745N76744N22271n02587n19104n23185o85921r0752m81872p94449
1159.2C60683594o89240o50978m30069L82042N28183M83971O29692N60798J870804
$$ plain form
1167.9 363368797 366180153 368844643 370335693 371816826 374265938 376499710 378995399 381448936
1175.6 381448936 383481102 385296822 387472343 390160065 392541885 394920197 396791382 397560272
1183.3 397560272 398684807 400279121 401676865 403132362 404273949 405022888 405547714 405691299 405515480
1192 405515480 405449867 404858894 404022217 403740120 403521843 403158646 402022209 401026993 400776443 400397682
1201.6 400397682 399473000 398514786 397974434 396701088 395535774 395026703 394656525 394545250 394319000
1210.3 394319000 394321022 394138641 393640518 392833252 392025070 391821022 391543922 391655121 391918831 392013321
1220 392013321 391950645 391050491 390242233 390016327 389860992 389062233 387801132 387272987 387321243 387172966
1229.6 387172966 386762314 386208229 385387192 384567184 384216156 384167786 383828621 383215446 382942200 383036156
$$ packed form
1167.9C63368797K811356K664490J491050J481133K449112K233772K495689K453537
1175.6C81448936K032166J815720K175521K687722K381820K378312J871185P68890
1183.3C97560272J124535J594314J397744J455497J141587P48939N24826J43585j75819
1192D05515480o5613n90973q36677k82097k18277l63197j136437r95216k50550l78761
1201.6D00397682r24682r58214n40352j273346j165314n09071l70178j11275k26250
1210.3C94319000K022j82381m98123q07266q08182k04048k77100J11199K63710R4490
1220C92013321o2676r00154q08258k25906j55335p98759j261101n28145M8256j48277
1229.6C87172966m10652n54085q21037q20008l51028m8370l39165o13175k73246R3956
$$ plain form
1239.3 383036156 383228264 383091736 382981911 382962837 382132225 381390839 381228905 381256065 381134720 380550766
1248.9 380550766 380118256 379798965 379809456 379837189 379558372 379553757 379316750 379098778 379221458 379091988
1258.5 379091988 378730164 378638420 378583717 378687553 379320259 379721031 380181160 380532913 380503807 380855446
1268.2 380855446 381482658 382065887 382638206 383212852 383887520 384905434 385592270 386296806 387124252
1276.9 387124252 387785110 388844299 389391518 389762459 390578384 391744423 393149796 394423332 395560532
1285.5 395560532 396336594 397070618 397909546 399064865 399928818 400352402 400838051 401356049 402331657
1294.2 402331657 403088112 403458061 403951492 404613190 405162430 405377579 405489044 405442314 405182648 405120354
1303.9 405120354 405602264 405987511 406025391 405624886 405025940 404654465 404073372 403314743 402644501 402459602
$$ packed form
1239.3C83036156J92108j36528j09825j9074q30612p41386j61934K7160j21345n83954
1248.9C80550766m32510l19291J0491K7733k78817m615k37007k17972J22680j29470
1258.5C79091988l61824r1744n4703J03836O32706M00772M60129L51753k9106L51639
1268.2C80855446O27212N83229N72319N74646O74668J017914O86836P04536Q27446
1276.9C87124252O60858J059189N47219L70941Q15925J166039J405373J273536J137200
1285.5C95560532P76062P34024Q38928J155319Q63953M23584M85649N17998R75608
1294.2D02331657P56455L69949M93431O61698N49240K15149J11465m6730k59666o2294
1303.9D05120354M81910L85247L7880m00505n98946l71475n81093p58629o70242j84899
$$ plain form
1313.5 402459602 402076302 401452827 401271477 401160507 401229744 401622086 402378464 403097954 403825912 404726639
1323.2 404726639 405252647 405765572 406371727 406797752 406858597 406677208 406310997 406219215 406245003 405788841
1332.8 405788841 405493393 405213280 404915276 404656792 404343719 404238853 404644966 405515823 406095886 406876030
1342.4 406876030 407447968 407946472 408813591 409503708 410000343 410152206 410577621 410676613 410603065 410452499
1352.1 410452499 410008850 410026627 409751854 409423714 409634933 410192947 409667625 409004822 408906136 408143349
1361.7 408143349 407781181 407014732 407121849 407214394 406569977 406109657 405117226 404988136 405089035 405063782
1371.4 405063782 405164413 405016174 404683609 404383507 404915276 404833984 404545517 404422607 404358368 403876038
1381 403876038 402715149 401817894 400520897 399498291 398855095 397692146 395637932 394671822 394100304
$$ packed form
1313.5D02459602l83300o23475j81350j10970O9237L92342P56378P19490P27958R00727
1323.2D04726639N26008N12925O06155M26025O0845j81389l66211r1782K5788m56162
1332.8D05788841k95448k80113k98004k58484l13073j04866M06113Q70857N80063P80144
1342.4D06876030N71938M98504Q67119O90117M96635J51863M25415R8992p3548j50566
1352.1D10452499m43649J7777k74773l28140K11219N58014n25322o62803r8686p62787
1361.7D08143349l62168p66449J07117R2545o44417m60320r92431j29090J00899k5253
1371.4D05063782J00631j48239l32565l00102N31769q1292k88467j22910o4239m82330
1381D03876038j160889q97255j296997j022606o43196j162949k054214r66110n71518
$$ plain form
1389.7 394100304 392760201 391748314 390568504 389190216 386723900 383498535 382232132 381178284
1397.4 381178284 380001869 377730370 376169701 375211334 373383217 371557693 369946747 367955360
1405.1 367955360 366307297 365235405 363827133 362027359 360396461 359343834 358955994 358137398 357122917
1413.8 357122917 356000900 354723434 353758736 352868614 353008575 352042503 352213058 353333282 353370743
1422.5 353370743 353504105 353123627 354052467 355165558 355463943 356428947 357082176 357679329 358363190
1431.2 358363190 359946289 360938110 361694489 363627090 364449158 364097290 365804329 368649483 370104218
1439.8 370104218 370988503 372427559 373426666 374981995 375761108 376893158 378012657 379032516 379950714
1448.5 379950714 381000900 382851677 383363533 384170036 385143623 386640968 388876991 390558510 390062943
$$ packed form
1389.7C94100304j340103j011887j179810j378288k466316l225365j266403j053848
1397.4C81178284j176415k271499j560669r58367j828117j825524j610946j991387
1405.1C67955360j648063j071892j408272j799774j630898j052627l87840q18596j014481
1413.8C57122917j122017j277466r64698q90122J39961r66072J70555J120224L7461
1422.5C53370743J33362l80478R28840J113091K98385R65004O53229N97153O83861
1431.2C58363190J583099R91821P56379J932601Q22068l51868J707039K845154J454735
1439.8C70104218Q84285J439056R99107J555329P79113J132050J119499J019859R18198
1448.5C79950714J050186J850777N11856Q06503R73587J497345K236023J681519m95567
$$ plain form
1457.2 390062943 388851051 392591171 394705811 397046394 398928528 400196495 401842880 402150192
1464.9 402150192 404492950 406421661 408548737 410413055 412511292 415421410 416766701 417545433
1472.6 417545433 419789162 423553696 425919571 427554626 429906197 431943512 434146156 435878830
1480.3 435878830 437421188 438759804 440160904 441313324 442086563 443577232 444450760 444514961 445263939
1489 445263939 444627342 444289703 445068703 445772438 445500641 444853554 444273758 440712776 440743942 439471321
1498.7 439471321 437411919 437697563 437190742 436258545 434875603 435004654 435338669 430614777 425524216
1507.3 425524216 427361946 429238625 428696289 429494019 428897591 427659569 427610474 426613731 426167908
1516 426167908 423612900 421146774 422485847 423647041 422341537 420960007 421012306 421433868 422997131
$$ packed form
1457.2C90062943j211892L740120K114640K340583J882134J267967J646385L07312
1464.9D02150192K342758J928711K127076J864318K098237K910118J345291P78732
1472.6D17545433K243729L764534K365875J635055K351571K037315K202644J732674
1480.3D35878830J542358J338616J401100J152420P73239J490669Q73528O4201P48978
1489D45263939o36597l37639P79000P03735k71797o47087n79796l560982L1166j272621
1498.7D39471321k059402K85644n06821r32197j382942J29051L34015m723892n090561
1507.3D25524216J837730J876679n42336P97730n96428j238022m9095r96743m45823
1516D26167908k555008k466126J339073J161194j305504j381530N2299M21562J563263
$$ plain form
1524.7 422997131 422634888 423088989 423717155 423555946 423849106 424067917 424650726 424990425 424670944 423348160
1534.3 423348160 424961815 426083450 426241341 426540794 422163467 422026482 425366135 426768188 425944519
1543 425944519 427019920 427987785 427446594 428750305 428474503 428500710 427817650 426975365 427968369 428025742
1552.7 428025742 428360901 425973206 426566391 427903824 428017540 420353203 407419243 417868805
1560.4 417868805 420096169 421303596 420283546 418881874 416341057 414461594 414071007 412200928
1568.1 412200928 410594139 402933350 401886444 400652161 397753792 395382919 392524147 390419655
1575.8 390419655 381286697 381788635 380011368 377173271 374520950 370449257 367859077 363606987
1583.5 363606987 360951271 357050171 353912125 350787468 346896744 344484825 340415955 338411713
$$ packed form
1524.7D22997131l62243M54101O28166j61209K93160K18811N82809L39699l19481j322784
1534.3D23348160J613655J121635J57891K99453m377327j36985L339653J402053q23669
1543D25944519J075401R67865n41191J303711k75802K6207o83060q42285R93004N7373
1552.7D28025742L35159k387695N93185J337433J13716p664337j2933960J0449562
1560.4D17868805K227364J207427j020050j401672k540817j879463l90587j870079
1568.1D12200928j606789p660789j046906j234283k898369k370873k858772k104492
1575.8C90419655r132958N01938j777267k838097k652321m071693k590180m252090
1583.5C63606987k655716l901100l138046l124657l890724k411919m068870k004242
$$ plain form
1591.2 338411713 334285202 331879120 328968201 325199547 323326149 319927406 318419456 314749203
1599 314749203 313003044 310214424 307769527 306477375 303463860 302896347 300282154 299326286 296873112
1607.6 296873112 295722580 294502335 292220745 292628918 290928841 291204510 289521961 289806404 289585476
1616.3 289585476 285606289 287764950 286710548 287541294 286346092 287041779 286710243 284710598 286118584
1625 286118584 285721092 287017040 285607433 286988811 287503643 288111877 289035435 288721046 290592022
1633.7 290592022 290224819 291371231 290815182 293032360 294163399 294840431 296805840 297156715 299359436
1642.4 299359436 299451466 301190987 302541466 301600475 303811455 302814751 306088734 307010517 309362106
1651 309362106 310525455 304721737 306649075 308451271 312071686 312658348 314457340 315619049 316954899
$$ packed form
1591.2C38411713m126511k406082k910919l768654j873398l398743j507950l670253
1599C14749203j746159k788620k444897j292152l013515n67513k614193r55868k453174
1607.6B96873112j150532j220245k281590M08173j700077K75669j682549K84443k20928
1616.3B89585476l979187K158661j054402Q30746j195202O95687l31536j999645J407986
1625B86118584l97492J295948j409607J381378N14832O08234R23558l14389J870976
1633.7B90592022l67203J146412n56049K217178J131039O77032J965409L50875K202721
1642.4B99359436R2030J739521J350479r40991K210980r96704L273983R21783K351589
1651C09362106J163349n803718J927338J802196L620415N86662J798992J161709J335850
$$ plain form
1659.7 316954899 318011055 318659935 320803452 321131439 323980103 325288620 327418175 329599838 331007767
1668.4 331007767 333719826 335344238 339406815 341091499 344383736 347332840 349162941 351232147
1676.1 351232147 353834877 357654114 359924507 363277206 365726204 369144478 372395325 372281418
1683.8 372281418 377004471 379757156 385220909 388450165 391601639 395418777 398775864 402888184
1691.5 402888184 406379356 410543289 414097748 417753601 419580193 424170799 429015579 432763252
1699.3 432763252 435883064 437810326 444162064 448427086 452080078 455022964 457581139 460686722
1707 460686722 463515091 467001381 469457283 471729126 474224739 476729851 479299164 480407295 481955261
1715.6 481955261 484724617 486134872 483726997 487541656 490845146 492898941 494774437 495789146
$$ packed form
1659.7C16954899J056156O48880K143517L27987K848664J308517K129555K181663J407929
1668.4C31007767K712059J624412M062577J684684L292237K949104J830101K069206
1676.1C51232147K602730L819237K270393L352699K448998L418274L250847j13907
1683.8C72281418M723053K752685N463753L229256L151474L817138L357087M112320
1691.5D02888184L491172M163933L554459L655853J826592M590606M844780L747673
1699.3D32763252L119812J927262O351738M265022L652992K942886K558175L105583
1707D60686722K828369L486290K455902K271843K495613K505112K569313J108131J547966
1715.6D81955261K769356J410255k407875L814659L303490K053795J875496J014709
$$ plain form
1723.4 495789146 497014618 498891487 500904121 502313042 503520050 505155334 505510941 506721306
1731.1 506721306 509636078 512041817 510307350 509179192 513956528 517486801 519482765 522237396
1738.8 522237396 523739777 523104897 526495590 529250755 530528183 533128052 536400490 539666824
1746.5 539666824 543026237 546553726 548861084 553083000 555055923 556810837 562077866 565750694
1754.2 565750694 569377594 572975006 574872971 577292557 579920082 582929802 586450539 586745453
1761.9 586745453 587635231 591241379 593628006 595768700 597953529 599411583 598827972 601346626 604841728
1770.6 604841728 605045128 604257240 604403343 608998528 611380043 611079521 613679199 615191307 617281456
1779.3 617281456 617885475 617121429 618608017 620539436 622352333 621695251 622338486 624535866 626084595
$$ packed form
1723.4D95789146J225472J876869K012634J408921J207008J635284L55607J210365
1731.1E06721306K914772K405739j734467j128158M777336L530273J995964K754631
1738.8E22237396J502381o34880L390693K755165J277428K599869L272438L266334
1746.5E39666824L359413L527489K307358M221916J972923J754914N267029L672828
1754.2E65750694L626900L597412J897965K419586K627525L009720L520737K94914
1761.9E86745453Q89778L606148K386627K140694K184829J458054n83611K518654L495102
1770.6F04841728K03400p87888J46103M595185K381515l00522K599678J512108K090149
1779.3F17281456O04019p64046J486588J931419J812897o57082O43235K197380J548729
$$ plain form
1788 626084595 627322311 628742332 629300957 629868698 629021339 628905334 632514648 633742065 633630066
1796.7 633630066 635137215 636806221 637080879 636204910 638400917 638721085 639746284 641751938 642392120
1805.3 642392120 643416290 643793411 644417191 645674133 646938095 645838547 646220093 647959671 648837662
1814 648837662 650197220 650269012 651024933 651208344 651683884 652692184 652974014 654130096 653608856 654721680
1823.7 654721680 656066818 654174042 654921494 657165833 659320068 658925781 656126022 657347641 659563751
1832.3 659563751 659874039 660213776 660931778 661224899 661693192 661818008 662828598 663068390 663751831
1841 663751831 664348679 665605011 666660080 661681213 663827438 666358871 666452103 666277313 666754837
1849.7 666754837 667658920 667669373 668310852 668104248 668728867 669440994 669514694 670249252 669778519 669840775
$$ packed form
1788F26084595J237716J420021N58625N67741q47359j16005L609314J227417j11999
1796.7F33630066J507149J669006K74658q75969K196007L20168J025199K005654O40182
1805.3F42392120J024170L77121O23780J256942J263962j099548L81546J739578Q77991
1814F48837662J359558P1792P55921J83411M75540J008300K81830J156082n21240J112824
1823.7F54721680J345138j892776P47452K244339K154235l94287k799759J221619K216110
1832.3F59563751L10288L39737P18002K93121M68293J24816J010590K39792O83441
1841F63751831N96848J256332J055069m978867K146225K531433R3232j74790M77524
1849.7F66754837R04083J0453O41479k06604O24619P12127P3700P34558m70733O2256
$$ plain form
1859.3 669840775 670190659 670948257 671168594 671548996 672029648 671815491 672559128 672415085 673255005 672514267
1869 672514267 671050339 672194977 673011017 673838501 673783798 674207916 674526901 674545670 674504318 674828339
1878.6 674828339 675719452 675632324 675890274 675935364 676411514 676069870 675623245 676594162 676788635 677512283
1888.3 677512283 677171555 675945740 676493759 677385330 677525940 677489243 677587051 677013474 677687912 678056870
1897.9 678056870 678451233 679077377 679063721 679021530 678585281 679018326 679370117 679375229 679190445 679433365
1907.6 679433365 679914627 679685593 679591141 679598923 680272598 680116653 680380325 680263290 679980621 681154251
1917.2 681154251 679361115 679037247 680279922 680905151 681337051 679937363 679572449 680347137 680684052
1925.9 680684052 680385132 680654373 680987930 681143799 681184921 681033783 681366959 680701828 680694656 680737839
$$ packed form
1859.3F69840775L49884P57598K20337L80402M80652k14157P43637j44043Q39920p40738
1869F72514267j463928J144638Q16040Q27484n4703M24118L18985J8769m1352L24021
1878.6F74828339Q91113q7128K57950M5090M76150l41644m46625R70917J94473P23648
1888.3F77512283l40728j225815N48019Q91571J40610l6697R7808n73577O74438L68958
1897.9F78056870L94363O26144j3656m2191m36249M33045L51791N112j84784K42920
1907.6F79433365M81262k29034r4452P782O73675j55945K63672j17035k82669J173630
1917.2F81154251j793136l23868J242675O25229M31900j399688l64914P74688L36915
1925.9F80684052k98920K69241L33557J55869M1122j51138L33176o65131p172M3183
$$ plain form
1935.5 680737839 680372238 680310898 680234222 680956116 681212769 681772308 680987091 679448318 680228729 680720444
1945.2 680720444 680318375 679746170 680118637 680218887 680459747 680524292 680149994 680281296 679979553 679720154
1954.8 679720154 679274445 679413605 679516678 679545135 679779129 679471283 679647675 679426651 679444962 679524307
1964.5 679524307 679381332 679113235 678524094 678613815 678650818 678847733 678840256 679021072 678895798 678680038
1974.1 678680038 678849716 678412552 678306046 678081360 678324585 678601837 678688507 678792191 678431931 678448486
1983.7 678448486 678393555 678724899 678281479 677969513 678168259 677667847 678008652 677719421 676735001 676599808
1993.4 676599808 677142334 677251816 676900177 676810913 676627274 676641312 676191254 676025620 675911179 676018982
2003 676018982 676157074 675825272 676064682 675659714 675384827 675204468 675043106 674962463 674636459 674807129
$$ packed form
1935.5F80737839l65601o1340p6676P21894K56653N59539p85217j538773P80411M91715
1945.2F80720444m02069n72205L72467J00250K40860O4545l74298J31302l01743k59399
1954.8F79720154m45709J39160J03073K8457K33994l07846J76392k21024J8311P9345
1964.5F79524307j42975k68097n89141Q9721L7003J96915p477J80816j25274k15760
1974.1F78680038J69678m37164j06506k24686K43225K77252Q6670J03684l60260J6555
1983.7F78448486n4931L31344m43420l11966J98746n00412L40805k89231r84420j35193
1993.4F76599808N42526J09482l51639q9264j83639J4038m50058j65634j14441J07803
2003F76018982J38092l31802K39410m04968k74887j80359j61362q0643l26004J70670
$$ plain form
2012.7 674807129 674631805 674661179 674648209 674375534 673722153 673653488 673847046 673105698 673128357 673272934
2022.3 673272934 673115921 672099991 671886063 672725677 672510071 672488861 671981430 671689148 671532288 671159515
2032 671159515 670895233 670733032 670964279 670648422 670671768 670093765 669808197 669920578 669592133 669520187
2041.6 669520187 668950424 669054794 668937531 669255829 669496231 668937836 668646317 667848740 667808304 667617340
2051.2 667617340 667519989 667437439 667314377 667486801 666948090 666985321 666904297 667030182 666793518 666404572
2060.9 666404572 666499863 666327744 666566238 665988083 665841980 666061401 666019974 665949936 665630493 665803223
2070.5 665803223 665580673 665475540 665324936 665377579 665278320 664945450 665110321 664887161 664904709 664647064
2080.2 664647064 664585495 664547119 664230042 664320831 664244614 663954849 663454208 663560410 663361359 663231812
$$ packed form
2012.7F74807129j75324K9374j2970k72675o53381o8665J93558p41348K2659J44577
2022.3F73272934j57013j015930k13928Q39614k15606k1210n07431k92282j56860l72773
2032F71159515k64282j62201K31247l15857K3346n78003k85568J12381l28445p1946
2041.6F69520187n69763J04370j17263L18298K40402n58395k91519p97577m0436j90964
2051.2F67617340r7351q2550j23062J72424n38711L7231q1024J25885k36664l88946
2060.9F66404572R5291j72119K38494n78155j46103K19421m1427p0038l19443J72730
2070.5F65803223k22550j05133j50604N2643r9259l32870J64871k23160J7548k57645
2080.2F64647064o1569l8376l17077R0789p6217k89765n00641J06202j99051j29547
$$ plain form
2089.8 663231812 663028717 662350082 662535248 662544937 662628403 662496643 662347717 662039948 661319427 661129303
2099.5 661129303 661122513 661439133 661286240 661305084 661093063 660515747 660581360 660484772 660063477 659150238
2109.1 659150238 658941803 658882828 658716125 658872299 658787460 658655396 658093414 658031998 658021774 657906647
2118.7 657906647 657749176 657336426 657225952 657349854 657765274 657570190 657444534 657269287 657042618 656965408
2128.4 656965408 656606827 656511993 656072922 656210327 656411362 656323318 656490555 656682129 656772156 656413651
2138 656413651 656428299 656186218 656208801 656085434 655813293 655992126 655970993 656786499 656935501 656498566
2147.7 656498566 655881958 655381470 655501633 655554047 655910263 655714188 655861511 655821762 656024857 656426849
2157.3 656426849 655657120 655475540 655490875 655854187 655825806 655658035 655788422 655703812 655925827 655685730
$$ packed form
2089.8F63231812k03095o78635J85166R689Q3466j31760j48926l07769p20521j90124
2099.5F61129303o790L16620j52893J8844k12021n77316O5613r6588m21295r13239
2109.1F59150238k08435n8975j66703J56174q4839j32064n61982o1416j0224j15127
2118.7F57906647j57471m12750j10474J23902M15420j95084j25656j75247k26669p7210
2128.4F56965408l58581r4834m39071J37405K01035q8044J67237J91574R0027l58505
2138F56413651J4648k42081K2583j23367k72141J78833k1133Q15506J49002m36935
2147.7F56498566o16608n00488J20163N2414L56216j96075J47323l9749K03095M01992
2157.3F56426849p69729j81580J5335L63312k8381j67771J30387q4610K22015k40097
$$ plain form
2167 655685730 656011734 655871582 655560379 655731583 655646362 655667572 655461273 655847397 655672989 655441284
2176.6 655441284 655482788 655640793 656128082 655988312 656220398 656160736 656358109 656420212 656094284 656140060
2186.3 656140060 656076355 656435394 656172791 655976181 656061783 656355438 656624756 656640778 656890411 656267853
2195.9 656267853 656111984 656116714 656051254 656259155 656292114 656485214 656543655 656844177 656603165 656414337
2205.5 656414337 656200943 656113434 656438065 656363678 656846237 656918335 656707153 656562042 656559753 656471634 656335449
2216.1 656335449 656756363 656572647 656487579 656379395 656873169 657284851 656858673 656850662 656386337 656318283
2225.8 656318283 656346436 656460266 656689301 656842346 657000885 656514740 656635132 656663742 656727295 656685181
2235.4 656685181 656443405 656443100 656256409 656552429 656533813 656557541 656298294 656161575 656334305 656075668
$$ packed form
2167F55685730L26004j40152l11203J71204q5221K1210k06299L86124j74408k31705
2176.6F55441284M1504J58005M87289j39770K32086n9662J97373O2103l25928M5776
2186.3F56140060o3705L59039k62603j96610Q5602K93655K69318J6022K49633o22558
2195.9F56267853j55869M730o5460K07901L2959J93100N8441L00522k41012j88828
2205.5F56414337k13394q7509L24631p4387M82559P2098k11182j45111k289q8119j36185
2216.1F56335449M20914j83716q5068j08184M93774M11682m26178q011m64325o8054
2225.8F56318283K8153J13830K29035J53045J58539m86145J20392K8610O3553m2114
2235.4F56685181k41776l05j86691K96020j8616K3728k59247j36719J72730k58637
$$ plain form
2245.1 656075668 656171112 655926666 655836182 655608215 655607529 655847092 655702667 655773544 655662842 655760574 655436401
2255.7 655436401 655424576 655397186 654930115 655091553 655189285 655390701 655350723 655419540 655293350 655168991
2265.3 655168991 655269089 654997635 655129547 655167007 655221710 655156326 655231476 655102615 654937210 655193405
2275 655193405 654916763 654871445 654633102 654811172 654858780 654311447 654257431 654275513 654346848 653975449 654073944
2285.6 654073944 653736725 653369064 653775101 653858871 654149704 653629532 653357239 653279114 653110428 653074188
2295.2 653074188 652600784 652417068 652084808 652177124 651828918 651757278 651814957 651510010 651771774 651296997
2304.9 651296997 651372452 651171494 650844727 650622711 650402603 651043930 650670319 650445938 649851837 649459229
2314.5 649459229 649171753 648447266 648681870 648083954 647556000 647444839 647487106 647446747 647903366 647814331
$$ packed form
2245.1F56075668R5444k44446r0484k27967o86K39563j44425P0877j10702R7732l24173
2255.7F55436401j1825k7390m67071J61438R7732K01416l9978O8817j26190j24359
2265.3F55168991J00098k71454J31912L7460N4703o5384P5150j28861j65405K56195
2275F55193405k76642m5318k38343J78070M7608n47333n4016J8082P1335l71399R8495
2285.6F54073944l37219l67661M06037Q3770K90833n20172k72293p8125j68686l6240
2295.2F53074188m73404j83716l32260R2316l48206p1640N7679l04947K61764m74777
2304.9F51296997P5455k00958l26767k22016k20108O41327l73611k24381n94101l92608
2314.5F49459229k87476p24487K34604n97916n27954j11161M2267m0359M56619q9035
$$ plain form
2324.2 647814331 646756516 646721497 646171188 646284256 645643921 645286865 646008530 645827560 645922699 645435715
2333.8 645435715 645608978 644640503 643598557 643853378 644688034 645039062 643408508 643023453 643029556 644006119
2343.4 644006119 643415604 642863235 643933334 643048935 643647842 644813232 644800415 643357468 642683868
2352.1 642683868 642984161 642372818 642305222 641284790 641710892 641694183 640245132 638648834 637836647
2360.8 637836647 639459000 639749489 639252663 637227707 637744675 639470863 639042435 639135284 638797188
2369.5 638797188 639098358 639380074 639356575 638787346 638641205 639071159 638983612 638967209 638737831 639010963
2379.1 639010963 639194260 639454079 639518280 639147034 639095917 638680725 638260536 637985191 638034935 637759361
2388.8 637759361 637427979 637431870 637083702 636862831 636344719 636191711 635837517 635262108 635250778 635190964
$$ packed form
2324.2F47814331j057815l5019n50309J13068o40335l57056P21665j80970R5139m86984
2333.8F45435715J73263r68475j041946K54821Q34656L51028j630554l85055O103R76563
2343.4F44006119n90515n52369J070099q84399N98907J165390j2817j442947o73600
2352.1F42683868L00293o11343o7596j020432M26102j6709j449051j596298q12187
2360.8F37836647J622353K90489m96826k024956N16968J726188m28428R2849l38096
2369.5F38797188L01170K81716k3499n69229j46141M29954q7547j6403k29378K73132
2379.1F39010963J83297K59819O4201l71246n1117m15192m20189k75345M9744k75574
2388.8F37759361l31382L891l48168k20871n18112j53008l54194n75409j1330n9814
$$ plain form
2398.4 635190964 635222511 634802094 634587097 634239082 633754044 633472939 633245735 633458748 632922249 632358055
2408.1 632358055 632258034 632318001 632122498 631633224 631398468 631134720 630964470 630247498 630042152 630171967
2417.7 630171967 629620476 629226189 628868561 628285103 627522850 627468796 627307167 626944504 626712608 626042137
2427.3 626042137 625710869 625468254 625312538 624793129 624478874 624578781 624158745 623793068 623421516 623317680
2437 623317680 623251228 622967987 622354012 621732864 621448059 621189919 621089249 620443192 619815941 619441147
2446.6 619441147 619296951 619374084 619061394 618504028 617813072 617613029 617179489 616700821 616523361 616227150
2456.3 616227150 615924988 615327530 615102921 614867363 614610519 614033661 613302422 613022461 612440414 612255363
2465.9 612255363 612115936 611696815 611140289 610870438 610704422 609949341 609554405 609011993 608479843 608416214
$$ packed form
2398.4F35190964L1547m20417k14997l48015m85038k81105k27204K13013n36499n64194
2408.1F32358055j00021N9967j95503m89274k34756k63748j70250p16972k05346J29815
2417.7F30171967n51491l94287l57628n83458p62253n4054j61629l62663k31896o70471
2427.3F26042137l31268k42615j55716n19409l14255R9907m20036l65677l71552j03836
2437F23317680o6452k83241o13975o21148k84805k58140j00670o46057o27251l74794
2446.6F19441147j44196P7133l12690n57366o90956k00043m33540m78668j77460k96211
2456.3F16227150l02162n97458k24609k35558k56844n76858p31239k79961n82047j85051
2465.9F12255363j39427m19121n56526k69851j66016p55081l94936n42412n32150o3629
$$ plain form
2475.6 608416214 608392067 607936211 607278328 607068214 606742363 606363525 605605278 604712067 604068909 603945465
2485.2 603945465 603952942 603452339 603047943 602160492 602062111 602412224 601706276 600791397 599963112 599655838
2494.8 599655838 599313850 598957024 598447685 597851753 597539711 597034264 596729393 596533737 596112518 594973907
2504.5 594973907 594327354 594246750 593846664 593685570 593189583 592792282 592297554 591666908 591319427 591153107
2514.1 591153107 590798531 589864426 589593430 589162102 588359680 588160019 588013229 587599716 587046585 586815262
2523.8 586815262 586757660 586445351 585676460 585303116 584844513 584150620 584096947 583630905 582938690 582370949
2533.4 582370949 582265739 582127075 581561241 581353226 580946617 580498505 579968758 579395828 578746910 578435745
2543.1 578435745 578677254 578491516 578066406 577094650 576229057 576061554 575977402 575725479 575342064 574990463
$$ packed form
2475.6F08416214k4147m55856o57883k10114l25851l78838p58247q93211o43158j23444
2485.2F03945465P477n00603m04396q87451r8381L50113p05948r14879q28285l07274
2494.8E99655838l41988l56826n09339n95932l12042n05447l04871j95656m21219j138611
2504.5E94973907o46553q0604m00086j61094m95987l97301m94728o30646l47481j66320
2514.1E91153107l54576r34105k70996m31328q02422j99661j46790m13513n53131k31323
2523.8E86815262n7602l12309p68891l73344m58603o93893n3673m66042o92215n67741
2533.4E82370949j05210j38664n65834k08015m06609m48112n29747n72930o48918l11165
2543.1E78435745K41509j85738m25110r71756q65593j67503q4152k51923l83415l51601
$$ plain form
2552.7 574990463 574558907 574280624 574003296 573852768 573224831 572440910 572114525 571669464 571580086 571245041
2562.4 571245041 570712013 570183258 570083313 570055428 569240646 568847275 568272552 567906075 567839088 567471542
2572 567471542 567215614 566857986 566587486 565856857 565431328 565135574 564502258 564118805 563586082 562928429
2581.6 562928429 562208939 562134094 562111511 561908913 561866760 561545753 560981598 560286102 560291634 560139732
2591.3 560139732 559573669 559185486 558747368 558388023 558030090 557737732 557115631 556563683 556069679 555647507
2600.9 555647507 555311775 554766083 554637756 554262390 553709373 553331833 553048706 552563133 551661873 551159859
2610.6 551159859 551107597 551108742 550618706 550041618 549564323 549229851 548916931 548231277 547752991 547237282
2620.2 547237282 546820641 546202583 545728531 545575523 545156479 545050697 544553032 543893166 543229637 542522659
$$ packed form
2552.7E74990463m31556k78283k77328j50528o27937p83921l26385m45061q9378l35045
2562.4E71245041n33028n28755r9945k7885q14782l93371n74723l66477o6987l67546
2572E67471542k55928l57628k70500p30629m25529k95754o33316l83453n32723o57653
2581.6E62928429p19490p4845k2583k02598m2153l21007n64155o95496N532j51902
2591.3E60139732n66063l88183m38118l59345l57933k92358o22101n51948m94004m22172
2600.9E55647507l35732n45692j28327l75366n53017l77540k83127m85573r01260n02014
2610.6E51159859n2262J145m90036n77088m77295l34472l12920o85654m78286n15709
2620.2E47237282m16641o18058m74052j53008m19044j05782m97665o59866o63529p06978
$$ plain form
2629.9 542522659 542090149 541848717 541648254 540789223 540189552 539683456 539297714 539176979 538686790 538464317
2639.5 538464317 537979088 537256889 536814232 536566467 535921707 535344467 535006714 534012604 533393364 533038368
2649.1 533038368 532872963 532760277 532365074 532151260 531623650 531072617 530508652 530039635 529791145 529601784
2658.8 529601784 529160080 528575668 528615303 528445930 527910614 527289085 526694412 526321068 525980568 525515862
2668.4 525515862 525095558 525142975 524822731 524306984 523905754 523561134 523166580 522415085 522284012 522082214
2678.1 522082214 521682129 521630135 521192207 520633125 520185814 519704094 519431610 519256401 518767738 518480949
2687.7 518480949 518146400 517704201 517340279 516802330 516727753 516395836 516008644 515806389 515202446 514888115
2697.4 514888115 514797974 514521103 513907013 513560562 513505211 513460693 513106804 512197380 511920090 511863556
$$ packed form
2629.9E42522659m32510k41432k00463q59031n99671n06096l85742j20735m90189k22473
2639.5E38464317m85229p22199m42657k47765o44760n77240l37753r94110o19240l54996
2649.1E33038368j65405j12686l95203k13814n27610n51033n63965m69017k48490j89361
2658.8E29601784m41704n84412L9635j69373n35316o21529n94673l73344l40500m64706
2668.4E25515862m20304M7417l20244n15747m01230l44620l94554p51495j31073k01798
2678.1E22082214m00085n1994m37928n59082m47311m81720k72484j75209m88663k86789
2687.7E18480949l34549m42199l63922n37949p4577l31917l87192k02255o03943l14331
2697.4E14888115r0141k76871o14090l46451n5351m4518l53889r09424k77290n6534
$$ plain form
2707 511863556 511406517 511113091 510891457 510525780 510270462 509965363 509487572 509358101 509202461 508749199
2716.6 508749199 508278046 508155594 507936134 507476158 507262383 507101440 507159538 506967888 506997795 506697884
2726.3 506697884 505632210 505535507 505586891 505314445 505030785 504822273 504616852 504067764 503837433 504030952
2735.9 504030952 504129181 503654938 503554420 503759613 503413963 502690887 502241364 502567406 502340088 502078629
2745.6 502078629 502144356 501753502 501389084 501380043 501512871 500955391 500455284 500272980 500139046 499898186
2755.2 499898186 499597778 499624863 499109230 498780861 498671646 498418045 498297424 498308182 498516235 498200912
2764.9 498200912 497883759 497370987 496783638 496732178 496713753 496286163 495712471 495641365 495491257 495595474
2774.5 495595474 495186462 494549904 494665375 494166107 493790092 493266411 492573624 492346802 491938972 491638298
$$ packed form
2707E11863556m57039k93426k21634l65677k55318l05099m77791j29471j55640m53262
2716.6E08749199m71153j22452k19460m59976k13775j60943N8098j91650K9907k99911
2726.3E06697884j065674r6703N1384k72446k83660k08512k05421n49088k30331J93519
2735.9E04030952R8229m74243j00518K05193l45650p23076m49523L26042k27318k61459
2745.6E02078629O5727l90854l64418r041J32828n57480n00107j82304j33934k40860
2755.2D99898186l00408K7085n15633l28369j09215k53601j20621J0758K08053l15323
2764.9D98200912l17153n12772n87349n1460j8425m27590n73692p1106j50108J04217
2774.5D95595474m09012o36558J15471m99268l76015n23681o92787k26822m07830l00674
$$ plain form
2784.2 491638298 491358414 491009064 490656891 490520248 490083694 489386292 489146538 489200134 488901176 487985725
2793.8 487985725 487555122 487514954 487556572 487148857 486289101 485867004 485158234 484325294 483746529 483550949
2803.4 483550949 483176498 482491570 482210960 481787910 481296883 480619125 479900131 479274597 478461647 477919350
2813.1 477919350 477690048 477237778 476638260 476338158 475689850 475092430 474622879 473790474 473005524 472157402
2822.7 472157402 471447067 470978622 470648460 469595795 468699493 468438034 467476959 466924744 466488190
2831.4 466488190 465583038 464659767 464189758 464138107 463276787 462098770 460852814 459799271 458723106
2840.1 458723106 457044296 455581932 454145966 452637138 451390152 449859886 447686615 445809593
2847.8 445809593 444537735 443227425 441797142 440690079 439668579 438415527 437993889 437690544 437327805
$$ packed form
2784.2D91638298k79884l49350l52173j36643m36554o97402k39754N3596k98958r15451
2793.8D87985725m30603m0168M1618m07715q59756m22097p08770q32940n78765j95580
2803.4D83550949l74451o84928k80610m23050m91027o77758p18994o25534q12950n42297
2813.1D77919350k29302m52270n99518l00102o48308n97420m69551q32405p84950q48122
2822.7D72157402p10335m68445l30162j052665q96302k61459r61075n52215m36554
2831.4D66488190r05152r23271m70009n1651q61320j178017j245956j053543j076165
2840.1D58723106j678810j462364j435966j508828j246986j530266k173271j877022
2847.8D45809593j271858j310310j430283j107063j021500j253052m21638l03345l62739
$$ plain form
2856.5 437327805 437363281 437310257 437628174 437567368 437255707 436999321 436822090 436708717 436114502 435513992
2866.1 435513992 434816551 434341660 433646202 432898445 432576714 431924324 431762238 431496468 430482292
2874.8 430482292 429652176 429278870 429143333 428916664 428390541 427624168 427017365 426653099 426369400 425659866
2884.4 425659866 425017586 424594002 423921051 423217926 422032852 421246834 420938377 420104294 419127808
2893.1 419127808 418374634 417809601 417138939 416441765 415706177 415201721 414492531 413419151 412910423
2901.8 412910423 412975540 412966156 411971550 410974922 410471764 409841957 409050064 408157043 407759056 406976318
2911.4 406976318 405883484 404864807 403504982 402612000 401956635 400946198 399964218 398855362 397536163
2920.1 397536163 396985397 396224174 395314026 395326309 395095749 394819870 394433365 394334793 394662514 394832001
$$ packed form
2856.5D37327805L5476n3024L17917o0806l11661k56386j77231j13373n94215o00510
2866.1D35513992o97441m74891o95458p47757l21731o52390j62086k65770j014176
2874.8D30482292q30116l73306j35537k26669n26123p66373o06803l64266k83699p09534
2884.4D25659866o42280m23584o72951p03125j185074p86018l08457q34083r76486
2893.1D19127808p53174n65033o70662o97174p35588n04456p09190j073380n08728
2901.8D12910423O5117r384r94606r96628n03158o29807p91893q93021l97987p82738
2911.4D06976318j092834j018677j359825q92982o55365j010437r81980j108856j319199
2920.1C97536163n50766p61223r10148J2283k30560k75879l86505r8572L27721J69487
$$ plain form
2929.8 394832001 395330124 395880661 396280365 396232834 396525459 396961861 396926918 397251167 398012047 398664284
2939.4 398664284 398789864 399556427 400437431 401044693 401788406 401980667 402194176 402189560 402682571 403634529
2949.1 403634529 404113960 404378395 404268341 404530525 405078812 405290184 405443192 406238365 406794281 406864891
2958.7 406864891 407320442 407572556 408204460 408959579 409465256 409488182 409418640 410307159 410989723 411756706
2968.3 411756706 412448692 412839127 413846016 414758873 415229607 415734634 416239738 416342278 416567955
2977 416567955 416995506 417532463 417923355 418067513 418444481 418358459 418365364 418863297 419135399 418995705
2986.7 418995705 418988419 419394150 419483337 419635315 419758949 419641457 419641876 419920845 420142937 419652634 419126129
2997.3 419126129 419002457 418981247 418515434 418072739 417916946 417767601 417572174 416793022 416591988 416521797
$$ packed form
2929.8C94832001M98123N50537L99704m7531K92625M36402l4943L24249P60880O52237
2939.4C98664284J25580P66563Q81004O07262P43713J92261K13509m616M93011R51958
2949.1D03634529M79431K64435j10054K62184N48287K11372J53008P95173N55916P0610
2958.7D06864891M55551K52114O31904P55119N05677K2926o9542Q88519O82564P66983
2968.3D11756706O91986L90435J006889R12857M70734N05027N05104J02540K25677
2977D16567955M27551N36957L90892J44158L76968q6022O905M97933K72102j39694
2986.7D18995705p286M05731Q9187J51978J23634j17492M19K78969K22092m90303n26505
2997.3D19126129j23672k1210m65813m42695j55793j49345j95427p79152k01034p0191
$$ plain form
3006.9 416521797 415838928 415393372 415039749 414797401 414131813 413567543 413710175 413745918 413009033 412133713
3016.6 412133713 412102737 411835251 411154976 410795364 410670013 410123940 409335670 409000626 408477516 407862549
3026.2 407862549 407251244 406559944 406187325 406230698 406246605 405428581 404316254 403747253 403395386 402631721
3035.9 402631721 402063751 401561470 400640717 400258942 400297050 400070724 399198685 398122177 397408028 396944656
3045.5 396944656 396637878 396182098 395718307 394927979 394087791 393824387 393427124 392679291 392066002 391524811
3055.1 391524811 390665054 390025711 389856262 389388428 388346214 387569160 387472954 387184753 386501465 385880508
3064.8 385880508 385615616 385261765 384676552 384140701 383372803 382774010 382296791 381715927 381402855 381347885
3074.4 381347885 381155128 380727654 380427017 379962959 379543076 379157829 378193359 377531700 377576866 377342796
$$ packed form
3006.9D16521797o82869m45556l53623k42348o65588n64270J42632L5743p36885q75320
3016.6D12133713l0976k67486o80275l59612j25351n46073p88270l35044n23110o14967
3026.2D07862549o11305o91300l72619M3373J5907q18024j112327n69001l51867p63665
3035.9D02631721n67970n02281r20753l81775L8108k26326q72039j076508p14149m63372
3045.5C96944656l06778m55780m63791p90328q40188k63404l97263p47833o13289n41191
3055.1C91524811q59757o39343j69449m67834j042214p77054r6206k88201o83288o20957
3064.8C85880508k64892l53851n85213n35851p67898n98793m77219n80864l13072n4970
3074.4C81347885j92757m27474l00637m64058m19883l85247r64470o61659M5166k34070
$$ plain form
3084.1 377342796 376625900 375889702 375406647 375171242 374490280 373609161 373215904 372664032 371943588 371597862
3093.7 371597862 371350250 371059685 370844193 370342979 369905663 369700012 369053001 368184357 367635574 367526283
3103.4 367526283 367302704 366846199 366142883 365206070 364598732 364194717 364095001 363714714 363350182 363515244
3113 363515244 363031197 362124367 361236267 360967445 361129608 360634079 359846115 359137001 358467865 357735481
3122.6 357735481 356830635 355966110 355650826 355429153 354922905 354627190 354521866 354330635 353477211 352447968
3132.3 352447968 351464958 350825233 350888443 350568733 350069008 349750977 349686775 349601326 348709602 347297554
3141.9 347297554 346444893 346298065 345695305 345122070 344678116 344206505 343911324 343237267 342806549 342448540
3151.6 342448540 342112694 341767845 341092987 340432129 339518585 338703918 338279343 338114204 337726936 337125626
$$ packed form
3084.1C77342796p16896p36198m83055k35405o80962q81119l93257n51872p20444l45726
3093.7C71597862k47612k90565k15492n01214m37316k05651o47011q68644n48783j09291
3103.4C67526283k23579m56505p03316r36813o07338m04015r9716l80287l64532J65062
3113C63515244m84047r06830q88100k68822J62163m95529p87964p09114o69136p32384
3122.6C57735481r04846q64525l15284k21673n06248k95715j05324j91231q53424j029243
3132.3C52447968r83010o39725O3210l19710m99725l18031o4202q5449q91724j412048
3141.9C47297554q52661j46828o02760n73235m43954m71611k95181o74057m30718l58009
3151.6C42448540l35846l44849o74858o60858r13544q14667m24575j65139l87268o01310
$$ plain form
3161.2 337125626 336740837 336204720 335341187 334466705 334075470 333644142 333046417 332549744 331855965 331058502
3170.9 331058502 330310745 329970360 329810791 329218483 328354568 328109970 327746696 326745148 326389160
3179.5 326389160 326111259 325863571 325660934 324941635 324037743 323048973 322505074 322275391 321998711 321480408
3189.2 321480408 320676613 319970665 319496136 318960724 318267097 317956562 317603188 317134247 316761608 316393852
3198.8 316393852 316089935 315479717 314857082 314292107 313865738 313556652 313320389 313132915 312639828 312014732
3208.5 312014732 311145725 310786228 310869598 310590897 310291767 309730415 308950729 308365326 308066444 307819309
3218.1 307819309 307331924 306459751 305613003 305232582 305083981 305019913 304674759 304341202 304066200 303459740
3227.8 303459740 302837410 302499142 302327366 301643543 300848198 300655613 300768127 300451546 299869747 299230900
$$ packed form
3161.2C37125626l84789n36117q63533q74482l91235m31328n97725m96673o93779p97463
3170.9C31058502p47757l40385j59569n92308q63915k44598l63274j001548l55988
3179.5C26389160k77901k47688k02637p19299r03892r88770n43899k29683k76680n18303
3189.2C21480408q03795p05948m74529n35412o93627l10535l53374m68941l72639l67756
3198.8C16393852l03917o10218o22635n64975m26369l09086k36263j87474m93087o25096
3208.5C12014732q69007l59497Q3370k78701k99130n61352p79686n85403k98882k47135
3218.1C07819309m87385q72173q46748l80421j48601o4068l45154l33557k75002o06460
3227.8C03459740o22330l38268j71776o83823p95345j92585J12514l16581n81799o38847
$$ plain form
3237.4 299230900 298592796 298528442 297880554 297332916 297415257 297014256 296803131 296156883 295618305 295813274
3247 295813274 295486889 294519749 293900547 294117355 294115200 293908062 293488522 292820187 292602253 292301559
3256.7 292301559 291691685 291115932 290492382 290064888 290548306 290788727 289929352 288806152 288210831
3265.4 288210831 288461895 288549519 288399200 288074741 287628670 287499104 287191200 286816864 286829281 286839314
3275 286839314 285861969 285021763 284822865 284644814 284877377 284395084 283890762 283993874 283876171 283597240
3284.7 283597240 282908154 282125015 281850910 282131996 282079849 281894855 281739616 281138630 280833092 280764446
3294.3 280764446 280723896 280335121 279665604 279199409 278863163 278622532 278392010 278441525 278269291 277831135
3303.9 277831135 277427959 277192898 277379837 277087612 276352921 275971661 275661163 275103474 274695206 274219475
$$ packed form
3237.4B99230900o38104o4354o47888n47638Q2341m01001k11125o46248n38578J94969
3247B95813274l26385r67140o19202K16808k155k07138m19540o68335k17934l00694
3256.7B92301559o09874n75753o23550m27494M83418K40421q59375j123200n95321
3265.4B88210831K51064Q7624j50319l24459m46071j29566l07904l74336J2417J0033
3275B86839314r77345q40206j98898j78051K32563m82293n04322J03112j17703k78931
3284.7B83597240o89086p83139k74105K81086n2147j84994j55239o00986l05538o8646
3294.3B80764446m0550l88775o69517m66195l36246k40631k30522M9515j72234m38156
3303.9B77831135m03176k35061J86939k92225p34691l81260l10498n57689m08268m75731
$$ plain form
3313.6 274219475 273760738 273637047 273282433 273086262 272913132 272685394 272351627 271846180 271700516 270812397
3323.2 270812397 269936390 269957600 269764252 269353275 268724098 268106613 267647266 267217178 266773682 266119308
3332.9 266119308 265595474 265298920 264923344 264236355 263424759 263223839 263170509 262507153 261986752 261481380
3342.5 261481380 260874119 260807610 260500069 259654636 259191170 259267120 258986301 258486385 258068676 257350826
3352.2 257350826 256823483 256779995 256991863 256758919 256198940 255691738 255218735 255154076 255039711 254659691
3361.8 254659691 253738804 253141384 253436394 253577042 253688259 253295650 252769661 252725067 252376614 251593113
3371.4 251593113 251245880 251614075 251147537 250711231 251173363 250861320 249892845 249467144 249894257 250116959
3381.1 250116959 249800358 249564133 249542961 249676399 249480743 248796787 248356209 248737679 249119225 248969917
$$ packed form
3313.6B74219475m58737j23691l54614j96171j73130k27738l33767n05447j45664q88119
3323.2B70812397q76007K1210j93348m10977o29177o17485m59347m30088m43496o54374
3332.9B66119308n23834k96554l75576o86989q11596k00920n3330o63356n20401n05372
3342.5B61481380o07261o6509l07541q45433m63466P5950k80819m99916m17709p17850
3352.2B57350826n27343m3488K11868k32944n59979n07202m73003o4659j14365l80020
3361.8B54659691r20887n97420K95010J40648J11217l92609n25989m4594l48453p83501
3371.4B51593113l47233L68195m66538m36306M62132l12043r68475m25701M27113K22702
3381.1B50116959l16601k36225k1172J33438j95656o83956m40578L81470L81546j49308
$$ plain form
3390.7 248969917 248468132 247966156 247737083 247314816 247152348 247258511 246980686 246695347 246944008 247252502
3400.4 247252502 247000237 246657257 246599522 246789703 246477585 246066647 246299114 246437454 246567097 246370296
3410 246370296 245988159 245921078 245981579 246188526 246118050 246153870 246278400 246220055 246167793 246375084 247143440
3420.6 247143440 247202339 246496868 246435566 246887703 247107525 247637310 248189812 247913914 247867413 247968483
3430.3 247968483 248097420 248424931 248183193 248077240 248580818 249118710 248956757 248797417 249334469 249476509
3439.9 249476509 249440517 249813576 250356560 250319157 250274105 251378746 252132053 252008476 252293301 252788887
3449.6 252788887 252974358 252986450 253336010 253608704 253990078 254365368 254419498 255148964 255789871 256115856
3459.2 256115856 256816902 257050991 257058258 257570648 258233318 258609161 258839912 259353333 260013580 260565548
$$ packed form
3390.7B48969917n01785n01976k29073m22267j62468J06163k77825k85339K48661L08494
3400.4B47252502k52265l42980n7735J90181l12118m10938K32467J38340J29643j96801
3410B46370296l82137o7081O0501K06947p0476L5820J24530n8345n2262K07291P68356
3420.6B47143440N8899p05471o1302M52137K19822N29785N52502k75898m6501J01070
3430.3B47968483J28937L27511k41738j05953N03578N37892j61953j59340N37052J42040
3439.9B49476509l5992L73059N42984l7403m5052J104641P53307j23577K84825M95586
3449.6B52788887J85471J2092L49560K72694L81374L75290N4130P29466O40907L25985
3459.2B56115856P01046K34089P267N12390O62670L75843K30751N13421O60247N51968
$$ plain form
3468.8 260565548 261331120 261970882 261906624 262276821 263203468 263257637 263559284 265117550 265959358 265994778
3478.5 265994778 266118374 265935326 266365166 266965313 267517910 268792782 269434090 269727688 270311489
3487.2 270311489 270820141 271579723 272499046 272980671 272854557 273297844 274149609 275068111 276543789
3495.8 276543789 277419338 277524338 277954464 278289680 278370018 278974152 279154720 279308319 280645409 281683922
3505.5 281683922 282145882 282477131 283264408 284094334 284983883 286082706 286458149 287252827 288203526
3514.2 288203526 288832760 289444218 289711399 290146503 290819454 291978683 293162746 294117432 294392986
3522.9 294392986 294126415 295064068 296273689 296962376 297701015 298942051 299469128 300089378 301635704
3531.5 301635704 302329082 302806320 304119854 305644989 305677948 305723686 306907063 307432938 308493252
$$ packed form
3468.8B60565548P65572O39762o4258L70197R26647N4169L01647J558266Q41808L5420
3478.5B65994778J23596j83048M29840O00147N52597J274872O41308K93598N83801
3487.2B70311489N08652P59582R19323M81625j26114M43287Q51765R18502J475678
3495.8B76543789Q75549J05000M30126L35216Q0338O04134J80568J53599J337090J038513
3505.5B81683922M61960L31249P87277Q29926Q89549J098823L75443P94678R50699
3514.2B88203526O29234O11458K67181M35104O72951J159229J184063R54686K75554
3522.9B94392986k66571R37653J209621O88687P38639J241036N27077O20250J546326
3531.5C01635704O93378M77238J313534J525135L2959M5738J183377N25875J060314
$$ plain form
3540.2 308493252 310014515 311139107 311635704 312625389 313635502 313835983 315302544 315935574 317230835
3548.9 317230835 319109688 320501328 321704216 321337547 322438469 323549271 324721947 326431122
3556.6 326431122 327369423 328961487 329928741 330280113 330890007 332849655 334288826 334928589 337318268
3565.3 337318268 337881050 338732986 339334908 339926186 342539673 344241753 345738640 346643600 347757263
3574 347757263 349043159 350392685 352158127 353357925 355180473 356088982 356876488 358530502 360709915
3582.6 360709915 362582970 363485146 366037712 366873703 366630516 368529015 369088211 371679611 374654465
3591.3 374654465 377017632 377765579 378771133 381504478 381807442 383471794 385549850 386523437 389250298
3600 389250298 390836487 391934891 393747635 395303040 397395134 399835434 401888924 402876396 405693779
$$ packed form
3540.2C08493252J521263J124592M96597R89685J010113K00481J466561O33030J295261
3548.9C17230835J878853J391640J202888l66669J100922J110802J172676J709175
3556.6C26431122R38301J592064R67254L51372O09894J959648J439171O39763K389679
3565.3C37318268N62782Q51936O01922N91278K613487J702080J496887R04960J113663
3574C47757263J285896J349526J765442J199798J822548R08509P87506J654014K179413
3582.6C60709915J873055R02176K552566Q35991k43187J898499N59196K591400K974854
3591.3C74654465K363167P47947J005554K733345L02964J664352K078056R73587K726861
3600C89250298J586189J098404J812744J555405K092094K440300K053490R87472K817383
$$ plain form
3608.7 405693779 406027565 406853294 412183228 412879448 412561607 416466446 417548370 421666870 425118179
3617.4 425118179 424806404 425863686 426556549 429365311 432954712 435222702 436896858 439371758 441570625
3626 441570625 444196739 449549408 449992371 445992165 450392151 454747810 458520241 460157623 461022911
3634.7 461022911 463729286 467235146 469854965 471192627 473821754 476943970 479904099 481905441
3642.4 481905441 483325539 485612679 488817673 493997459 494983749 494078979 498550262 499080276 498249969
3651.1 498249969 500058517 506020279 510717964 514642143 519644165 516676636 518963623 522948647
3658.8 522948647 524986954 528086014 529963112 532280235 533461304 535209503 537494240 539766312
3666.5 539766312 545316887 548243790 547930908 548299408 544626579 548068199 554705353 560979080 559159470
$$ packed form
3608.7D05693779L33786Q25729N329934O96220l17841L904839J081924M118500L451309
3617.4D25118179l11775J057282O92863K808762L589401K267990J674156K474900K198867
3626D41570625K626114N352669M42963m000206M399986M355659L772431J637382Q65288
3634.7D61022911K706375L505860K619819J337662K629127L122216K960129K001342
3642.4D81905441J420098K287140L204994N179786R86290r04770M471283N30014q30307
3651.1D98249969J808548N961762M697685L924179N002022k967529K286987L985024
3658.8E22948647K038307L099060J877098K317123J181069J748199K284737K272072
3666.5E39766312N550575K926903l12882L68500l672829L441620O637154O273727j819610
$$ plain form
3675.2 559159470 546950912 552046547 559953957 564563560 563117447 563925514 567745018 570132256
3682.9 570132256 570943031 571692772 572512398 575580139 580436020 573811989 572489166 579803810 576501465
3691.6 576501465 576912804 581247253 582161140 583941002 585027657 585602455 586578484 586784706 589364929
3700.3 589364929 591737442 588160896 587809906 591808701 592770958 592581749 593439865 596194000 599131012
3709 599131012 593167572 597111053 601053925 590139389 594298820 598092766 599015083 600097656 602086449
3717.7 602086449 603707695 600302505 601100578 606429405 603267174 599852257 604618111 605460930 604892845
3726.3 604892845 603010635 602872772 605641823 606566582 611358223 607839851 601832352 610789795 610847778
3735 610847778 602899590 604966164 607636948 607143936 608961792 611781616 608232536 611708031 620708160
$$ packed form
3675.2E59159470j2208558N095635P907410M609603j446113Q08067L819504K387238
3682.9E70132256Q10775P49741Q19626L067741M855881o624031j322823P314644l302345
3691.6E76501465M11339M334449R13887J779862J086655N74798R76029K06222K580223
3700.3E89364929K372513l576546l50990L998795R62257j89209Q58116K754135K937012
3709E99131012n963440L943481L942872j0914536M159431L793946R22317J082573J988793
3717.7F02086449J621246l405190P98073N328827l162231l414917M765854Q42819n68085
3726.3F04892845j882210j37863K769051R24759M791641l518372o007499Q957443N7983
3735F10847778p948188K066574K670784m93012J817856K819824l549080L475495R000129
$$ plain form
3743.7 620708160 606329155 596449928 606279831 611573753 616944237 614173737 605839653 614371910
3751.4 614371910 608658485 604868202 611430817 615231476 617130623 612660561 615420151 620204086
3759.1 620204086 613503380 612560654 615534744 616395454 617010117 619582481 616494026 613147926 617265472
3767.8 617265472 621575584 620821495 613291512 615443954 618554382 618893890 619803085 619584045 619787483
3776.5 619787483 620430984 622939911 620462799 613751755 617361984 619595566 620841980 622400131
3784.2 622400131 619898033 619540367 620761414 621518440 621704369 621286430 621581078 621858368 622493477
3792.9 622493477 622465706 623199005 625381279 621411247 617736206 620397034 624370918 628818359 622356033
3801.5 622356033 614453850 618168640 621047554 625460396 628821449 619505081 617272797 622269402
$$ packed form
3743.7F20708160j4379005r879227R829903N293922N370484k770500q334084Q532257
3751.4F14371910n713425l790283O562615L800659J899147m470062K759590M783935
3759.1F20204086o700706r42726K974090Q60710O14663K572364l088455l346100M117546
3767.8F17265472M310112p54089p529983K152442L110428L39508R09195k19040K03438
3776.5F19787483O43501K508927k477112o711044L610229K233582J246414J558151
3784.2F22400131k502098l57666J221047P57026J85929m17939K94648K77290O35109
3792.9F22493477k7771P33299K182274l970032l675041K660828L973884M447441o462326
3801.5F22356033p902183L714790K878914M412842L361053r316368k232284M996605
$$ plain form
3809.3 622269402 624213676 623739052 623731842 623721771 625432777 630533066 627452545 616511459 621467285
3817.9 621467285 625999107 629698563 630070610 614074821 616710129 622740211 625354767 627240067
3825.7 627240067 626212959 622010040 622198219 624137955 626962090 627648582 620778275 623849487 629759903
3834.3 629759903 624511642 624580688 630825958 622046280 618743820 624901390 620917931 622538490 627998505
3843 627998505 623973694 621260490 625129318 626722565 626099892 626848831 625703773 627142105 631564140
3851.7 631564140 627023468 626884880 613144035 617197266 627247276 625926971 623429985 624985046
3859.4 624985046 627217369 629058266 623995628 624938126 630319023 623236580 619168549 623280640
3867.1 623280640 627588921 631723747 622421913 616299515 622102928 627755432 629358749 620823021
$$ packed form
3809.3F22269402J944274m74624p210j0071J711006N100289l080521j0941086M955826
3817.9F21467285M531822L699456L72047j5995789K635308O030082K614556J885300
3825.7F27240067j027108m202919J88179J939736K824135O86492o870307L071212N910416
3834.3F29759903n248261O9046O245270q779678l302460O157570l983459J620559N460015
3843F27998505m024811k713204L868828J593247o22673P48939j145058J438332M422035
3851.7F31564140m540672j38588j3740845M053231J0050010j320305k496986J555061
3859.4F24985046K232323J840897n062638R42498N380897p082443m068031M112091
3867.1F23280640M308281M134826r301834o122398N803413N652504J603317q535728
$$ plain form
3874.8 620823021 621769447 624969559 625346146 627172394 630180244 625148697 619722557 624869232 625542679
3883.5 625542679 627104111 630081787 618467903 620480766 624377670 626198387 629750443 627791252
3891.2 627791252 621224785 622498016 624657402 623095207 624661751 625671158 626585922 627082329 620473900
3899.9 620473900 625373840 625490150 621345787 625746727 622592468 622281075 623388824 624115562 625252113
3908.6 625252113 624065132 624308777 624392090 624139748 624073753 623402252 624337997 626511345 623946495
3917.3 623946495 621404495 624990425 624109612 620630417 623069420 624525108 624543381 622881699 620620766
3926 620620766 621903000 623630371 625011368 624244080 623473816 624575119 621945229 621294899 623083267
3934.6 623083267 623082314 622986870 622234001 621917076 622486000 622738724 623777771 623592300 620163689 620014915
$$ packed form
3874.8F20823021R46426L200112L76587J826248L007850n031547n426140N146675O73447
3883.5F25542679J561432K977676j1613884K012863L896904J820717L552056j959191
3891.2F27791252o566467J273231K159386j562195J566544J009407R14764M96407o608429
3899.9F20473900M899940J16310m144363M400940l154259l11393J107749P26738J136551
3908.6F25252113j186981K43645Q3313k52342o5995o71501R35745K173348k564850
3917.3F23946495k542000L585930q80813l479195K439003J455688J8273j661682k260933
3926F20620766J282234J727371J380997p67288p70264J101303k629890o50330J788368
3934.6F23083267r53r5444p52869l16925N68924K52724J039047j85471l428611j48774
$$ plain form
3944.3 620014915 621615944 622244186 622877350 621737251 622300301 622012825 620288658 622268181 622080917
3953 622080917 620856361 621323776 621797485 621900253 621044769 621499825 621797180 621955986 621463432 620055084
3962.6 620055084 620839996 621516685 621559639 621685333 621467056 621387596 621213799 620773659 620934677 621110115
3972.2 621110115 620350418 620159683 620272408 620185928 620082054 620423660 621482620 621723824 621112976 620685654
3981.9 620685654 620385017 620147552 620601234 620784378 620698776 620614052 620252380 620747261 620913353 620830460
3991.5 620830460 620603752 620559044 620662003 619205017 619181595 620256271 620059242 619542923 619870872
4000.2 619870872
$$ packed form
3944.3F20014915J601029O28242O33164j140099N63050k87476j724167J979523j87264
3953F22080917j224556M67415M73709J02768q55484M55056K97355J58806m92554j408348
3962.6F20055084P84912O76689M2954J25694k18277p9460j73797m40140J61018J75438
3972.2F21110115p59697j90735J12725q6480j03874L41606J058960K41204o10848m27322
3981.9F20685654l00637k37465M53682J83144q5602q4724l61672M94881J66092q2893
3991.5F20830460k26708m4708J02959j456986k3422J074676j97029n16319L27949
4000.2F19870872
##END=$$ End of the data block
