##TITLE=$$ Begin of the data block
##JCAMP-DX=5.00 $$ ACD/SpecManager v 10.08
##SPECTROMETER/DATA SYSTEM=Varian
##DATE=15 Jan 2013 15:29:24
##DATA TYPE=INFRARED SPECTRUM
##DATA CLASS=XYDATA
##ORIGIN=
##OWNER=
##NPOINTS=3735
##FIRSTX=399.26403809
##LASTX=4000.35498047
##MAXX=4000.35498047
##MINX=399.26403809
##MAXY=68.61122131
##MINY=24.72754478
##XFACTOR=1.0000000000
##YFACTOR=0.000000100000000
##FIRSTY=41.42184448
##DELTAX=0.96440572
##XUNITS=1/CM
##YUNITS=TRANSMITTANCE
##XYDATA=(X++(Y..Y))
$$ plain form
399.3 414218445 417178802 421224289 416819153 410926094 415524216 408653526 404212532 406167030
407 406167030 407987633 407454262 403895531 404374809 407710724 413613091 412987137 406479454 404095535
415.7 404095535 408332253 409427986 412054672 411628494 399838982 407228966 411847343 410434074
423.4 410434074 409413872 405686378 404573212 404614792 404617043 401224823 406165924 410505714 404446449
432.1 404446449 401325912 399493179 402700653 402172203 401244507 405548859 405513573 402102890 399488487
440.7 399488487 402900887 405512886 409098549 412912712 409895325 405689697 402397156 401256943
448.4 401256943 403691139 406082916 402335052 402207718 406210899 405019684 401678429 401413040 407070427
457.1 407070427 405142212 404034958 404069481 401338387 400341263 399081001 402435608 402977715 400772133
$$ packed form
399.3D14218445K960357M045487m405136n893059M598122o870690m440994J954498
407D06167030J820603n33371l558731M79278L335915N902367o25954o507683k383919
415.7D04095535M236718J095733K626686m26178j1789512P389984M618377j413269
423.4D10434074j020202l727494j113166M1580K251l392220M941101M339790o059265
432.1D04446449l120537j832733L207474n28450r27696M304352l5286l410683k614403
440.7C99488487L412400K611999L585663L814163l017387m205628l292541j140213
448.4D01256943K434196K391777l747864j27334M003181j191215l341255k65389N657387
457.1D07070427j928215j107254L4523k731094r97124j260262L354607N42107k205582
$$ plain form
465.8 400772133 398020477 395224075 400892258 404895058 400840149 394737320 393465080 391754112
473.5 391754112 390677414 394686966 396701736 394998932 394936600 393456039 387668190 387186241 391416931
482.2 391416931 394815826 394891739 392530136 392038155 391781693 391469765 387560081 386694031 388284035
490.9 388284035 389304924 393264084 393656425 394990005 394795723 391467514 390395622 390408859 391068459
499.6 391068459 390000610 387749672 385121536 387344894 389803581 389101410 388301735 386713943 387029991
508.2 387029991 389013443 389223747 385550766 384796219 386740761 387326698 388802643 388249397 387108459
516.9 387108459 386386261 386855087 384213524 378825836 379548378 382868347 384618111 382583351 381504326
525.6 381504326 383057022 382902603 383423920 381558533 378409195 378857994 381804543 382354431 382526627
$$ packed form
465.8D00772133k751656k796402N668183M002800m054909o102829j272240j710968
473.5C91754112j076698M009552K014770j702804o2332j480561n787849m81949M230690
482.2C91416931L398895P5913k361603m91981k56462l11928l909684q66050J590004
490.9C88284035J020889L959160L92341J333580j94282l328209j071892J3237O59600
499.6C91068459j067849k250938k628136K223358K458687p02171p99675j587792L16048
508.2C87029991J983452K10304l672981p54547J944542N85937J475945n53246j140938
516.9C87108459p22198M68826k641563n387688P22542L319969J749764k034760j079025
525.6C81504326J552696j54419N21317j865387l149338M48799K946549N49888J72196
$$ plain form
534.3 382526627 382024879 378898773 378956871 379188690 377833176 378181152 380325050 380421638 378021774
543 378021774 377328262 377702637 379220772 378612976 375959778 374794731 375266571 376779175 376520233
551.6 376520233 375340614 373336372 372627563 372805939 372154236 372310753 371308746 369821510 369129868
560.3 369129868 370510292 372251434 373041077 374516792 374325447 371871490 369635506 370105705 369968567
569 369968567 368494453 369467583 371297722 371811943 371613503 370592461 369367409 370003395 369210777
577.7 369210777 368486023 369635315 370152855 372101593 372958412 372127075 372289276 372164879 370447426
586.4 370447426 368419037 367927513 369368248 371647911 371073685 371021652 373471642 374025078 373831177
595 373831177 373246002 372349586 371716766 371643791 371920738 372671967 372905197 372238731 372888336 372041740
$$ packed form
534.3C82526627n01748l126106N8098K31819j355514L47976K143898R6588k399864
543C78021774o93512L74375J518135o07796k653198j165047M71840J512604k58942
551.6C76520233j179619k004242p08809J78376o51703J56517j002007j487236o91642
560.3C69129868J380424J741142P89643J475715j91345k453957k235984M70199j37138
569C69968567j474114R73130J830139N14221j98440j021042j225052O35986p92618
577.7C69210777p24754J149292N17540J948738Q56819q31337J62201j24397j717453
586.4C70447426k028389m91524J440735K279663n74226n2033K449990N53436j93901
595C73831177n85175q96416o32820p2975K76947P51229K33230o66466O49605q46596
$$ plain form
604.7 372041740 370129814 369683342 369207153 368853111 369521675 370624084 370461845 369635429 368259354
613.4 368259354 368121872 368248329 367042885 367399559 367200661 367129784 367909966 368137970 368030472 368202705
623 368202705 370248260 371729927 372079849 372484589 372796097 373565941 373979340 374292183 375922508 378616524
632.7 378616524 380243263 381009598 381425858 381478195 381830292 381815262 383254776 385884399 386603165 387031822
642.3 387031822 389096603 390623741 390738716 391180344 391566315 391502647 391833534 392091942 392342148 393572159
651.9 393572159 394858856 395241776 395707016 395189362 393785477 393822136 394204674 393773460 393284607 392815247
661.6 392815247 392782669 393720894 393445702 392902756 393646355 392191696 388777008 392294121 393425751
670.3 393425751 393674316 394706917 396406212 397639999 398475456 398833237 399439850 400292168 401024094
$$ packed form
604.7C72041740j911926m46472m76189l54042O68564J102409j62239q26416j376075
613.4C68259354j37482J26457j205444L56674j98898p0877P80182K28004j07498J72233
623C68202705K045555J481667L49922M04740L11508P69844M13399L12843J630325K694016
632.7C78616524J626739P66335M16260N2337L52097j5030J439514K629623P18766M28657
642.3C87031822K064781J527138J14975M41628L85971o3668L30887K58408K50206J230011
651.9C93572159J286697L82920M65240n17654j403885L6659L82538m31214m88853m69360
661.6C92815247l2578R38225k75192n42946P43599j454659l414688L517113J131630
670.3C93425751K48565J032601J699295J233787Q35457L57781O06613Q52318P31926
$$ plain form
678.9 401024094 401526756 401406403 401869888 402217140 403318253 405718155 407144165 408234291 408526154
687.6 408526154 408469849 409710846 410290413 409566727 409027367 409272804 410618629 412786217 414217987
696.3 414217987 414780083 415267639 415400887 414852867 414488106 415240211 415850525 416617126 418174896 418974113
705.9 418974113 419536247 420482979 420970993 421050339 420791283 420227394 420379181 420924988 421592827 423229790
715.6 423229790 424241524 424310303 425595970 427048340 426549530 425559769 425368690 425926933 427361908
724.3 427361908 428435135 429777946 431583519 432227821 432353172 432452469 432400475 432645340 433404846 434126968
733.9 434126968 434639397 435454636 436299896 436296501 435925446 436131859 436186256 436647301 437195053 436989059
743.6 436989059 436923180 437279472 438538818 439802132 440531769 441250038 442011108 442377548 442437286 442828712
$$ packed form
678.9D01024094N02662j20353M63485L47252J101113K399902J426010J090126K91863
687.6D08526154n6305J240997N79567p23686n39360K45437J345825K167588J431770
696.3D14217987N62096M87556J33248n48020l64761P52105O10314P66601J557770P99217
705.9D18974113N62134R46732M88014P9346k59056n63889J51787N45807O67839J636963
715.6D23229790J011734O8779J285667J452370m98810r89761j91079N58243J434975
724.3D27361908J073227J342811J805573O44302J25351R9297n1994K44865P59506P22122
733.9D34126968N12429Q15239Q45260l395l71055K06413N4397M61045N47752k05994
743.6D36989059o5879L56292J259346J263314P29637P18269P61070L66440N9738L91426
$$ plain form
753.2 442828712 443017311 444529037 446355247 446908913 447276459 447065048 447529030 448940620 450416603
761.9 450416603 450900955 450559349 451092911 452549133 453773003 453807793 453790245 453453789 453703117 453971634
771.5 453971634 453381805 453376198 452288246 452566414 454129448 454728889 455015793 454589272 454241142 453648758
781.2 453648758 454142532 454655609 454382095 455181808 456164780 456692314 457019577 458353882 459102783 459149933
790.8 459149933 458431587 456972618 457374763 457510796 457011299 456833954 457255936 457420197 456214790
799.5 456214790 455379448 454905815 454049034 452906342 453061485 453194122 451884041 450118027 448075447
808.2 448075447 446076431 444298630 443999138 442847328 440694771 440508347 441030731 440581284 438748245
816.9 438748245 437471771 437313004 437752724 438484726 438443680 438505287 439639244 441941910 444346275
$$ packed form
753.2D42828712J88599J511726J826210N53666L67546k11411M63982J411590J475983
761.9D50416603M84352l41606N33562J456222J223870L4790j7548l36456K49328K68517
771.5D53971634n89829n607j087952K78168J563034N99441K86904m26521l48130n92384
781.2D53648758M93774N13077k73514P99713R82972N27534L27263J334305P48901M7150
790.8D59149933p18346j458969M02145J36033m99497j77345M21982J64261j205407
799.5D56214790q35342m73633q56781j142692J55143J32637j310081j766014k042580
808.2D48075447j999016j777801k99492j151810k152557j86424N22384m49447j833039
816.9D38748245j276474j58767M39720P32002m1046O1607J133957K302666K404365
$$ plain form
825.5 444346275 446193733 447828560 450193329 452505913 453969193 456537781 459491005 462448997
833.3 462448997 464728050 466857872 469426765 470469131 471316338 472458611 475103874 477826729 478811722
841.9 478811722 480146027 481997833 483712997 484584007 486232948 487802925 487807922 487615852 488549347
850.6 488549347 490615005 491682434 491369324 491987534 495005989 496506500 497288132 499263763 499744720
859.3 499744720 500000458 500485382 501984711 503406181 504237976 504733772 504378357 503863106 502495193
868 502495193 502420082 502123985 501038399 500300522 499358025 498479309 497114868 496696434 496638527 496577606
877.6 496577606 495004387 493089600 492759666 491763077 490952148 490195160 489903717 489164162 488285255
886.3 488285255 488655243 488827057 488020973 486318245 486618118 486937256 486237793 485941849 485670929 486162109
$$ packed form
825.5D44346275J847458J634827K364769K312584J463280K568588K953224K957992
833.3D62448997K279053K129822K568893J042366Q47207J142273K645263K722855R84993
841.9D78811722J334305J851806J715164Q71010J648941J569977M997j92070R33495
850.6D88549347K065658J067429l13110O18210L018455J500511P81632J975631M80957
859.3D99744720K55738M84924J499329J421470Q31795M95796l55415n15251j367913
868E02495193p5111k96097j085586p37877r42497q78716j364441m18434n7907o0921
877.6D96577606j573219j914787l29934r96589q10929p56988k91443p39555q78907
886.3D88285255L69988J71814q06084j702728K99873L19138o99463k95944k70920M91180
$$ plain form
895.9 486162109 486360779 486459541 485628242 484922104 484076233 482697945 482773666 482842255 483529167 484536591
905.6 484536591 486106033 488176880 489697876 490992508 492194786 493895416 493968735 493858223 493960876
914.3 493960876 493184052 492002602 490178490 488454094 485797272 483795509 482335548 480271606 478034554
922.9 478034554 475770226 473787193 470770683 467324524 463955841 461453400 459617538 457483063
930.7 457483063 455113220 452665482 451073532 449421806 447984772 447131233 446455307 445713768 445005760
939.3 445005760 444876862 443658295 442324104 441808586 440967598 439515381 438518791 438928032 438762589
948 438762589 438296776 438196602 438002472 438096733 438420296 438624916 437504311 436037254 434918251 433637314
957.7 433637314 432479591 431246376 429587440 427768059 426309280 424557457 423087425 422435188 421147690
$$ packed form
895.9D86162109J98670R8762q31299p06138q45871j378288P5721O8589O86912J007424
905.6D84536591J569442K070847J520996J294632J202278J700630P3319j10512J02653
914.3D93960876p76824j181450j824112j724396k656822k001763j459961k063942k237052
922.9D78034554k264328j983033l016510l446159l368683k502441j835862k134475
930.7D57483063k369843k447738j591950j651726j437034q53539o75926p41539p08008
939.3D45005760j28898j218567j334191n15518q40988j452217r96590M09241j65443
948D38762589m65813j00174j94130R4261L23563K04620j120605j467057j119003j280937
957.7D33637314j157723j233215j658936j819381j458779j751823j470032o52237j287498
$$ plain form
966.3 421147690 419109535 417148323 415279655 413561668 412015953 409975090 407964630 406639748
974.1 406639748 404701843 401610107 398200417 394944572 391857452 388245735 384765205 382004204
981.8 382004204 378557434 375006332 371797066 368375626 364612274 360896416 358009796 355875168
989.5 355875168 353335800 349835548 347090111 344720535 342494774 340510406 338411140 336950569
997.2 336950569 335104942 332992134 330559959 328231583 326646576 325116348 323712502 322358627
1004.9 322358627 320772858 318977680 318323326 317726841 316439533 314927769 313050098 312070637 311670551
1013.6 311670551 310722294 308729897 307180710 306078796 304707413 302926598 300704327 298998890
1021.3 298998890 296898308 295451241 294080086 293076401 292467995 291162624 290608597 288758469 287217350
$$ packed form
966.3D21147690k038155j961212j868668j717987j545715k040863k010460j324882
974.1D06639748j937905l091736l409690l255845l087120l611717l480530k761001
981.8C82004204l446770l551102l209266l421440l763352l715858k886620k134628
989.5C55875168k539368l500252k745437k369576k225761j984368k099266j460571
997.2C36950569j845627k112808k432175k328376j585007j530228j403846j353875
1004.9C22358627j585769j795178o54354n96485j287308j511764j877671r79461m00086
1013.6C11670551r48257j992397j549187j101914j371383j780815k222271j705437
1021.3B98998890k100582j447067j371155j003685o08406j305371n54027j850128j541119
$$ plain form
1030 287217350 286836452 286744194 286176662 285170918 285456257 285112648 286095695 287305489 287498131 288088226
1039.6 288088226 289413719 291350803 292083969 293518276 294149628 293794613 293709526 293286438 292597961
1048.3 292597961 291541557 291561947 290187931 288461742 287883244 287483101 286751652 285407715 285316162
1057 285316162 284988728 284969158 285060863 285815659 287534676 289258347 291277103 292335892 294129982
1065.7 294129982 295085793 295934124 297537994 298717709 300370235 301170044 302001781 302662868 303193359
1074.4 303193359 303403397 303575420 303780842 303453751 303792000 303846207 304655399 305091438 305872784 307422314
1084 307422314 307626858 307988949 308398151 309396381 310172367 311438713 312800865 313151302 314187069
1092.7 314187069 314834442 315501957 316365528 317687473 318764591 319382877 320480652 321043663 321704445
$$ packed form
1030B87217350l80898r2258n67532j005744K85339l43609R83047J209794J92642N90095
1039.6B88088226J325493J937084P33166J434307O31352l55015q5087m23088o88477
1048.3B92597961j056404K0390j374016j726189n78498m00143p31449j343937r1553
1057B85316162l27434j9570R1705P54796J719017J723671K018756J058789J794090
1065.7B94129982R55811Q48331J603870J179715J652526P99809Q31737O61087N30491
1074.4C03193359K10038J72023K05422l27091L38249N4207Q09192M36039P81346J549530
1084C07422314K04544L62091M09202R98230P75986J266346J362152L50437J035767
1092.7C14187069O47373O67515Q63571J321945J077118O18286J097775N63011O60782
$$ plain form
1101.4 321704445 323084373 324570885 325734863 327690773 328262939 327850761 328544693 328689766 329570847
1110 329570847 330386276 331216507 331999245 332173767 332583046 332453651 333294220 333922768 334179001 334914856
1119.7 334914856 334793968 334228058 334166412 334503937 334483070 335042496 335670319 336587257 337071609 336975975
1129.3 336975975 338333588 339807243 341424866 343036079 344773407 346468430 348302689 350661545
1137 350661545 352166290 353750305 355094528 356330299 357971649 359807854 361208687 361386528 361482544
1145.7 361482544 362171326 363596497 364221535 364121513 364325256 364499702 364865303 364580879 363827400
1154.4 363827400 362925072 362565002 362689896 361898117 360825272 360399551 360460548 359945374 359598236 359608879
1164 359608879 359985237 361159401 362278290 364182816 366647911 368921967 370841789 372878571 374910240
$$ packed form
1101.4C21704445J379928J486512J163978J955910N72166m12178O93932J45073Q81081
1110C29570847Q15429Q30231P82738J74522M09279j29395Q40569O28548K56233P35855
1119.7C34914856j20888n65910o1646L37525k0867N59426O27823R16938M84352r5634
1129.3C36975975J357613J473655J617623J611213J737328J695023J834259K358856
1137C50661545J504745J584015J344223J235771J641350J836205J400833J77841R6016
1145.7C61482544O88782J425171O25038j00022K03743J74446L65601k84424p53479
1154.4C63827400r02328l60070J24894p91779j072845m25721O0997n15174l47138J0643
1164C59608879L76358J174164J118889J904526K465095K274056J919822K036782K031669
$$ plain form
1172.7 374910240 376860161 379459724 382270927 384806175 386630020 388627281 390971413 392967186
1180.4 392967186 394784660 396653137 398146057 399387474 400823059 401738434 403026085 404582214
1188.1 404582214 405428238 405920868 406243362 406441994 405933647 405010376 404429855 404348679 403976440 402843170
1197.8 402843170 402238541 401849327 401179085 400749588 400027122 399277115 398546410 397358894 396083641
1206.5 396083641 395260468 394987106 394938354 395189819 395216560 394740410 394132156 393516121 392925987 392278137
1216.1 392278137 392033768 392012367 392028885 392314873 392176132 391688995 391297798 390940742 390583725 389663239
1225.8 389663239 388623543 388185730 387825165 387689247 387599068 386892738 386049538 385403137 384949532 384317245
1235.4 384317245 383825150 383953705 383987885 383776054 383593826 383804016 384122467 383897476 383270798 382322083
$$ packed form
1172.7C74910240J949921K599563K811203K535248J823845J997261K344132J995773
1180.4C92967186J817474J868477J492920J241417J435585R15375J287651J556129
1188.1D04582214Q46024M92630L22494J98632n08347r23271n80521q1176l72239j133270
1197.8D02843170o04629l89214o70242m29497p22466p50007p30705j187516j275253
1206.5C96083641q23173k73362m8752K51465K6741m76150o08254o16035n90134o47850
1216.1C92278137k44369k1401J6518K85988j38741m87137l91197l57056l57017r20486
1225.8C89663239j039696m37813l60565j35918r0179p06330q43200o46401m53605o32287
1235.4C84317245m92095J28555L4180k11831j82228K10190L18451k24991o26678r48715
$$ plain form
1245 382322083 381514015 381509285 381812401 381564064 381020813 380855827 380905762 380674744 380317078 379900932
1254.7 379900932 379595604 379612694 379511147 379313889 379224358 379553986 379699898 379522209 379867096 380198097
1264.3 380198097 380496674 380862885 381436462 382004814 382465897 383087387 383409424 383941727 384484558 385305862
1274 385305862 386351547 387100754 388011398 388886757 389948540 390646019 391006813 391638718 392329102 393398628
1283.6 393398628 394968071 396220779 396816711 397559547 398574982 399802170 400688629 401333351 402047310
1292.3 402047310 402544899 403143768 403562469 404274940 405223045 405711441 405912132 406050186 406184235 406466866
1301.9 406466866 406873360 406579552 406330261 406692123 406749725 406318703 405925865 405735245 405171242 404304428
1311.6 404304428 403529663 403137550 402655144 402038498 401931419 402021255 402463608 403193092 403527794 403855095
$$ packed form
1245C82322083q08068m730L03116k48337n43251j64986M9935k31018l57666m16146
1254.7C79900932l05328J7090j01547j97258q9531L29628J45912j77689L44887L31001
1264.3C80198097K98577L66211N73577N68352M61083O21490L22037N32303N42831Q21304
1274C85305862J045685P49207R10644Q75359J061783O97479L60794O31905O90384J069526
1283.6C93398628J569443J252708N95932P42836J015435J227188Q86459O44722P13959
1292.3D02047310M97589N98869M18701P12471R48105M88396K00691J38054J34049K82631
1301.9D06466866M06494k93808k49291L61862N7602m31022l92838j90620n64003q66814
1311.6D04304428p74765l92113m82406o16646j07079Q9836M42353P29484L34702L27301
$$ plain form
1321.2 403855095 404457092 405006752 405499916 406136398 406771774 407496452 408052940 408235397 407683525 407119446
1330.9 407119446 407054062 406569099 406212234 406040573 405832253 406015739 406180458 405885811 405729637 406384125
1340.5 406384125 406968880 407608757 408155785 408920288 409855042 410030022 410376053 410958252 411647873 411781654
1350.2 411781654 411493797 411358795 410918884 410892258 410837059 410403328 410339546 410487518 410074577 409827385
1359.8 409827385 409727173 409284744 409387665 408447113 407921066 407894859 407603226 407422066 406801414 406739349
1369.4 406739349 406562538 405909119 405640907 405727654 405466461 405057297 405729790 405969582 405714188 405423431
1379.1 405423431 405096130 404786186 404202995 403321953 402127800 400835762 399728165 398884430 396993599
1387.8 396993599 396037827 395420380 394120903 392989883 391387634 389887733 387196045 384200554 383217735
$$ packed form
1321.2D03855095O01997N49660M93164O36482O35376P24678N56488J82457n51872n64079
1330.9D07119446o5384m84963l56865j71661k08320J83486J64719k94647j56174O54488
1340.5D06384125N84755O39877N47028P64503R34754J74980L46031N82199O89621J33781
1350.2D11781654k87857j35002m39911k6626n5199m33731o3782J47972m12941k47192
1359.8D09827385j00212m42429J02921r40552n26047k6207k91633j81160o20652o2065
1369.4D06739349j76811o53419k68212Q6747k61193m09164O72493K39792k55394k90757
1379.1D05423431l27301l09944n83191q81042j194153j292038j107597q43735j890831
1387.8C96993599r55772o17447j299477j131020j602249j499901k691688k995491r82819
$$ plain form
1396.4 383217735 382010269 380562515 378264809 376963921 375861320 373999481 372454796 371066093
1404.2 371066093 368924713 367138710 366346512 365108910 363598022 362252159 360704727 359595642
1411.9 359595642 358592110 357688904 356722183 355762558 355108910 354331703 354179039 352579422 353311310
1420.6 353311310 354752007 354664726 355060997 355231857 355692101 356350212 356709976 357804642 358267746
1429.2 358267746 358467979 358977890 360513840 362058830 363419113 365065002 365717506 366177406 367346840
1437.9 367346840 369607468 371317406 372475510 373616295 374342918 375744247 376892776 378383942
1445.6 378383942 379114304 379351997 380100174 381455688 383243637 384411621 385976486 386820755 388273048
1454.3 388273048 389532547 389518967 389765511 390334549 393894310 395553055 398176880 400017433 401085930
$$ packed form
1396.4C83217735j207466j447754k297706j300888j102601j861839j544685j388703
1404.2C71066093k141380j786003p92198j237602j510888j345863j547432j109085
1411.9C59595642j003532r03206r66721r59625o53648p77207j52664j599617P31888
1420.6C53311310J440697q7281L96271J70860M60244O58111L59764J094666M63104
1429.2C58267746K00233N09911J535950J544990J360283J645889O52504M59900J169434
1437.9C67346840K260628J709938J158104J140785P26623J401329J148529J491166
1445.6C78383942P30362K37693P48177J355514J787949J167984J564865Q44269J452293
1454.3C88273048J259499j3580K46544N69038L559761J658745K623825J840553J068497
$$ plain form
1463 401085930 403130455 403887520 406226654 408157234 410243912 411667175 413262520 416076851 417755966
1471.7 417755966 419890633 422016983 425384216 427998962 429358673 431394081 433543015 435580597
1479.4 435580597 436946373 438303947 439694824 441068420 442404556 443370857 444581108 445249977 445369034
1488.1 445369034 445993881 445437737 445682755 446482887 446715088 446395836 446140671 445326805 441021194
1496.7 441021194 441469460 441133156 439170876 439073372 438245811 437142448 436066055 436150169 435994225
1505.4 435994225 431548233 427373199 428581505 430465889 430579834 430911140 429784241 428823662 428541946
1514.1 428541946 427539673 427570839 425739479 424081802 425094757 425935402 424056320 421837196 422746124
1522.8 422746124 423887901 425145111 423621674 423565636 424208946 424601517 425218086 425588188 426635094
$$ packed form
1463D01085930K044525P57065K339134J930580K086678J423263J595345K814331J679115
1471.7D17755966K134667K126350L367233K614746J359711K035408K148934K037582
1479.4D35580597J365776J357574J390877J373596J336136R66301J210251O68869J19057
1488.1D45369034O24847n56144K45018Q00132K32201l19252k55165q13866m305611
1496.7D41021194M48266l36304j962280r7504q27561j103363j076393Q4114j55944
1505.4D35994225m445992m175034J208306J884384J13945L31306j126899r60579k81716
1514.1D28541946j002273L1166j831360j657677J012955Q40645j879082k219124R08928
1522.8D22746124J141777J257210j523437n6038O43310L92571O16569L70102J046906
$$ plain form
1531.5 426635094 427377586 427654037 426316872 427387314 428426628 428785934 429549065 425462379 423093872
1540.1 423093872 425784798 427918358 428140984 428897095 430288696 429375725 430175323 430692596 431106300
1548.8 431106300 430116539 428910942 429833832 430465202 431092644 428642387 428993492 429749870 428591270
1557.5 428591270 420555267 416566620 422651787 422085495 422802849 421993217 421102257 418458099 415941391
1566.2 415941391 415201569 413292770 411759186 404816475 404034119 402588921 399905701 397735252 394804115
1574.9 394804115 393649750 384781570 383910484 381750641 378854599 376005783 371869392 369129143
1582.6 369129143 364657021 362332382 358397179 354997559 351979942 348226318 345901260 341426506
1590.3 341426506 339268837 335256271 332684822 329934807 326377754 324603233 321086998 319611988
$$ packed form
1531.5D26635094P42492K76451j337165J070442J039314L59306P63131m086686k368507
1540.1D23093872K690926K133560K22626P56111J391601r12971P99598N17273M13704
1548.8D31106300r89761j205597R22890O31370O27442k450257L51105P56378j158600
1557.5D28591270q036003l988647O085167n66292P17354q09632q90960k644158k516708
1566.2D15941391p39822j908799j533584o942711p82356j445198k683220k170449k931137
1574.9C94804115j154365q868180q71086k159843k896042k848816m136391k740249
1582.6C69129143m472122k324639l935203l399620l017617l753624k325058m474754
1590.3C41426506k157669m012566k571449k750015l557053j774521l516235j475010
$$ plain form
1598 319611988 316385422 314571514 311600552 309110088 307611294 304228020 303319225 300881500 300337429
1606.7 300337429 298035393 296746845 295649967 293805714 294027214 291641846 291695442 290231056 290324097
1615.4 290324097 289442520 285168972 287901020 287422905 288291626 287071133 288058300 287894802 285837936
1624 285837936 287300072 286954250 288230915 287166824 288095760 288062897 288796329 289810314 289461193
1632.7 289461193 291438236 291288128 291161404 289858437 292863560 294632149 295597286 297859306 298319016
1641.4 298319016 300601597 300750599 302129288 303681107 303893757 305014000 303741589 307113304 307950573
1650.1 307950573 310256424 311442261 309848919 309572411 309860001 313423958 314040108 315704308 316356697
1658.8 316356697 317699089 319038029 320046158 322688942 322887535 325513763 326700363 328993759
$$ packed form
1598C19611988l226566j813908k970962k490464j498794l383274r08795k437725n44071
1606.7C00337429k302036j288548j096878j844253K21500k385368N3596j464386R3041
1615.4B90324097q81577m273548K732048m78115Q68721j220493R87167j63498k056866
1624B85837936J462136l45822J276665j064091R28936l2863P33432J013985l49121
1632.7B89461193J977043j50108j26724j302967L005123J768589R65137K262020M59710
1641.4B98319016K282581J49002J378689J551819K12650J120243j272411L371715Q37269
1650.1C07950573K305851J185837j593342k76508K87590L563957O16150J664200O52389
1658.8C16356697J342392J338940J008129K642784J98593K626228J186600K293396
$$ plain form
1666.5 328993759 331359215 333318977 336731758 337511826 340935326 342134895 345343971 348334732
1674.2 348334732 350624962 353396988 355733147 359248848 361651917 365002937 366767845 370309372
1681.9 370309372 374260674 375372620 380271645 382568130 387761993 390645866 393770828 397665138
1689.6 397665138 401129379 405244751 408488274 412620964 416328621 419905014 421047554 426008186
1697.3 426008186 431284218 435487595 439082031 439084396 445569229 450273247 454213257 456664124 459144058
1706 459144058 462301598 464889412 468779831 471413765 473586388 476192436 478776779 481763191 482906342
1714.7 482906342 483510742 485833893 487854881 486066742 489672165 493171272 495374184 497620583
1722.4 497620583 498833656 499782677 501249237 502765999 504317360 506127968 508209648 508325539 509093246
$$ packed form
1666.5C28993759K365456J959762L412781P80068L423500J199569L209076K990761
1674.2C48334732K290230K772026K336159L515701K403069L351020J764908L541527
1681.9C70309372L951302J111946M899025K296485N193863K883873L124962L894310
1689.6C97665138L464241M115372L243523M132690L707657L576393J142540M960632
1697.3D26008186N276032M203377L594436K365O484833M704018L940010K450867K479934
1706D59144058L157540K587814L890419K633934K172623K606048K584343K986412J143151
1714.7D82906342O04400K323151K020988j788139L605423L499107K202912K246399
1722.4D97620583J213073R49021J466560J516762J551361J810608K081680J15891P67707
$$ plain form
1731.1 509093246 511956024 514162369 513237534 512155533 516310272 519846153 521893044 524401016
1738.8 524401016 525331078 525139771 529147682 532300186 533210487 535403824 539114876 542299232 544967766
1747.5 544967766 548358727 550558624 554764633 557323685 559340134 564502907 568198051 572064056
1755.2 572064056 575773468 577078285 579692650 582978897 585930061 589109383 589398727 590554581
1762.9 590554581 594160080 596481857 598904152 601383553 602935448 602208595 604488983 607956085
1770.6 607956085 607940254 607198372 607716675 612006645 614533882 614625893 617127457 618517494 620245399
1779.3 620245399 620640640 620075493 621674080 623750954 625887108 625819168 626404381 628398933 629873199
1788 629873199 630646973 632079506 632910652 633017693 632507591 632984619 636185150 636871262 637089119 639070473
$$ packed form
1731.1E09093246K862778K206345r24835j082001M154739L535881K046891K507972
1738.8E24401016R30062j91307M007911L152504R10301K193337L711052L184356K668534
1747.5E44967766L390961K199897M206009K559052K016449N162773L695144L866005
1755.2E72064056L709412J304817K614365L286247K951164L179322K89344J155854
1762.9E90554581L605499K321777K422295K479401J551895p26853K280388L467102
1770.6F07956085j5831p41882N18303M289970K527237R2011K501564J390037J727905
1779.3F20245399L95241n65147J598587K076874K136154o7940N85213J994552J474266
1788F29873199P73774J432533Q31146J07041n10102M77028L200531O86112K17857J981354
$$ plain form
1797.6 639070473 640493240 640418091 639587135 641854172 642461548 643564987 645424118 646046982 647127609
1806.3 647127609 647616730 648280334 649207077 650192490 649514923 650148010 651836777 652411499 653508224
1815 653508224 653971252 654864044 655054550 655691147 656592636 656748199 657722549 657189102 658442764 660008545
1824.6 660008545 658008347 658513947 660724182 662552795 662284317 659859238 661067276 663462830 663921051
1833.3 663921051 664288330 664603424 664856949 665717926 665820465 666914215 667310104 667916336 668350906
1842 668350906 669253006 669830322 665388641 667748718 670175781 670439529 670251541 670627441 671439896
1850.7 671439896 671496277 672557831 672740402 672901077 673263779 673854980 674595642 674152527 674578934 674791107
1860.3 674791107 675155792 675100555 675402832 675797729 675660095 676345825 676270218 677251892 676584320 675686951
$$ packed form
1797.6F39070473J422767p5149q30956K267037O07376J103439J859131O22864J080627
1806.3F47127609M89121O63604R26743R85413o77567O33087J688767N74722J096725
1815F53508224M63028Q92792J90506O36597R01489J55563R74350n33447J253662J565781
1824.6F60008545k000198N05600K210235J828613k68478k425079J208038K395554M58221
1833.3F63921051L67279L15094K53525Q60977J02539J093750L95889O06232M34570
1842F68350906R02100N77316m441681K360077K427063K63748j87988L75900Q12455
1850.7F71439896N6381J061554J82571J60675L62702N91201P40662m43115M26407K12173
1860.3F74791107L64685n5237L02277L94897j37634O85730p5607R81674o67572q97369
$$ plain form
1869.9 675686951 676707916 677452087 678297272 678174438 678494415 678595963 678981400 679048538 679030075 679697571
1879.6 679697571 679666367 679973831 679741211 680393829 680405273 680095444 680977325 681066971 681962051 681692123
1889.2 681692123 680236511 680798035 682072678 682248154 681995926 681726151 680967178 682101898 682618103
1897.9 682618103 682772903 683269653 683509445 683487473 682950974 683353958 683254547 683403091 683379593 683338089
1907.6 683338089 683719101 683880005 684358063 684079056 684549942 684336395 684632111 684827423 684522629 685501480
1917.2 685501480 683559418 683382797 684581299 685252228 685886993 684585495 684227219 684813690 685196533
1925.9 685196533 684720993 685031815 685628357 685474472 685492783 685385666 685523224 684853973 685089188 685401993
1935.5 685401993 685197067 685175400 684769669 685077286 685249786 686112213 685421066 683782120 684595413 684923630
$$ packed form
1869.9F75686951J020965P44171Q45185j22834L19977J01548L85437O7138j8463O67496
1879.6F79697571l1204L07464k32620O52618J1444l09829Q81881Q9646Q95080k69928
1889.2F81692123j455612N61524J274643J75476k52228k69775p58973J134720N16205
1897.9F82618103J54800M96750K39792k1972n36499M02984r9411J48544k3498m1504
1907.6F83338089L81012J60904M78058k79007M70886k13547K95716J95312l04794R78851
1917.2F85501480j942062j76621J198502O70929O34765j301498l58276N86471L82843
1925.9F85196533m75540L10822N96542j53885J8311j07117J37558o69251K35215L12805
1935.5F85401993k04926k1667m05731L07617J72500Q62427o91147j638946Q13293L28217
$$ plain form
1945.2 684923630 684596710 683944016 684215698 684641953 684857483 684776001 684597702 684874573 684654083 684373703
1954.8 684373703 683597946 683806305 684283905 684244919 684431534 684312744 684530029 684109421 683805237 683622818
1964.5 683622818 683649368 683930664 683500366 683292084 683381195 683768997 683551025 683851776 683966064 683419113
1974.1 683419113 683658829 683572998 683367767 682903137 682953110 683045654 683092422 683269806 682937088 683097687
1983.7 683097687 682867050 682830811 682789154 682750854 682324600 681609497 682286530 682102356 681037369 680851212
1993.4 680851212 681606064 681899948 681563644 681594391 681360703 681424103 681068878 680904694 680890808 680853806
2003 680853806 680853577 680362549 680516891 680463715 680204620 679821167 679945602 680088882 679520264 679359283 679169312
2013.6 679169312 679321976 679117966 678990479 678848495 678459854 678386307 678080902 678118286 677839890 677854080
$$ packed form
1945.2F84923630l26920o52694K71682M26255K15530q1482j78299K76871k20490k80380
1954.8F84373703p75757K08359M77600l8986J86615j18790K17285m20608l04184j82419
1964.5F83622818K6550K81296m30298k08282Q9111L87802k17972L00751J14288n46951
1974.1F83419113K39716q5831k05231m64630M9973R2544M6768J77384l32718J60599
1983.7F83097687k30637l6239m1657l8300m26254p15103O77033j84174j064987j86157
1993.4F80851212P54852K93884l36304L0747k33688O3400l55225j64184j3886l7002
2003F80853806k29m91028J54342n3176k59095l83453J24435J43280n68618j60981j89971
2013.6F79169312J52664k04010j27487j41984l88641p3547l05405L7384k78396J4190
$$ plain form
2023.3 677854080 677383804 677016068 677292786 676890945 676847382 676406860 676347580 676193314 675852051 675686722
2032.9 675686722 675244751 675543289 675415115 675436859 675232849 674861298 674514008 673962555 673977737 673756485
2042.6 673756485 673902664 673705444 673632126 673552246 673143005 673088531 672814560 672748795 672350388 672517548
2052.2 672517548 672477036 672219543 672293854 671964951 671872177 671535873 671766586 671530914 671496277 671439285
2061.9 671439285 670689621 671048203 670747833 670633087 670768127 670799026 670696716 670324631 670445251 670190887
2071.5 670190887 670468674 670256424 670014343 670035553 669778900 670039291 669832535 669625015 669369202 669531174
2081.1 669531174 669446411 669052505 669092941 668797073 668498306 668340607 668650513 668037109 667389908 667334061
2090.8 667334061 667129059 667253494 667137680 667474213 667379303 667321930 667187881 666614609 666286850 665716629
$$ packed form
2023.3F77854080m70276l67736K76718m01841m3563m40522n9280j54266l41263j65329
2032.9F75686722m41971K98538j28174K1744k04010l71551l47290n51453J5182k21252
2042.6F73756485J46179j97220p3318p9880m09241n4474k73971o5765l98407J67160
2052.2F72517548m0512k57493P4311l28903r2774l36304K30713k35672l4637n6992
2061.9F71439285p49664L58582l00370j14746J35040L0899j02310l72085J20620k54364
2071.5F70190887K77787k12250k42081K1210k56653K60391k06756k07520k55813J61972
2081.1F69531174q4763l93906M0436k95868k98767j57699L09906o13404o47201n5847
2090.8F67334061k05002J24435j15814L36533r4910n7373j34049n73272l27759n70221
$$ plain form
2100.4 665716629 665894318 665799408 665768356 665569382 665211487 665457993 665173111 664967422 664516144 664280624
2110.1 664280624 663952866 663758926 663880234 663653336 663684845 663264771 663345490 663250885 662659912 662388916
2119.7 662388916 662156525 662058945 662057800 662460251 662178802 662053299 662222519 662248917 662143173 661458511
2129.4 661458511 661300964 661107025 661098709 661152496 661294785 661515808 661563873 661663666 660987854 660770187
2139 660770187 660752945 660751724 660840683 661012192 661107407 660792084 661414413 661354446 660914764 660639648 660394211
2149.6 660394211 660574188 660636292 661082535 660866089 660827637 660798798 660757446 661006699 660597610 660514221
2159.3 660514221 660481720 660896835 660874786 660569305 660644913 660858231 661330185 661005096 661000748 660732880
2168.9 660732880 660360947 660444412 660713196 660931854 660331497 660394135 660580673 660773773 660630112 660380630
$$ packed form
2100.4F65716629J77689r4910l1052j98974l57895K46506k84882k05689m51278k35520
2110.1F64280624l27758j93940J21308k26898L1509m20074Q0719r4605n90973k70996
2119.7F62388916k32391r7580j145M02451k81449j25503J69220K6398j05744o84662
2129.4F61458511j57547j93939q316N3787J42289K21023M8065R9793o75812k17667
2139F60770187j7242j221Q8959J71509R5215l15323O22329n9967m39682k75116k45437
2149.6F60394211J79977O2104M46243k16446l8452k8839m1352K49253m09089q3389
2159.3F60514221l2501M15115k2049l05481P5608K13318M71954l25089m348k67868
2168.9F60732880l71933Q3465K68784K18658o00357O2638J86538J93100j43661k49482
$$ plain form
2178.5 660380630 660787659 661062927 661306305 661017685 661322708 661353302 661088715 661028595 660637512 661084137
2188.2 661084137 661151505 661031113 661096649 661560364 661611710 661119614 661277924 661091766 661193924 661119003
2197.8 661119003 661209259 661310120 661254120 661599503 661521301 661841278 661721268 661423569 661066513 661076126
2207.5 661076126 661646118 661598816 661832275 661904831 661946030 661707306 661858521 662211990 662166290 662358246
2217.1 662358246 661782608 661769028 661982574 662256317 662386551 662167511 662317657 661832886 661660385 661489487
2226.8 661489487 661645584 661578827 661363754 661884308 661829910 661839371 661507111 661584854 661617584 661349411 661405029
2237.4 661405029 661186218 661586456 661512909 661460724 661467743 661283188 661241837 661066818 661162567 660866547 661019592
2248 661019592 661143875 661059647 660884552 660809708 661168213 660948029 660855637 660707321 660864105 660645752
$$ packed form
2178.5F60380630M07029K75268K43378k88620L05023L0594k64587o0120l91083M46625
2188.2F61084137O7368j20392O5536M63715N1346m92096J58310j86158J02158p4921
2197.8F61119003R0256J00861n6000L45383p8202L19977j20010k97699l57056R613
2207.5F61076126N69992m7302K33459P2556M1199k38724J51215L53469m5700J91956
2217.1F62358246n75638j3580K13546K73743J30234k19040J50146m84771j72501j70898
2226.8F61489487J56097o6757k15073N20554n4398R461l32260P7743L2730k68173N5618
2237.4F61405029k18811M00238p3547n2185P019j84555m1351j75019R5749k96020J53045
2248F61019592J24283q4228j75095p4844L58505k20184r2392j48316J56784k18353
$$ plain form
2257.6 660645752 660470200 660966949 660854187 661007843 660801392 660646133 660534363 660427475 660543442 660224152
2267.3 660224152 660207596 660097427 660172958 660126724 660072556 659973755 660144653 660518188 660020676 659929123 659757309
2277.9 659757309 659843903 659707489 659306641 659485855 659398499 659514923 659515152 659994431 659738312 658948746
2287.5 658948746 658702698 658619385 658962326 658336182 658334427 658324203 658025436 658189316 657868347 657749329
2297.2 657749329 657395325 657682114 657533035 657172012 657111435 656764984 656775665 656435089 656445160 655998230
2306.8 655998230 655872116 655458755 655215302 656218109 655951996 655600586 654586029 654524231 654655914
2315.5 654655914 653739700 653728561 653189163 653513641 653369446 652656784 652455521 652634583 652318192 651366501
2325.1 651366501 651940460 651835556 651878586 651170959 650920410 651586380 650702515 650333710 649875336 650411987
$$ packed form
2257.6F60645752j75552M96749j12762J53656k06451j55259j11770j06888J15967l19290
2267.3F60224152j6556j10169P5531m6234n4168r8801J70898L73535m97512r1553j71814
2277.9F59757309Q6594j36414m00848J79214q7356J16424K29M79279k56119p89566
2287.5F58948746k46048q3313L42941o26144j755j0224k98767J63880l20969j19018
2297.2F57749329l54004K86789j49079l61023o0577l46451J0681l40576J0071m46930
2306.8F55998230j26114m13361k43453J002807k66113l51410j014557o1798J31683
2315.5F54655914r16214j1139n39398L24478j44195p12662k01263J79062l16391r51691
2325.1F51366501N73959j04904M3030p07627k50549O65970q83865l68805m58374N36651
$$ plain form
2334.8 650411987 649725800 648736420 649475784 650378647 650520096 649239426 649510956 649162216 648667221
2343.4 648667221 647894974 647204361 648380051 648812714 648963852 649332733 649893723 648841019 647852402
2352.1 647852402 648067245 646909561 646231689 646397171 647151642 645857620 644301834 643629990 643603897
2360.8 643603897 644011688 644283905 645611115 644353409 644290161 644222565 644301682 645155182 644529724 644805527
2370.4 644805527 644253006 644659119 644784088 644599457 644536972 643443222 643417053 643491669 643805084 644032288
2380.1 644032288 644328995 644549332 644352188 644401550 643889160 643367310 642994766 643136444 643005447 642484970
2389.7 642484970 642452774 642277145 642152328 641683197 641613846 641271210 640738907 640798416 640452499 640207138
2399.4 640207138 639620476 639351578 639346962 639182281 638911667 638332939 638446274 638288765 637730064 637533607
$$ packed form
2334.8F50411987o86187r89380P39364R02863J41449j280670K71530l48740m94995
2343.4F48667221p72247o90613J175690M32663J51138L68881N60990j052704r88617
2352.1F47852402K14843j157684o77872J65482P54471j294022j555786o71844k6093
2360.8F43603897M07791K72217J327210j257706o3248o7596P9117Q53500o25458K75803
2370.4F44805527n52521M06113J24969j84631o2485j093750k6169P4616L13415K27204
2380.1F44032288K96707K20337j97144M9362n12390n21850l72544J41678j30997n20477
2389.7F42484970l2196j75629j24817m69131o9351l42636n32303N9509l45917k45361
2399.4F40207138n86662k68898m616j64681k70614n78728J13335j57509n58701j96457
$$ plain form
2409 637533607 637431335 636900673 636355324 635837822 635265999 635281601 635042534 634966011 634866066 634593124
2418.7 634593124 634171600 633339348 632863731 632547607 632712936 632394257 632203331 632261925 631543007 631300850
2428.3 631300850 630974770 630535202 630063362 629770241 629401970 628788147 628721199 628571777 628350906 627682610
2438 627682610 627221107 627012177 626632195 626468163 626051025 625855751 625673218 625194473 624516754 624401588
2447.6 624401588 624435921 623937569 623368759 622391243 621686897 621342697 621508369 621602859 621228485 620649414
2457.2 620649414 619884071 619935608 619769592 619383202 618976288 618552856 618188972 617483521 617117996 616645660
2466.9 616645660 616478882 616088181 615631752 615306015 614552422 614380188 614023819 613430214 612867928 612656288
2476.5 612656288 612088623 611435509 611815491 611661263 611153908 610326614 609610481 609046745 608417969 608222694
$$ packed form
2409F37533607j02272n30662n45349n17502n71823J5602k39067p6523r9945k72942
2418.7F34593124m21524q32252m75617l16124J65329l18679j90926N8594p18918k42157
2428.3F31300850l26080m39568m71840k93121l68271o13823o6948j49422k20871o68296
2438F27682610m61503k08930l79982j64032m17138j95274j82533m78745o77719j15166
2447.6F24401588L4333m98352n68810r77516p04346l44200J65672R4490l74374n79071
2457.2F20649414p65343N1537j66016l86390m06914m23432l63884p05451l65525m72336
2466.9F16645660j66778l90701m56429l25737p53593j72234l56369n93605n62286k11640
2476.5F12656288n67665o53114L79982j54228n07355q27294p16133n63736o28776j95275
$$ plain form
2486.2 608222694 608186951 608143883 607135773 606520920 605947800 605338173 605180740 604405746 604216652 603837585
2495.8 603837585 603520164 603064041 602396011 602331161 601754723 601254349 600719757 600273323 599742889 599420547
2505.5 599420547 599161453 598331184 597943573 597303734 596761818 596369820 595887833 595524445 595322342 595095139
2515.1 595095139 594372787 594204140 593934898 593371468 592786102 592526665 592412300 591685715 591494827 591344185
2524.7 591344185 591122398 590492592 589679832 589358292 588768997 588379669 588044014 587637291 587040596 586757088
2534.4 586757088 586546173 585966759 585478249 585045052 584920502 584074516 583554268 583490982 583025703 582820015
2544 582820015 582375488 582065048 581507950 580909233 580467453 580168915 580054321 579774399 579655685 579010468
2553.7 579010468 578441048 578021088 577822914 577553635 576963158 576731682 575834351 575416946 575479965 575102997
$$ packed form
2486.2F08222694l5743m3068j008110o14853n73120o09627j57433p74994j89094l79067
2495.8F03837585l17421m56123o68030o4850n76438n00374n34592m46434n30434l22342
2505.5E99420547k59094q30269l87611o39839n41916l91998m81987l63388k02103k27203
2515.1E95095139p22352j68647k69242n63430n85366k59437j14365p26585j90888j50642
2524.7E91344185k21787o29806q12760l21540n89295l89328l35655m06723n96695k83508
2534.4E86757088k10915n79414m88510m33197j24550q45986n20248o3286m65279k05688
2544E82820015m44527l10440n57098n98717m41780k98538j14594k79922j18714o45217
2553.7E79010468n69420m19960j98174k69279n90477k31476q97331m17405O3019l76968
$$ plain form
2563.3 575102997 574662018 574408035 574249458 573655396 573486443 573108788 572514305 571970825 571510887 571402321
2573 571402321 570925674 570498466 569864502 569724464 569586906 568712044 568240929 567865944 567242012 566574402
2582.6 566574402 566420975 565989799 565650864 565829124 565699577 565466270 565001030 564667549 564055824 563648567
2592.2 563648567 563382797 562824516 562435417 562094955 562328110 561803322 561098061 560796928 559846306 558905678
2601.9 558905678 558408508 558575859 558392677 558053627 557652702 557026024 556591454 555946045 555633774 555385704
2611.5 555385704 555125427 554545860 553839417 553605385 553406258 552988358 552056274 551364136 550750351 550192070
2621.2 550192070 549877892 549654655 549469337 548937950 548715363 548314819 547871704 547340851 546474419 546207695
2630.8 546207695 546052628 545597496 544859886 544355812 543980446 543594971 543160744 542525787 542251511 541819229
$$ packed form
2563.3E75102997m40979k53983j58577n94062j68953l77655n94483n43480m59938j08566
2573E71402321m76647m27208o33964j40038j37558q74862m71115l74985o23932o67610
2582.6E66574402j53427m31176l38935J78260j29547k33307m65240l33481o11725m07257
2592.2E63648567k65770n58281l89099l40462K33155n24788p05261l01133r50622r40628
2601.9E58905678m97170J67351j83182l39050m00925o26678m34570o45409l12271k48070
2611.5E55385704k60277n79567p06443k34032j99127m17900r32084o92138o13785n58281
2621.2E50192070l14178k23237j85318n31387k22587m00544m43115n30853q66432k66724
2630.8E46207695j55067m55132p37610n04074l75366l85475m34227o34957k74276m32282
$$ plain form
2640.5 541819229 541220245 540710030 540357666 539770432 538995438 538572502 537968140 537606201 537450905 537082367
2650.1 537082367 536619606 536441383 536240921 535632591 535157433 534596100 534208488 533866501 533737221 533309097
2659.8 533309097 532261353 532016830 531728668 531314354 531276932 531042328 530277481 529491959 529370232 529168167
2669.4 529168167 528898773 528578796 528357506 528101540 527589188 527327805 526964035 526449776 525901184 525823441
2679 525823441 525771103 525239296 524697876 523901939 523266449 523132248 522890320 522435570 522445679 522175064
2688.7 522175064 521669464 521460075 520925560 520731659 520440788 520080872 519900093 519303780 518690720 518414230
2698.3 518414230 518570900 518343697 517896385 517447510 516836472 516244049 515834198 515904083 515623055 515204010
2708 515204010 514909325 514679146 514485550 514195175 514060822 513629951 513408127 513200569 512650909 512348976
$$ packed form
2640.5E41819229n98984n10215l52364n87234p74994m22936o04362l61939j55296l68538
2650.1E37082367m62761j78223k00462o08330m75158n61333l87612l41987j29280m28124
2659.8E33309097j047744k44523k88162m14314l7422k34604p64847p85522j21727k02065
2669.4E29168167k69394l19977k21290k55966n12352k61383l63770n14259n48592p7743
2679E25823441n2338n31807n41420p95937o35490j34201k41928m54750J0109k70615
2688.7E22175064n05600k09389n34515j93901k90871l59916j80779n96313o13060k76490
2698.3E18414230J56670k27203m47312m48875o11038n92423m09851O9885k81028m19045
2708E15204010k94685k30179j93596k90375j34353m30871k21824k07558n49660l01933
$$ plain form
2717.6 512348976 512346802 512040215 511118050 510660706 510717812 510788231 510617065 510432854 510200882 509679070
2727.3 509679070 509501343 509328766 509142456 508892708 508501854 507971687 507691345 507990570 508005905 507884941
2736.9 507884941 507345047 506958427 506930389 506476479 506105309 506004677 506248665 506010933 505856094 506103134
2746.5 506103134 505819168 505454407 505216751 505126038 504914131 504968643 504780235 504145050 503925056 503640289
2756.2 503640289 503297577 502928925 502788239 502661133 502339706 502232513 502204781 501987457 501571655 501401253
2765.8 501401253 501072464 500801353 500526314 500191307 500163193 499859657 499508095 499172554 499031372 498535385
2775.5 498535385 498041000 498009796 497524185 497432632 497307472 496801605 496193695 495579109 495652695 495641060
2785.1 495641060 495067749 494639435 494700012 494344635 493815269 493514786 492875328 492344704 492052727 491524315
$$ packed form
2717.6E12348976k174l06587r22165m57344N7106P0419j71166j84211k31972n21812
2727.3E09679070j77727j72577j86310k49748l90854n30167k80342K99225J5335j20964
2736.9E07884941n39894l86620k8038m53910l71170j00632K43988k37732j54839K47040
2746.5E06103134k83966l64761k37656r0713k11907N4512j88408o35185k19994k84767
2756.2E03640289l42712l68652j40686j27106l21427j07193k7732k17324m15802j70402
2765.8E01401253l28789k71111k75039l35007k8114l03536l51562l35541j41182m95987
2775.5D98535385m94385l1204m85611r1553j25160n05867o07910o14586P3586j1635
2785.1D95641060n73311m28314O0577l55377n29366l00483o39458n30624k91977n28412
$$ plain form
2794.8 491524315 490846291 490645714 490288048 490082817 490080605 489175301 488341599 487831612 487308769 486635780
2804.4 486635780 486194496 485757599 485035286 484776039 484352646 483748856 482945824 482475243 482241325 481607666
2814 481607666 481145058 480264626 479472771 479030380 478585472 477852974 477235489 477059822 476252289 475494957
2823.7 475494957 474756012 474012604 473463669 472833214 471988106 470765572 470251617 469879417 469373627
2832.4 469373627 468752899 467927513 467130051 465976372 465097466 464132462 463109779 461847343 460476456
2841.1 460476456 459560890 458075371 456299667 454764099 453465652 451886673 450236702 448813133
2848.8 448813133 447020187 445069351 443476448 442615166 441770515 441247368 441038589 440650177 440577507
2857.4 440577507 440702667 441045914 440912247 440665359 440639992 440327759 439868240 439533386 439439583 438868484
$$ packed form
2794.8D91524315o78024k00577l57666k05231k212r05304q33702n09987n22843o72989
2804.4D86635780m41284m36897p22313k59247m23393o03790q03032m70581k33918o33659
2814D81607666m62608q80432p91855m42391m44908p32498o17485j75667q07533p57332
2823.7D75494957p38945p43408n48935o30455q45108j222534n13955l72200n05790
2832.4D69373627o20728q25386p97462j153679q78906r65004j022683j262436j370887
2841.1D60476456r15566j485519j775704j535568j298447j578979j649971j423569
2848.8D48813133j792946j950836j592903q61282q44651n23147k08779l88412p2670
2857.4D40577507J25160L43247j33667k46888k5367l12233m59519l34854r3803n71099
$$ plain form
2867.1 438868484 438027496 437101021 436521416 435990067 435210609 434972115 434536171 434049110 433334808 432848892
2876.7 432848892 432707367 432073135 431789055 431198463 430342674 429813156 429405174 428728218 427807579 427370720
2886.4 427370720 426681290 425746498 425137138 424753685 424144821 423361588 422516022 421509476 420895805
2895.1 420895805 420177650 419475021 418983231 418551140 417879906 416923294 416525879 416118050 415823822 415272064
2904.7 415272064 414328575 413670616 412804718 412133827 411345177 410651512 410140381 409019661 407762451
2913.4 407762451 406479492 405379143 404543686 403342209 401916008 401030159 400244789 399531250 399491234
2922.1 399491234 399313126 398720436 398086090 397773552 397658844 397551308 397776222 397975616 397918167 398160782
2931.7 398160782 398726387 398781738 398622513 399019661 399751282 400391159 401062393 401709785 402199974 402988739
$$ packed form
2867.1D38868484q40988r26475n79605n31349p79458k38494m35944m87061p14302m85916
2876.7D32848892j41525o34232k84080n90592q55789n29518m07982o76956r20639m36859
2886.4D27370720o89430r34792o09360l83453o08864p83233q45566j006546o13671
2895.1D20895805p18155p02629m91790m32091o71234r56612l97415m07829k94228n51758
2904.7D15272064r43489o57959q65898o70891p88650o93665n11131j120720j257210
2913.4D07762451j282959j100349q35457j201477j426201q85849p85370p13539m0016
2922.1C99491234j78108n92690o34346l12538j14708j07536K24914J99394n7449K42615
2931.7C98160782N65605N5351j59225L97148P31621O39877O71234O47392M90189P88765
$$ plain form
2941.3 402988739 403601074 403950577 404430237 405039482 405526276 405592728 405837364 406304131 407022552 407684708
2951 407684708 408263931 408630333 408450279 408766785 409042587 409486809 410247536 410628891 410932350 410870590
2960.6 410870590 411332016 412137032 412532234 413045120 413589325 413888779 414328308 415108681 415623207 416172638
2970.3 416172638 417085953 418170509 418670654 418984642 419866714 420135117 420206337 420549660 421114922 421589355
2979.9 421589355 421435699 421580811 422082481 422462997 422633095 422902184 422960472 422821045 423059196 423195763
2989.6 423195763 423363342 423595505 423711510 423661842 423416748 423009186 422865334 423056526 422888260 422669716
2999.2 422669716 422323914 421948967 421431274 421042824 421248970 420811729 420272064 420114174 419836578 419490395
3008.8 419490395 419332962 419225388 418433533 417553635 417207413 417028465 416404266 415988655 415920563 415650253
$$ packed form
2941.3D02988739O12335L49503M79660O09245M86794O6452K44636M66767P18421O62156
2951D07684708N79223L66402j80054L16506K75802M44222P60727L81355L03459o1760
2960.6D10870590M61426Q05016L95202N12886N44205K99454M39529P80373N14526N49431
2970.3D16172638R13315J084556N00145L13988Q82072K68403P1220L43323N65262M74433
2979.9D21589355j53656J45112N01670L80516J70098K69089N8288j39427K38151J36567
2989.6D23195763J67579K32163J16005m9668k45094m07562j43852J91192j68266k18544
2999.2D22669716l45802l74947n17693l88450K06146m37241n39665j57890k77596l46183
3008.8D19490395j57433j07574p91855q79898l46222j78948o24199m15611o8092k70310
$$ plain form
3018.5 415650253 415402374 414684753 414093742 413719559 413479538 413071480 411860123 411051636 410696411
3027.2 410696411 410344582 409810715 409553566 409158249 408247223 408197517 407872925 407016487 406376610 405810776
3036.8 405810776 405344772 404727707 404461479 404423676 403859596 402694397 401840210 401303864 400793190 400645599
3046.5 400645599 400054207 399185219 398669395 398282356 397741241 396900711 396255646 396058006 395451622 394433403
3056.1 394433403 394087448 393784065 393026733 392275963 391784592 391495934 390908813 390020370 389334908 389332542
3065.7 389332542 389401894 389081917 388385773 387693825 387349663 386577187 385757103 385446205 385540085 385359383
3075.4 385359383 384487152 383690567 383116455 382861557 382384682 381712074 381572533 381575432 381151428 380222130
3085 380222130 379331093 378827820 378618393 377945290 377237778 376941872 376571846 376386490 375818863 375240746
$$ packed form
3018.5D15650253k47879p17621n91011l74183k40021m08058j211357q08487l55225
3027.2D10696411l51829n33867k57149l95317r11026m9706l24592q56438o39877n65834
3036.8D05810776m66004o17065k66228l7803n64080j165199q54187n36346n10674j47591
3046.5D00645599n91392q68988n15824l87039n41115q40530o45065j97640o06384j018219
3056.1C94433403l45955l03383p57332p50770m91371k88658n87121q88443o85462k366
3065.7C89332542O9352l19977o96144o91948l44162p72476q20084l10898R3880j80702
3075.4C85359383q72231p96585n74112k54898m76875o72608j39541K899m24004r29298
3085C80222130q91037n03273k09427o73103p07512k95906l70026j85356n67627n78117
$$ plain form
3094.7 375240746 374972610 374540901 374125938 373763809 373387527 372551727 371858368 371419144 370832329 370484352
3104.3 370484352 370152893 369557076 369175415 369057579 368367233 367825508 367436028 366748123 366411476 366170273
3114 366170273 365659714 364544106 363856697 363728065 363347092 363057213 362874718 362637520 361802940 361064377
3123.6 361064377 360430183 359547462 359048805 358453178 358013763 357679863 357122688 356679459 356159859 355428619
3133.3 355428619 354903717 354754715 354479256 353863182 353326912 353085632 352588654 352044029 351411781 350461197
3142.9 350461197 349459801 348647270 348561325 348141174 347733841 347530670 346746826 346325760 345979309 345679512
3152.5 345679512 344897423 343888359 343644638 343405647 342568588 341324501 341144638 341245995 340829163
3161.2 340829163 340299568 339478874 338690109 337639198 337228699 337066727 336467552 335873909 335340614
$$ packed form
3094.7C75240746k68136m31709m14963l62129l76282q35800o93359m39224n86815l47977
3104.3C70484352l31459n95817l81661j17836o90346n41725l89480o87905l36647k41203
3114C66170273n10559j115608o87409j28632l80973k89879j82495k37198q34580p38563
3123.6C61064377o34194q82721m98657n95627m39415l33900n57175m43229n19600p31240
3133.3C55428619n24902j49002k75459o16074n36270k41280m96978n44625o32248r50584
3142.9C50461197j001396q12531q5945m20151m07333k03171p83844m21066l46451k99797
3152.5C45679512p82089j009064k43721k38991q37059j244087j79863J01357m16832
3161.2C40829163n29595q20694p88765j050911m10499j61972n99175n93643n33295
$$ plain form
3169.9 335340614 335166397 334514313 333741570 333163986 332711830 332394485 331606216 330648766 329979248 330081520
3179.5 330081520 329844284 328944893 328399849 327904396 327407150 327094727 326431541 325244331 324595032
3188.2 324595032 324244919 323645287 323228989 322903671 322518768 321881981 321414719 320945473 320246239 319668846
3197.9 319668846 319170818 318859692 318641872 318267651 317664757 317546043 317678757 317094555 315876923
3206.5 315876923 314842072 314493904 314174423 313802624 313345718 313007851 312955589 312674770 312168522 311527233
3216.2 311527233 310961037 310580578 310628338 310236835 309530582 309353962 308889790 308295727 307352142 306754189
3225.8 306754189 306739254 306362934 306073322 305667877 305325356 305039463 304633026 303812485 303045368 303078976
3235.5 303078976 302740936 302007217 301326122 301052475 301082287 300962009 300713978 300091591 299786243 299796543
$$ packed form
3169.9C35340614j74217o52084p72743n77584m52156l17345p88269r57450o69518J02272
3179.5C30081520k37236q99391n45044m95453m97246l12423o63186j187210o49299
3188.2C24595032l50113n99632m16298l25318l84903o36787m67262m69246o99234n77393
3197.9C19668846m98028l11126k17820l74221o02894j18714J32714n84202j217632
3206.5C15876923j034851l48168l19481l71799m56906l37867n2262k80819n06248o41289
3216.2C11527233n66196l80459M7760l91503p06253j76620m64172n94063r43585n97953
3225.8C06754189j4935l76320k89612m05445l42521k85893m06437q20541p67117L3608
3235.5C03078976l38040p33719o81095k73647K9812j20278k48031o22387l05348J0300
$$ plain form
3245.1 299796543 299664345 298987255 298089161 297835178 297670937 297122288 296306515 296094131 296141930 295587044
3254.8 295587044 295305004 295317783 295045033 294857674 294465256 293431358 292983379 292923603 292621098 292423553
3264.4 292423553 291938858 291356392 290860977 290528908 290400753 290537186 290527916 290111485 289580231 288962727
3274 288962727 289183578 289172344 288177681 287454414 287338390 287524567 287046700 286494694 286225166 285895290
3283.7 285895290 285537701 285057278 284940071 284677505 284415112 284485378 284444008 284357567 284146614 283734112
3293.3 283734112 283295479 283054085 282668800 282219906 281951122 281723518 281415348 281150990 281133900 280935688
3303 280935688 280696106 280289993 279742489 279448490 279128914 278899803 278797970 278480015 277719364 277127438
3312.6 277127438 276859417 276679020 276358147 275567379 275037441 274683075 274416466 274180317 273901215 273853397
$$ packed form
3245.1B99796543j32198o77090q98094k53983j64241n48649q15773k12384M7799n54886
3254.8B95587044k82040J2779k72750j87359l92418j033898m47979n9776l02505j97545
3264.4B92423553m84695n82466m95415l32069j28155J36433r270m16431n31254o17504
3274B88962727K20851j1234r94663p23267j16024J86177m77867n52006k69528l29876
3283.7B85895290l57589m80423j17207k62566k62393P0266m1370q6441k10953m12502
3293.3B83734112m38633k41394l85285m48894k68784k27604l08170k64358j7090j98212
3303B80935688k39582m06113n47504k93999l19576k29111j01833l17955p60651n91926
3312.6B77127438k68021j80397l20873p90768n29938l54366k66609k36149k79102m7818
$$ plain form
3322.3 273853397 273489666 273263168 273206158 272517204 271289997 270956078 271546898 271044712 269927101
3330.9 269927101 269376659 269159184 268538475 267583046 267031441 266703186 266497021 265949516 265171661 264636917
3340.6 264636917 264294243 264284496 264141235 263505363 262679272 261842842 261127834 260881901 260543365 260072002
3350.2 260072002 260246563 260256329 259536171 258877506 258612747 257989922 257513847 257738819 257637215 257145100
3359.9 257145100 256802254 256823368 256639175 256546898 256652603 255983925 255251179 254809647 254779377 254769478
3369.5 254769478 254291592 254027309 253677254 253388081 253403091 253199883 252648544 252162342 251864700 251895332
3379.2 251895332 252650757 252691536 251773338 251246796 251135616 251402931 251259880 250450993 250178852 250468826
3388.8 250468826 250672112 250594959 250295067 249855576 249339314 249183674 249390869 249487762 249385967 249197922
$$ packed form
3322.3B73853397l63731k26498n7010o88954j227207l33919N90820n02186j117611
3330.9B69927101n50442k17475o20709r55429n51605l28255k06165n47505p77855n34744
3340.6B64636917l42674r747j43261o35872q26091q36430p15008k45933l38536m71363
3350.2B60072002J74561R766p20158o58665k64759o22825m76075K24972j01604m92115
3359.9B57145100l42846K1114j84193r2277J05705o68678p32746m41532l0270r899
3369.5B54769478m77886k64283l50055k89173J5010k03208n51339m86202k97642L0632
3379.2B51895332P55425M0779r18198n26542j11180K67315j43051q08887k72141K89974
3388.8B50468826K03286p7153k99892m39491n16262j55640K07195R6893j01795j88045
$$ plain form
3398.4 249197922 248929653 248660374 248664799 248690720 248491802 248072548 247839527 248430634 248902664 248656025
3408.1 248656025 248243237 248250179 248469753 248059254 247610130 247275448 247297134 247900906 248140755 248380527
3417.7 248380527 248873119 249097080 248747711 248340950 248437443 248588867 248522549 248314075 248491344 249076462
3427.4 249076462 249313774 249333916 249860916 250220165 250181923 250475750 250498600 250439034 250643482 250781708
3437 250781708 250540333 250649033 251738777 252290459 252537880 252463570 251950264 252256870 252728939 253126297
3446.7 253126297 253471260 253930397 254297123 254621391 255238762 255267124 255598278 256241951 256485386 256649818
3456.3 256649818 256730595 257542229 258354836 258472919 258772621 259342918 260037479 260582314 260789337 261037292
3466 261037292 261660728 262174721 262259007 262564487 262999363 263183537 263791866 264943237 266110954 266404266
$$ packed form
3398.4B49197922k68269k69279M425K5921j98918m19254k33021N91107M72030k46639
3408.1B48656025m12788O942K19574m10499m49124l34682K1686O03772K39849K39772
3417.7B48380527M92592K23961l49369m06761R6493J51424o6318k08474J77269N85118
3427.4B49076462K37312K0142N27000L59249l8242K93827K2850n9566K04448J38226
3437B50781708k41375J08700J089744N51682K47421p4310n13306L06606M72069L97358
3446.7B53126297L44963M59137L66726L24268O17371K8362L31154O43673K43435J64432
3456.3B56649818Q0777Q11634Q12607J18083K99702N70297O94561N44835K07023K47955
3466B61037292O23436N13993Q4286L05480M34876J84174O08329J151371J167717K93312
$$ plain form
3475.6 266404266 266052589 266608372 267555294 268140411 268673820 269265785 269548740 270004597 271556969
3484.3 271556969 272171917 271835136 272513123 273185062 273549938 274019566 274408073 275062447 276097603
3493 276097603 276775532 277137909 277765961 278451824 279114838 279544888 280014896 280570030 281442394 282393093
3502.6 282393093 282371998 282801151 283973427 284719334 284977245 285786877 286770363 287111454 287785282 288529491
3512.2 288529491 289759140 290699825 291027718 291713963 292233009 293044586 293519211 294079762 295434322
3520.9 295434322 296177597 296738796 297773762 298726902 299132481 299145546 299657898 300907841 302150021
3529.6 302150021 303478699 304383259 304861279 306136723 307613411 308722496 308631821 308826313 310315018
3538.3 310315018 311200256 311886959 312393646 313549290 315392513 317207451 318008289 317924156 319424915
$$ packed form
3475.6B66404266l51677N55783R46922N85117N33409N91965K82955M55857J552372
3484.3B71556969O14948l36781O77987O71939L64876M69628L88507O54374J035156
3493B76097603O77929L62377O28052O85863O63014M30050M70008N55134Q72364R50699
3502.6B82393093k1095M29153J172276P45907K57911Q09632R83486L41091O73828P44209
3512.2B88529491J229649R40685L27893O86245N19046Q11577M74625N60551J354560
3520.9B95434322P43275N61199J034966R53140M05579J3065N12352J249943J242180
3529.6C02150021J328678R04560M78020J275444J476688J109085r0675J94492J488705
3538.3C10315018Q85238O86703N06687J155644J843223J814938Q00838q4133J500759
$$ plain form
3547 319424915 319747772 320440331 322117653 323194923 324240074 324599876 325944557 326787720 327967834
3555.6 327967834 329848862 330995636 332761154 333953934 334564934 334814796 335935135 337259178 338473053
3564.3 338473053 341097794 341552963 342383652 343478813 344219475 346762962 348349419 349582405 350649109
3573 350649109 351781311 352838211 354365005 356214561 357498627 359541969 360655746 361727219 363574791
3581.7 363574791 364960442 365897675 367678833 371046219 371705933 371285744 373219337 374298897 376684685
3590.4 376684685 379230537 381643257 382383347 383607674 386605568 386781006 388737793 391235275 392272568
3599 392272568 395179176 396421013 397191391 399597855 401715279 404019966 406019516 407192116 407696800
3607.7 407696800 410248833 410911713 412532387 418072090 418757858 418660049 422634850 423270531 426932983
$$ packed form
3547C19424915L22857O92559J677322J077270J045151L59802J344681Q43163J180114
3555.6C27967834J881028J146774J765518J192780O11000K49862J120339J324043J213875
3564.3C38473053K624741M55169Q30689J095161P40662K543487J586457J232986J066704
3573C50649109J132202J056900J526794J849556J284066K043342J113777J071473J847572
3581.7C63574791J385651R37233J781158L367386O59714m20189J933593J079560K385788
3590.4C76684685K545852K412720P40090J224327K997894J75438J956787K497482J037293
3599C92272568K906608J241837P70378K406464K117424K304687J999550J172600N04684
3607.7D07696800K552033O62880J620674N539703O85768r7809L974801O35681L662452
$$ plain form
3616.4 426932983 430306625 430544930 432247276 433228340 435444603 438382149 440598946 442377090 444854736
3625.1 444854736 447510757 450916214 456616669 456635475 451672173 456361694 460990257 464757347 466395950
3633.8 466395950 467419624 470276413 473560143 476292496 477960205 480534592 483695107 486458321
3641.5 486458321 488371201 489879532 492531815 495811577 499757156 499818115 499685402 504689217 505931015
3650.1 505931015 506748962 509021797 513918533 517859917 521516800 526416550 523598213 526235542
3657.9 526235542 530455437 532411156 535272789 537174301 539956894 541196442 543170471 545502052
3665.6 545502052 546689262 551632156 554385948 553892937 553813171 550886841 555623589 562987823 570320587
3674.3 570320587 569425354 556336632 560724144 568647041 573092194 571269493 572117538 575129089
$$ packed form
3616.4D26932983L373642K38305J702346R81064K216263K937546K216797J778144K477646
3625.1D44854736K656021L405457N700455J8806m963302M689521M628563L767090J638603
3633.8D66395950J023674K856789L283730K732353J667709K574387L160515K763214
3641.5D86458321J912880J508331K652283L279762L945579O0959j32713N003815J241798
3650.1E05931015Q17947K272835M896736L941384L656883M899750k818337K637329
3657.9E26235542M219895J955719K861633J901512K782593J239548J974029K331581
3665.6E45502052J187210M942894K753792m93011p9766k926330M736748P364234P332764
3674.3E70320587q95233j3088722M387512P922897M445153j822701Q48045L011551
$$ plain form
3682 575129089 577493095 579524879 580350609 580176048 583377991 589700050 583266754 581860657 588817177
3690.6 588817177 584145699 585563545 590615578 591140289 592566147 593326569 593436470 595065041 595731850
3699.3 595731850 597774124 600104561 596478500 596222267 600212288 601280136 601721611 602761459 605241585
3708 605241585 607704315 602325172 606827469 610644798 599382248 602948151 606465874 607047729 608191185
3716.7 608191185 610463676 611891975 609048157 610656662 616043739 612523308 608946190 613881378
3724.4 613881378 614518852 612966805 610861244 611134338 614048805 615347366 620400352 617448425 611618347
3733.1 611618347 619954414 620554008 614201355 615390396 617178688 617195206 618752060 620510941 617009125
3741.8 617009125 620569305 629661560 617384491 605923996 615371513 620806847 625304108 621465988
$$ packed form
3682E75129089K364006K031784Q25730j74561L201943O322059o433296j406097O956520
3690.6E88817177m671478J417846N052033N24711J425858P60422J09901J628571O66809
3699.3E95731850K042274K330437l626061k56233L990021J067848M41475J039848K480126
3708F05241585K462730n379143M502297L817329j1262550L565903L517723N81855J143456
3716.7F08191185K272491J428299k843818J608505N387077l520431l577118M935188
3724.4F13881378O37474j552047k105561K73094K914467J298561N052986k951927n830078
3733.1F11618347Q336067N99594o352653J189041J788292J6518J556854J758881l501816
3741.8F17009125L560180R092255j2277069j1460495R447517N435334M497261l838120
$$ plain form
3749.5 621465988 613756409 624222221 621717491 616409683 621240730 624187431 626374817 622320404
3757.2 622320404 624778633 629786186 622585373 621331139 624853706 625694847 626244659 629318161 625964508
3765.9 625964508 621871147 626240730 631030693 630145607 622176743 624645042 628072586 628529205 629231262
3774.5 629231262 628939095 629773293 630372276 632295494 630022926 623429031 627207603 629683533 630638313
3783.2 630638313 632249603 630154877 629104881 629809456 631173058 631732063 631063461 630819054 630346642
3791.9 630346642 631231117 631864891 632397728 634630013 631598778 628599358 630943146 634152031 639145470
3800.6 639145470 633970070 624285202 627413406 630393829 635041466 639258728 630046883 626379242
3808.3 626379242 630978432 633446083 633659935 633238068 632961464 635040627 639863548 637219467 625862045
$$ packed form
3749.5F21465988p709579J0465812k504730n307808M831047K946701K187386m054413
3757.2F22320404K458229N007553p200813j254234L522567Q41141N49812L073502l353653
3765.9F25964508m093361M369583M789963q85086p968864K468299L427544M56619P02057
3774.5F29231262k92167Q34198N98983J923218k272568o593895L778572K475930R54780
3783.2F30638313J611290k094726j049996P04575J363602N59005o68602k44407m72412
3791.9F30346642Q84475O33774N32837K232285l031235k999420K343788L208885M993439
3800.6F39145470n175400r684868L128204K980423M647637M217262r211845l667641
3808.3F26379242M599190K467651K13852m21867k76604K079163M822921k644081j1357422
$$ plain form
3817 625862045 630114212 634820633 638898697 640976715 625842819 627228432 631842651 633975143
3824.7 633975143 636077995 634362755 630746956 631865540 634367638 637508202 638489952 631665878
3832.4 631665878 633469009 638894958 633543816 633115921 639233437 632585754 631711388 637477722 632050896
3841.1 632050896 632477226 637157707 633522835 631423798 634489021 635196190 635026665 636444359 635663185
3849.8 635663185 637506256 642075195 636301422 636237297 624459991 627255974 636522331 634840660
3857.5 634840660 633377724 635621796 637390938 639421120 634859810 635046349 639116058 632337570
3865.2 632337570 629558220 633907433 638178215 641939240 634215012 627856827 632188797 637619324
3872.9 637619324 639481239 630980797 631907578 634612045 634074402 636601448 640573807 634952469 628912239
$$ packed form
3817F25862045M252167M706421M078064K078018j5133896J385613M614219K132492
3824.7F33975143K102852j715240l615799J118584K502098L140564R81750o824074
3832.4F31665878J803131N425949n351142m27895O117516o647683q74366N766334n426826
3841.1F32050896M26330M680481l634872k099037L065223P07169j69525J417694p81174
3849.8F35663185J843071M568939n773773o4125j1777306K795983R266357j681671
3857.5F34840660j462936K244072J769142K030182m561310J86539M069709o778488
3865.2F32337570k779350M349213M270782L761025p724228o358185M331970N430527
3872.9F37619324J861915q500442R26781K704467n37643K527046L972359n621338o040230
$$ plain form
3881.6 628912239 633756180 634709930 636071701 639596596 629626198 631358337 634983292 636191559
3889.3 636191559 639577637 637554779 630880165 631719475 633438492 632492218 634249802 635571938 637165298
3898 637165298 638176880 631502266 635935631 635861015 630973473 635060043 632570648 632465820 632446289
3906.7 632446289 632478294 634137268 633485718 633285561 632882042 633081207 633677979 634203186 635677147
3915.3 635677147 636603622 632915688 630892754 635066147 633556366 629960251 632344093 633470421
3923.1 633470421 634307518 632880058 630752602 631939430 633143425 634004173 633248901 633969269 635586243
3931.7 635586243 633006973 631897774 632555008 632361259 632515945 632581558 632243805 631723671 631690063 633129768
3941.4 633129768 633622322 630278931 629715118 630862274 631421280 632586060 631440926 631234322 630908813
$$ packed form
3881.6F28912239M843941R53750J361771L524895r970398J732139L624955J208267
3889.3F36191559L386078k022858o674614Q39310J719017r46274J757584J322136J593360
3898F37165298J011582o674614M433365p4616m887542M086570k489395j04828j9531
3906.7F32446289L2005J658974o51550k00157m03519J99165N96772N25207J473961
3915.3F35677147R26475l687934k022934M173393j509781l596115K383842J126328
3923.1F33470421Q37097j427460k127456J186828J203995Q60748p55272P20368J616974
3931.7F35586243k579270j109199O57234j93749J54686O5613l37753n20134l3608J439705
3941.4F33129768M92554l343391n63813J147156N59006J164780j145134k06604l25509
$$ plain form
3950.1 630908813 629945450 631808205 631592751 630955353 631668320 632231483 632541962 631866646 631602516
3958.7 631602516 631030426 631621132 631639748 629783478 630267792 631115036 631249237 631272011 631000290 631208115
3968.4 631208115 631278076 630959244 630910797 630258980 629379539 629582062 630525208 631333504 630326843 629948044
3978 629948044 631221123 631375809 630853729 630331535 630041237 630042839 630501747 630706673 630473900 630641060
3987.7 630641060 630787201 630834656 630313263 630355072 630166435 630061607 630782547 630081062 630219841 630914764
3997.3 630914764 630747223 630643845 630784569
4000.2 630784569
$$ packed form
3950.1F30908813r63363J862755k15454o37398P12967N63163L10479o75316k64130
3958.7F31602516n72090N90706J8616j856270M84314Q47244J34201K2774k71721K07825
3968.4F31208115O9961l18832m8447o51817q79441K02523R43146Q08296j006661l78799
3978F29948044J273079J54686n22080n22194k90298J602M58908K04926k32773J67160
3987.7F30641060J46141M7455n21393M1809j88637j04828P20940p01485J38779O94923
3997.3F30914764j67541j03378J40724
4000.2F30784569
##END=$$ End of the data block
