##TITLE=$$ Begin of the data block
##JCAMP-DX=5.00 $$ ACD/SpecManager v 10.08
##SPECTROMETER/DATA SYSTEM=Varian
##DATE=15 Jan 2013 15:17:58
##DATA TYPE=INFRARED SPECTRUM
##DATA CLASS=XYDATA
##ORIGIN=
##OWNER=
##NPOINTS=3735
##FIRSTX=399.26403809
##LASTX=4000.35498047
##MAXX=4000.35498047
##MINX=399.26403809
##MAXY=74.15750885
##MINY=33.06631088
##XFACTOR=1.0000000000
##YFACTOR=0.000000100000000
##FIRSTY=50.51415634
##DELTAX=0.96440572
##XUNITS=1/CM
##YUNITS=TRANSMITTANCE
##XYDATA=(X++(Y..Y))
399.3 505141563 514809113 507409363 510646744 514140053 520500641 520995178 521800995 519231339 509580231
407.9 509580231 511918144 514653816 510298767 503159447 501306190 500864792 506888580 516604652 514093170
416.6 514093170 510652504 503068390 518099442 522745972 512212830 509747734 507651749 511713753
424.3 511713753 513143692 509487534 510797806 510206909 509018250 506441078 503791733 503936424 504056587
433 504056587 504697990 509297447 511840210 510092735 510401497 511554794 513668785 511302299 510884590
441.7 510884590 514705315 513930359 515677681 514205208 509635201 509193420 512663612 514648781 513144035
450.4 513144035 510917625 506717186 503806953 504894257 511840248 519062538 514712029 504578743
458.1 504578743 508346901 508534889 501660042 499914169 501845856 508452606 514272270 511055870 508019524
466.8 508019524 505184402 506817741 507731247 502759132 499103584 497400093 500313339 501891556 502109451
475.5 502109451 505419655 509667130 509867859 506054649 501788750 500174294 500312843 498401604 494008751
484.1 494008751 491442986 498077011 505639381 505020103 502851562 497705421 492551613 490180511 490280571
492.8 490280571 491390572 493807335 500183792 504724998 503989906 500563850 500805359 501919174 497679138
501.5 497679138 494347916 495550766 493865967 491442642 494943504 497452087 497673607 499585762 497012749
510.2 497012749 494071922 492484436 490895691 490469475 490844383 492440529 493827705 493461647 490814781
518.9 490814781 488533020 488718643 489593239 489629784 489598007 489476280 487830048 487695045 489187584 491223297
528.5 491223297 490472488 488206673 488340340 486055641 484912300 485828323 484706497 484860611 487833900
537.2 487833900 491001701 490266151 488363647 486918716 485007553 484406662 484408913 483652382 481355019
545.9 481355019 482227364 486248360 488455696 488107491 485149269 483445282 481455803 478321266 478143768
554.5 478143768 479157867 480122032 481200790 482707520 483195763 482276878 482203712 480735855 477564659
563.2 477564659 476817741 477605743 476647110 476682053 479259605 481708031 483298874 482300949 479763451
571.9 479763451 478052139 476171608 473786278 472850838 474742966 476561775 477698174 478181953 478215446
580.6 478215446 477470779 476249733 476098289 474960442 474065399 475012894 476832123 479067268 479458694
589.3 479458694 480078888 481749001 481506882 480177460 478548088 476416245 476243477 478606339 480226173
597.9 480226173 481059570 482511330 484017563 484391708 482148628 479346581 476890907 475180969 476142693
606.6 476142693 477683907 478308601 478513374 479116631 479705238 479159050 477962761 475844650 473627052
615.3 473627052 473476753 475102539 476789894 478320618 479319000 479747467 479901352 479442749 478511696
624 478511696 477503929 477520638 477825928 478905449 482076149 484480019 485780640 486866264 487410698
632.7 487410698 487734146 487566032 487741356 487582779 487555389 489527435 493017273 496093864 496541557
641.3 496541557 495705376 495028877 494717255 494652252 493784370 493102798 494957047 498219719 500563202
650 500563202 502867928 504277763 503838005 502706833 501241837 498840027 496303825 497716370 500830688
658.7 500830688 502488785 503435249 503166618 502992668 503108253 501951218 499775581 498793297 498052101
667.4 498052101 497854271 499556274 500629883 503581505 506012344 506816597 506601181 505835152 505166740
676.1 505166740 503952446 504075432 504414711 504878273 507259140 510660744 514670868 516426926 515370674
684.7 515370674 513843956 512063065 510889511 512007866 512947006 513184662 515645943 518558693 520036812
693.4 520036812 520054893 519182663 517401695 515078125 514099083 514356880 515344582 517211342 519758377
702.1 519758377 521972504 523409843 524013939 523845329 522462196 520304260 520451050 521188889 521935158
710.8 521935158 523716431 525646782 528627396 530133095 529239197 528180199 527531548 526106377 525433731
719.5 525433731 527012634 529147720 531458778 532163010 533454094 534960976 533834381 533204651 532359200
728.1 532359200 531324081 531484871 533278351 535305939 536635933 539124413 541001205 541753845 540591354
736.8 540591354 538009148 536096382 535128365 535956802 537551384 539208641 540721054 542483521 544163094
745.5 544163094 544102135 543183823 542551956 541844864 540808258 540360680 541580772 544452477 546824760
754.2 546824760 548768349 550540314 550359497 549029083 547147942 545988350 545858612 546829071 549088135
762.8 549088135 551278572 553519859 555776482 557195587 556201630 554161758 552595253 551834221 552151566
771.5 552151566 552100525 552225304 553220749 555645065 557382278 557354698 557138176 556202240 554948273 553252106
781.2 553252106 552549171 552908249 553686943 555072784 556838150 559339905 560720444 560871201 559469223
789.9 559469223 557936516 557505150 556932068 556352081 556151085 557672005 559524918 561120987 560745125
798.5 560745125 558553810 556509895 553595009 552171707 550385666 548612900 548938522 549325790 549248619
807.2 549248619 548030319 546425133 544695244 543090057 541033897 539057312 537571411 536530266
814.9 536530266 536886787 536615028 536623726 536615410 535468102 534869270 534626541 534232521 534271317 535714798
824.6 535714798 537514992 540196724 542924614 545021133 547430763 548518715 549862823 551731033
832.3 551731033 553761139 555493240 557531242 560578880 563126335 566495819 568966293 570814896
840 570814896 572347870 572851219 573287582 573464394 574841347 576936493 579844398 582451286 584794312
848.7 584794312 586511307 586680412 587324600 587138710 586565132 586856651 589011955 591522827 594564667
857.4 594564667 597903328 598475914 599580460 600679169 600512810 598938179 597925491 598953934 599508438
866 599508438 600828972 602008057 603022270 603286285 602929878 601612396 599013596 597762756 595802612
874.7 595802612 594586906 594542923 594841919 595920601 596502914 596436081 595539093 594947357 593330460 591869049
884.4 591869049 591179695 590349426 590665054 591397629 592075500 591987686 591938629 591706276 591142311 589760132
894 589760132 588078003 588178558 588236465 588754921 589381752 589243202 589215851 589701004 589800720 589031639
903.7 589031639 589017830 588853035 589639053 590771904 592004547 594051247 595236244 596368523 596213112
912.3 596213112 595113258 593536491 592371254 591455650 589668884 588662949 587570038 585906219 583310966
921 583310966 582038231 581408157 579117470 576112900 572103081 569537430 567950287 566271019 564871216
929.7 564871216 563816795 562927055 561443825 560483360 559033661 557476921 556205559 555051308 554389381
938.4 554389381 554128990 554330215 553716507 553159142 552321625 551074295 549447517 548065758 547633667
947.1 547633667 546282883 545568047 545160980 544815063 544442444 544201126 545208931 544406662 542345886
955.7 542345886 539932632 537966003 536574059 535221405 534664650 532521248 530935478 530641365 529072876
964.4 529072876 527282791 525558243 524168396 522390518 519731178 517939911 516942940 515341721 513427238
973.1 513427238 511750183 509743958 507303200 505119209 502458839 498841553 495734291 493066940
980.8 493066940 489978447 486103973 482543983 479789543 476014214 471583290 467970581 464775314
988.5 464775314 461324615 457948227 454637833 451493797 448547630 445208969 441785011 438934402
996.2 438934402 435967369 433062172 430721169 428097191 426457405 425109558 423082962 421507874
1004 421507874 420298843 418935623 416591568 415063095 414435120 413204727 411915588 411408806 411224251
1012.6 411224251 409776382 408115807 406192131 403722038 401157494 398604813 396501045 394628258
1020.3 394628258 393316269 391866455 391093025 389835052 387374344 385337105 383391647 381369400
1028.1 381369400 378883743 377788773 377374496 377032661 377046089 376711349 376763687 376344910 376325951 376714134
1037.7 376714134 377962646 378864403 379506989 380941582 381438026 382940445 383714943 383589706 383875961
1046.4 383875961 383390465 382387161 381417465 381509972 381370697 380976944 379984894 380159340 380853577 380024872
1056 380024872 379998093 379776917 380472145 381053619 381717072 383199043 384255333 386668053 388919029
1064.7 388919029 391473007 393983421 395838547 397636070 398897476 399828568 401028557 402917404
1072.4 402917404 403835716 404255943 404357834 405166092 406650620 406930504 407066269 407686539 409376488
1081.1 409376488 410075951 410323029 411504478 412571449 413617439 414566383 416497002 417338791 417023964
1089.8 417023964 417628822 418993073 420143509 420602112 422175102 423907509 424903145 425755806 427049522
1098.5 427049522 428448715 429264488 429655876 429906807 430948372 431375465 431928406 433872452 435989647
1107.1 435989647 437452698 437907333 437962456 437722321 438282928 439143867 439713860 440177689 440642700 441999664
1116.8 441999664 442778549 443205490 443084602 442522430 442466736 442241364 442284126 441879768 442091331 443352814
1126.4 443352814 444258461 444829369 445657082 447562027 449437065 450588417 451364212 452318802 454007912
1135.1 454007912 456328964 458008766 459076958 461021767 462844810 463892555 465033379 466035194
1142.8 466035194 465775108 465372314 465706139 465709763 466072273 467141037 468497429 469453850 469399567 468769608
1152.5 468769608 467777977 467007103 466375656 465381584 464607964 464421577 464224586 463584671 462989464 462372131
1162.1 462372131 462128105 462716255 463513985 463752708 464107018 465911903 468240166 470300903 472174187
1170.8 472174187 473893623 475522499 477292595 478951187 480830841 483515015 485825653 487466774
1178.5 487466774 488998833 490882645 493616829 496226578 497466278 498601303 499648705 499959373
1186.2 499959373 500638657 501505432 502680779 503681259 504020309 504145355 503934975 503276482 502752762
1194.9 502752762 502265816 500944061 499921494 499099655 498353004 498076591 497135773 496000023 495449028
1203.6 495449028 494579010 492781258 491372871 490585937 490182037 490622330 491008682 490914612 490403175
1212.3 490403175 489833450 489772491 490060768 489935112 489107094 488607063 488597527 489116287 489963989 490278969
1221.9 490278969 490388756 490586319 490493965 489871521 489215469 488785591 488279114 487239189 486441193 486542816
1231.5 486542816 486457748 486088600 485796585 485537415 484967308 484250641 484064217 483573570 482781944 482572250
1241.2 482572250 482658272 482432137 481920929 481521111 481066132 480682411 480200729 479371910 478769073 478362541
1250.8 478362541 478183403 478213272 478256645 478333130 478043251 477583618 477149162 477034645 477298279 477157631
1260.5 477157631 476931839 476954918 477163811 477718239 478183289 478483353 478999176 479417267 479920769 480991859
1270.1 480991859 481919823 482265778 482689590 483703346 484881744 485450974 485561028 486210175 487184181
1278.8 487184181 488128548 489009666 489606857 490475731 491567192 492964745 494284210 495209961 496082764
1287.5 496082764 496803513 497658463 498209152 498779335 499628410 500807838 502008057 502597580 503177414
1296.2 503177414 503513794 503917007 504431496 504557304 504425964 504667130 505168152 505397720 505868149 506126442
1305.8 506126442 506083488 505811539 505646286 505499458 505035858 504628563 503985367 503611870 503194122 503014603
1315.4 503014603 502894325 502628479 502848053 502847443 503547668 504520378 505225983 505850601 506274757 506764412
1325.1 506764412 507244377 507843513 507668343 507557831 507622643 507248459 506596222 505748520 505665817 505458984
1334.7 505458984 504913712 504362488 503999748 503550491 502842789 503053131 503654099 504342842 504526482 504849091
1344.4 504849091 505424614 505608177 505962868 505802460 505492287 505166092 504973907 504495125 503893318 503744469
1354 503744469 503563843 503504677 503174286 503092651 502602959 502427406 502485008 501299171 500573997 500180283
1363.7 500180283 500630074 500629883 500393639 500443001 499751663 499336472 498577652 497892075 497308121 496901703
1373.3 496901703 496683159 496343842 496937523 496789856 496378288 496001701 495764084 495337830 494186211
1382 494186211 492899399 491513443 490522957 489634056 489104347 487872810 486908798 486259346 484888420
1390.7 484888420 483758659 482012978 480569305 478190269 475371323 474993744 473997154 472564354 470225983
1399.3 470225983 468742523 467961426 466674843 465604057 464557076 463042603 461387711 460420418 459742279
1408 459742279 458917274 457893295 456734123 456034927 455558815 455266533 454783630 454029503 453417206 452685699
1417.7 452685699 452340813 450982590 451700325 452852020 452947197 453167725 453222313 454199295 455188255 455523109
1427.3 455523109 456077194 456019821 456094971 456892700 457825165 458104897 458872032 460460777 461322365 462274284
1437 462274284 463712807 465558929 466555672 467412491 468345299 468394814 469062767 469813690 470707054 471002464
1446.6 471002464 471264572 472721176 474234238 475445251 475969505 476550636 476387482 476486664 476360931
1455.3 476360931 475865822 475231857 476264954 481000404 483051529 484877777 486096153 486913414 488512573
1464 488512573 488992157 490333900 491609001 493473358 495218048 497147942 499446182 500458832 501728592
1472.6 501728592 503606758 507063713 509495697 511326218 513785858 515816269 517765427 519359398
1480.3 519359398 520948868 522782478 524645882 526037064 527024574 527773514 527529984 527446518 528610115
1489 528610115 528953514 528643837 529501343 530247307 529835167 528901901 527743721 523716736 523674774 522917938
1498.7 522917938 521211090 521296272 520846558 520302048 519372978 519354591 519075699 512993240 508527412
1507.3 508527412 511088638 513568344 514391556 515325813 514948311 514509430 514382935 513065414 511801109
1516 511801109 509000473 509012909 510371971 510590248 508303528 507064323 509778481 511010551 511951103
1524.7 511951103 511340027 511585617 512414703 513150940 514462509 515555191 516169167 516477928 516755257
1533.4 516755257 515514412 516544609 517028694 517118149 517470398 513282166 513742790 515962944 516709442
1542.1 516709442 516574173 518012238 518618431 517814865 519106293 518988533 518912048 517819595 517427483
1550.7 517427483 518467484 518695946 519209709 516056786 516201172 516722641 515756989 508174286 496975784
1559.4 496975784 507168808 508004608 508884087 507712746 506291008 503775787 501092453 499386444
1567.1 499386444 496206856 494010315 486388359 485542259 484247589 481659851 479657669 476556015
1574.9 476556015 474620514 464823074 464540520 462334175 458737411 455562325 451492958 448797722
1582.6 448797722 444481812 442469368 438833618 435742760 432901382 429164124 426549606 421681938
1590.3 421681938 419454193 415851593 413777084 411033058 407819633 406429634 402999840 401613998
1598 401613998 398074646 396025658 393066177 390779457 389712067 387122612 387033844 384774513 384169121
1606.7 384169121 381827011 380533829 379246864 376786003 376948128 375154648 375410347 373543854 373669281
1615.4 373669281 373196106 369100342 371611023 370756149 371359978 369792595 370512772 370151672 368938141
1624 368938141 371280518 371728592 373722916 372466049 373729973 373925743 374256172 375294342 375255280
1632.7 375255280 377570152 377519951 380516281 381645699 384570732 386394043 387463875 389632607 389806824
1641.4 389806824 391360092 391615868 393730659 395069199 394886818 397293282 396814346 400585747 401769295
1650.1 401769295 404424362 406324387 404686546 404119682 405032005 408651924 409827461 412526169 414313889
1658.8 414313889 416171112 417690315 418747559 420533485 421077118 424591980 426155090 428454933
1666.5 428454933 430867538 432582512 435758438 437850952 441807518 443909264 447489204 450269623
1674.2 450269623 452746048 455280075 457792473 462164078 464942513 468059311 470742149 474772491
1681.9 474772491 478270569 478265572 484342728 485786552 490328789 494205894 498353233 502696304 506798019
1690.6 506798019 511174698 514636154 518174591 521371117 524004326 524292603 529796638 535193138
1698.3 535193138 539524651 541890144 543804016 550442276 554515305 557049408 559633980 562654533
1706 562654533 564789658 568133240 572090988 574643364 577080383 579500694 581718292 583370132 583699913
1714.7 583699913 584612427 587110367 589057541 588141747 592352371 595653839 597717094 599452286 600543137
1723.4 600543137 601551208 602965431 604358673 605341644 606930237 608761292 609073296 610552635 614113617
1732 614113617 616898003 615372467 613755417 616898346 619878273 621237755 623313103 624653015 624961891
1740.7 624961891 628731117 631158676 632498283 634662170 636931686 638530083 639427757 640789185
1748.4 640789185 642577591 647200241 649766312 651607056 656109314 659055405 661560135 663437653
1756.2 663437653 663182602 664509506 666846924 669233398 671778946 672238541 674092102 677371140 678873138
1764.8 678873138 680238876 681578674 682276688 680809708 682340622 685248489 684997559 684985504 686387177
1773.5 686387177 689839859 691625443 691372528 692866669 693001938 693224716 693078918 693284378 694952545
1782.2 694952545 697185211 699491730 700016174 700426636 701116257 701520920 701379852 701741409 701610947
1790.9 701610947 702149963 702308426 702512894 705981140 707100830 707390518 708581161 708533478 707323761
1799.5 707323761 706072235 707777939 708304977 709662476 711812363 713068085 714293747 714554596 714610825
1808.2 714610825 714265518 713671799 712346039 713226318 714918213 715883942 717660904 718716736 719775925
1816.9 719775925 719865341 719936447 719832001 718869095 718858643 718385925 719360123 720573959 720635071 721627426
1826.5 721627426 723432999 724659119 722998657 720100861 720854950 722622910 722713165 723113632 724140091
1835.2 724140091 725169373 726449585 726650543 727551041 727170715 726949158 726585464 726200256 725836334
1843.9 725836334 722625122 725943604 728744965 729421692 729679413 730041656 730475540 729510574 728933868
1852.6 728933868 728364868 728920288 729642639 730262985 731414948 731872406 732792206 732916031 732812729
1861.3 732812729 731914749 731346436 731431274 731346207 732340927 732743607 733597946 732839584 732075348 733314590
1870.9 733314590 734171677 734249191 733055267 733112946 733526688 733995438 734747849 735783157 736648026 736526947
1880.6 736526947 736577454 735721283 735604095 735175247 734636612 735073929 735315247 736698914 737168045 737189865
1890.2 737189865 737635269 737674561 736976013 736125183 735779037 735467148 736520157 736976547 737689590 738867493
1899.8 738867493 739312744 739614944 739006424 738610992 737795715 737368240 737640686 738127136 738819199 739189987
1909.5 739189987 739492569 739453812 740103378 739684677 739215317 738857498 738283691 738906250 738206787 738863525
1919.1 738863525 740084076 740655289 740822601 739824142 739744492 740094147 739807739 738902740 739082794 739457703
1928.8 739457703 739976730 740905228 741111450 741575089 741270447 740827789 740041122 739411011 739113846 738820114
1938.4 738820114 739576645 740032578 741140900 741240234 740635529 741440430 741184006 740101471 738899841
1947.1 738899841 738676529 739014206 739744415 740192719 740521393 741279831 741229401 741094208 740489578 739846649
1956.7 739846649 739155121 738938370 739315491 739441223 740174713 740625229 741013947 740869446 740591125 740221024
1966.4 740221024 739431152 739346085 738802261 738416443 738347244 738953552 739664841 740241165 740862350 740348892
1976 740348892 739770126 739072189 738772125 738488083 738394089 738886948 739076843 739576035 739748154 740016403
1985.7 740016403 739705811 739084930 738596191 738050385 738163223 737690964 737536087 738079224 738972702 739311447
1995.3 739311447 739075699 739065018 738309326 737681427 737016373 736927109 737236862 737432327 737599792 737635727
2005 737635727 738224411 738213654 738067932 737295380 736453781 736160812 735716019 736061630 736186981 736443024
2014.6 736443024 736807327 736861496 736647263 736392059 735973206 735237656 735244980 734986420 735191193 735440521
2024.2 735440521 735462875 735717087 735335922 735263977 734838562 734562988 734072189 733578186 733685074 733629990
2033.9 733629990 733975601 734164429 734561539 734254074 733896255 733694077 733014145 732821503 732181091 732284012
2043.5 732284012 732561035 732805099 733194427 733070297 732847214 732096710 732159882 732055664 731466217 731083984
2053.2 731083984 730967484 731383286 731696167 732341766 732388458 732458572 732555084 731868591 731199799 730473862
2062.8 730473862 729953690 729862823 730673141 731313095 731590118 731819458 731793671 731701431 731245651 730713577
2072.5 730713577 730007706 729866867 729801178 729867325 730496979 730865784 731282272 731251602 730843430 730006027
2082.1 730006027 729435806 728883057 728484879 729085922 729180374 729432220 729578857 729706039 730142136 730131683
2091.7 730131683 729648743 728844528 728736343 728194351 727861633 728060455 728204117 728553162 728462601 728573227
2101.4 728573227 728240433 727681274 727255096 727094040 726936569 726521378 726955414 727410049 727772446 727702560
2111 727702560 727640762 727383499 726374817 726101837 725843811 725625000 725852814 726112900 726149063 726483917
2120.7 726483917 726612625 725939636 725784378 725742264 725773773 725594864 725473251 725352707 725070572 725534363
2130.3 725534363 725729752 725845413 725752106 725564804 724946060 724160080 724243317 724424362 725023270 725146942
2140 725146942 725363312 725544586 725469131 725796661 725392532 725027008 724575729 724564590 724637146 724757233
2149.6 724757233 725213318 725084686 725509720 725721817 725863266 725575104 724794159 724314957 723886490 724401779
2159.3 724401779 724840088 725180664 725522079 725683823 725466919 725017776 724971390 724570236 724459152 724411697
2168.9 724411697 724722595 725230103 725671692 726168365 726089783 726057053 725361023 724804382 724332581 724088364
2178.5 724088364 724587936 724614410 725117722 726019211 726859894 726766357 726170654 725794449 725290146 725055542
2188.2 725055542 724752731 724877396 725061188 725899811 726678391 726580048 726712494 726770706 727105713 726574097
2197.8 726574097 725619049 725130234 725150375 725559921 725773087 726621323 727146835 727353134 727099686 726648712
2207.5 726648712 726444092 725882492 725607147 725482559 725995407 726461182 727026291 727503281 727366333 727338715
2217.1 727338715 726753616 726464920 726133575 725968170 726058121 726114426 726629333 726988220 727583313 727511673
2226.8 727511673 727202301 727038498 726789322 726529770 726067276 726140976 726094284 726505432 726977310 727284012
2236.4 727284012 727543793 727158890 726767273 726475449 726926498 726857910 726534882 726734772 726788559 726919022
2246 726919022 727015381 727507172 727458344 726807175 725951843 726076889 726678925 726334991 726554489 726537018
2255.7 726537018 726468811 726455536 726644135 726976852 726599731 726377792 725790558 725860367 726247330 726442337
2265.3 726442337 726587143 726544800 726972275 726987000 726987534 726438141 725868378 725587311 725421143 725842514
2275 725842514 725982590 726411285 726507034 726615219 726398773 725744400 725465698 725043716 725055542 724880905
2284.6 724880905 725060425 725218353 725543137 726167221 726073608 726081390 725544357 725134430 724573975 724226837
2294.3 724226837 724437180 724585114 725037537 725028610 725493011 725524063 725662689 725526047 724137421 723771820
2303.9 723771820 723563461 723562164 723608398 724055252 724485626 724513779 725019913 724931183 725033340 724457932
2313.5 724457932 723797302 723335495 722802505 723110733 723377151 724239120 724319763 724252548 724356537 723892746
2323.2 723892746 723457718 722872696 722538223 722566147 723567734 723106384 723124008 724062347 723339157 722830048
2332.8 722830048 722221756 722274323 722312317 722052917 721316986 721157837 721912842 721913300 722074661 721435089
2342.5 721435089 721525040 721384964 720638733 720562592 720204239 719790878 719898682 720868683 720964508 721461639
2352.1 721461639 721917648 721342010 721657944 720952454 720297928 719749069 721232224 721079254 719796219
2360.8 719796219 720547562 720758820 721503983 719696426 719138718 718498917 717098312 718005676 718306427
2369.5 718306427 718093338 717019577 716764526 716418533 715899811 716108932 716273270 715931396 714830322
2378.2 714830322 714894485 714892960 714620743 714610291 714479599 714457932 713909683 713535538 713230438 712869568
2387.8 712869568 712436371 712215576 712299652 712377396 712615509 712197647 712085571 711827240 711088791 710801086
2397.4 710801086 710552063 710555496 710350647 710160904 710187302 710270615 710152054 709860229 709463425 708904037
2407.1 708904037 708685837 708039856 707790756 708075638 708101425 707997665 707821350 707929001 707602310 707087250
2416.7 707087250 706455765 706200485 706127701 705485382 705232849 705264435 705532532 705360184 705116348 705279922
2426.4 705279922 705102692 704459152 703503952 703132935 702918930 702611389 702316437 702361374 702637939 702624512
2436 702624512 702432632 701819992 701546249 700999374 700374527 700025177 699779434 699882355 699382324 699282227
2445.7 699282227 699369812 699147339 698675995 698219681 697980347 697325516 697279282 697010727 696750031 696882248
2455.3 696882248 696721649 696429672 695733643 695328522 694925766 694830475 694695129 694352646 694238434 693874817
2465 693874817 693481598 693013153 693153992 692926254 692467270 692073898 691362991 691412125 691221619 690959167
2474.6 690959167 690709610 690269012 689688721 689042587 688685684 688287582 687951736 687210999 687157288 687330017
2484.2 687330017 687445679 687599945 686802292 686342850 685621109 684946899 684449692 683899078 683645859 683206787
2493.9 683206787 683033981 682700882 682962723 682995148 682486038 682002335 681237335 680947647 680263901 679608459
2503.5 679608459 679079666 678984375 679176483 678996353 678960114 678197708 677637177 677359848 676913681 676206131
2513.2 676206131 675602036 675569763 675254974 675266113 675120850 674961777 674690781 674027023 673375931 672619400
2522.8 672619400 672420349 671842041 671362000 671375046 671458359 671488876 671156235 670862656 670202408 669779739
2532.5 669779739 669157639 668483429 668240356 667956085 667980652 667580795 667153168 667155075 667176971 666573257
2542.1 666573257 666056366 665826263 665053558 664910278 664827805 664522324 664173050 663808899 663503952 663062668
2551.7 663062668 663072128 662716522 662248688 661752930 661541824 661666412 661069336 660395660 659880295 659986191
2561.4 659986191 660046692 659605179 659222260 658811188 658463364 658041153 657854843 657626114 657434921 657083817
2571 657083817 656654282 656439590 655808945 655313110 655113754 655057068 654797592 654485855 654405212 654473114
2580.7 654473114 654252090 653246002 652596664 652227783 651980286 651655884 651220169 651035843 650570755
2589.4 650570755 650442581 650457153 650435028 650308914 650013885 649352417 648370895 648195419 648050079 647516937
2599 647516937 646879120 646726532 646897125 646756439 646493835 645955353 645392990 644613266 644610977 644370499
2608.6 644370499 643378754 643175964 642863617 642913742 642752075 642312546 642173767 641837692 641475983 640653305
2618.3 640653305 640099487 639486160 638910599 638728371 638438148 638314781 638109131 637770195 637045403 636400223
2627.9 636400223 636142235 636050301 635451736 634793434 634914093 634602165 634067497 633358078 633007507 633051682
2637.6 633051682 632625351 632271004 631716270 631247292 630718956 630269966 629961700 629445343 629199791 629055099
2647.2 629055099 628732491 628046417 627504730 626990204 626718521 626337280 625666771 625462837 625089760 625038643
2656.9 625038643 624653931 624174042 624033241 623467903 623125877 622593498 622251167 621918755 621685410 621551590
2666.5 621551590 621062508 620841866 620346107 619969521 619628334 619353523 619139786 618803940 618538017 617955399
2676.1 617955399 617790108 617537727 617348404 617223549 616649590 616241417 615913925 615706482 615174942 614836159
2685.8 614836159 614888344 614949188 614616241 613853645 613508339 613076439 612664146 612073059 611620255 611537247
2695.4 611537247 611410713 611692352 611297874 610398140 609803047 609405174 609259338 609199829 608824120 608170967
2705.1 608170967 607716217 607452621 607624550 607480087 607112656 606867332 606542130 606278038 605531578 605227089
2714.7 605227089 605007629 604657898 604681511 604433937 604150734 603961601 604064598 603693008 603026199 602519760
2724.4 602519760 602211380 602320251 601813126 601482391 601449509 601126442 600863113 600711670 600562897 600133438
2734 600133438 600069504 600188828 599965515 599414291 599033241 598882408 598554344 598452988 598267403 598017998
2743.7 598017998 597922821 598005829 597772102 597165070 597171974 597296486 596907310 596261673 596063614 596149673
2753.3 596149673 596230431 596241951 595783310 595374565 595148201 594898338 594403648 594110947 593912506 593470001
2762.9 593470001 593452644 593417168 593354874 593283424 592938080 592440414 592086067 591923332 591701202 591592941
2772.6 591592941 591110420 590760651 590733337 590454559 590014496 589549599 589172287 588471680 587926025 587583351
2782.2 587583351 587377892 587162781 586843071 586918716 586796036 586652565 586256676 585815964 585529900 584903183
2791.9 584903183 584389725 583728104 583233299 583025627 582995529 582600136 581745300 581262360 580712280 580158730
2801.5 580158730 579539413 579086647 578806686 578276749 577711296 577247124 576873131 576382980 576327400 575641212
2811.2 575641212 574353218 573873024 573484726 572913208 572094269 571456451 571217957 570881729 570124626
2819.8 570124626 569572029 569592133 569145889 568437500 567639771 567222137 566974907 565983887 565050278 564562492
2829.5 564562492 564003334 563102531 562517967 562099724 561700974 560790215 559461937 559071541 558326912
2838.2 558326912 557268944 556305542 554958649 553777084 552616692 551398163 550087013 548977051
2845.9 548977051 547273293 545242882 543855095 542343826 540615997 539053612 538408966 538154793 537774506
2854.6 537774506 537450523 537286377 537313766 536943207 536863747 536862106 536680260 536547928 536275978 536058350
2864.2 536058350 535716286 535218163 534344406 533839531 533500290 532916794 532951469 532901840 532205772 531139793
2873.8 531139793 530328064 529923477 529808044 529594231 528756828 527696800 527030907 527355499 527532654
2882.5 527532654 526849899 525925980 525150604 524888306 524332428 523370247 522692184 522032738 520973129
2891.2 520973129 520535126 520494118 519591179 518846703 518130989 517513580 517226295 516134453 515300255 515065689
2900.8 515065689 514447098 514001465 513630676 512760315 512131844 511733589 511192589 510690880 509741364 508180656
2910.5 508180656 506950569 506564369 506040802 505265007 504519920 503452492 502109032 500834999 499908943
2919.2 499908943 498600082 497347679 496546135 495853767 495688972 495579185 495380478 495271683 495453529
2927.8 495453529 495433159 495181999 495434418 495610008 495750313 496129646 496597557 497048378 497995338 498855858
2937.5 498855858 499088249 499770126 500159035 500379601 500862999 501457481 502434616 503100395 503644905 504083710
2947.1 504083710 504443588 504748039 504644165 504482651 504878464 505416183 505159302 505191650 505569763 505756836
2956.8 505756836 506235199 506898003 507721558 508129311 508050613 508173981 508668289 508786316 508653946 509194450
2966.4 509194450 509837646 510115891 510531616 511254272 511761513 512107773 512237854 512448692 513086662 513310356
2976.1 513310356 513362770 513570938 513990898 514242172 514288673 514635582 514715919 514731941 514806442 514967537
2985.7 514967537 515002708 514871788 514963837 514800339 515005379 515623703 515790977 515451736 514849129 514633865
2995.3 514633865 515233994 515472488 514807472 514333839 513882751 513841858 513866653 513324203 512886581 512005005
3005 512005005 511177597 510929260 511307106 511489944 510636482 509987450 509784889 509546509 508840866 508341637
3014.6 508341637 508256912 507898941 507499237 506892166 506672897 506573524 505879173 504944801 504252052 504314613
3024.3 504314613 504047356 503025475 502515984 502237320 501617622 501385498 501065826 500410347 500020523
3033 500020523 499494667 498918762 498027611 497090492 496694374 496374512 496086960 495858574 495477180 495012894
3042.6 495012894 494684181 493848686 492749939 492180595 491833344 491430092 490728416 490156860 489395447
3051.3 489395447 488396835 488086243 487918205 487324181 486481552 485809479 485474854 485202789 484711418 484120903
3060.9 484120903 483556557 483109894 482784691 482234955 481916733 481609344 480969124 480199509 479488831 479127693
3070.6 479127693 478536491 477938309 477590446 477267342 476966782 476709976 476232872 475512390 475550423 475204124
3080.2 475204124 474063187 473407249 473125839 473235130 473221016 472750130 472259521 471890182 471266670 470599670
3089.9 470599670 470102310 469404602 468765106 468169708 467928467 467518158 466693802 466343994 466288071 466185646
3099.5 466185646 465431747 464520874 463871956 463533249 463482666 463025131 462671242 462199097 461478767 460935822
3109.1 460935822 460369987 459683533 459086571 458915749 458662262 458204498 457561340 457160149 457010880 456529388
3118.8 456529388 456315994 455837021 454870224 454267426 453946571 453595810 453136139 452413712 451847878 451813126
3128.4 451813126 451282845 450102921 449069557 448631630 448444557 447968140 447954674 447729530 446654167
3137.1 446654167 446034317 445865784 445292435 444441948 443569641 442965660 442636719 442135811 441743164 441286964
3146.8 441286964 440849075 440598869 439930344 439244080 438572350 437716980 436771164 436129227 435946045 435360603
3156.4 435360603 434552460 434021492 433710976 433127556 432204971 431608238 431166267 430539742 429809303 429075432
3166 429075432 428480721 428311234 428031960 427403030 426930428 426420441 426066017 425717545 424921227 423912888
3175.7 423912888 423181915 422840576 422520065 422223167 421929855 421611977 420978355 419985733 419067612 418406677
3185.3 418406677 417948380 417252274 416519203 415902061 415539474 415353470 414677544 414008484 413520737 412674904
3195 412674904 411851883 411619911 411401787 410719872 410099945 409682083 409260559 408918343 408891716 408604240
3204.6 408604240 407849312 407146530 406508827 406127281 405928955 405491676 404672661 404066963 403970451 403626099
3214.3 403626099 403071632 402712059 402263527 401870079 401607933 400907173 400265083 400000648 399682083 399335518
3223.9 399335518 398924408 398683128 398265419 397555428 396945839 396334114 395730705 395257797 395303078 395396805
3233.5 395396805 395083961 394281082 393315506 393020020 392928009 392741928 392274666 391731453 391285744 390598297
3243.2 390598297 390340080 390387344 390246239 389916763 389497490 389194794 388716621 388105583 387794724 387284431
3252.8 387284431 386650429 386907463 387010727 386406174 385619850 384775658 384419518 384381866 384253731 383681717
3262.5 383681717 383171387 382965240 382518425 382142181 382111435 382314186 382098236 381642609 380908165 380284348
3272.1 380284348 380253601 379643936 379302101 379249992 378531685 378026047 378199577 378114357 377410851 377124672
3281.8 377124672 376709290 376420784 376498337 376406250 376251907 375409355 374746361 374450226 374462051 374624367
3291.4 374624367 374356384 374424782 374122849 373928490 374067612 373362274 372811775 372672501 371805267 370882378
3301 370882378 371229744 371711388 371419601 371125145 370860405 370392570 370071182 369861450 369574699 369304314
3310.7 369304314 368709908 368290138 367863464 366984215 366424141 366094666 365877419 365667953 365467987 365009766
3320.3 365009766 364682350 364720535 364083900 363612900 363346443 362789383 361918831 360862350 360495262 359978676
3330 359978676 359419823 359078369 358733749 358405380 357373123 356607285 356159248 355513191 355282555 354915657
3339.6 354915657 354347458 353797951 352825279 352138405 351830521 350997543 350195770 350030327 350469170 350390091
3349.3 350390091 349516144 349076805 348582764 348097115 347725868 347292976 346972961 346118011 345501976 345459213
3358.9 345459213 345270729 344844170 344553604 344390297 343822212 343312187 343102570 342828712 342408447 342020073
3368.6 342020073 341680298 341179962 340551453 340029564 339781990 339477463 339083633 338549309 338376961 338456078
3378.2 338456078 337766037 337549095 337652168 336967239 336409988 336270294 336351089 336386070 336118584 335614738
3387.8 335614738 335435333 335619812 335531540 335262413 334687691 334211121 334330864 334264565 333750076 333169212
3397.5 333169212 333010597 333415298 333662262 333328705 332486992 331726570 331787148 331816444 331633072 331787872
3407.1 331787872 331745834 331459427 331347504 331737633 332018280 331832008 331684570 331566048 331634750 331623230
3416.8 331623230 331055756 330663109 331494331 332217598 331593056 331205139 331492462 332270241 332623444 331800652
3426.4 331800652 331362991 331912575 332277336 331953049 331782608 332316780 333286476 333841743 333838539 334256973
3436.1 334256973 334246826 333567963 333447495 333545418 333698921 333766670 333847427 334554939 334764938 335426712
3445.7 335426712 337047424 336637840 335986061 336703224 337215195 337482986 337778702 338544540 339102249
3454.4 339102249 339662590 340424919 340630531 341178627 341485062 341357079 341707306 342434502 343030853 343284187
3464 343284187 343834190 344569778 345331039 346077576 346974297 347457352 347106667 347394104 348088646 348936729
3473.7 348936729 349849358 350113487 350615654 351509285 352448730 353089142 353322220 353711128 354311943 355205956
3483.3 355205956 355944290 356162262 356337128 356863594 357993851 359093590 359907570 360881691 361441154
3492 361441154 361933670 362533836 363112793 363998604 364523582 365441933 366547394 366868286 367456703 368181114
3501.6 368181114 368751221 369439201 369769096 370494576 371758690 372707863 373549690 374256516 374703979
3510.3 374703979 375480003 376648979 377762833 378092842 378607407 379846878 381036377 381913452 382345123
3519 382345123 383029099 384222183 385500374 385696564 385682297 387306328 388653679 389110565 389584084
3527.7 389584084 390745964 391427269 392067757 393679008 395067635 396199493 396959686 398400955 399714584
3536.4 399714584 399980888 400797691 401896744 403517113 404447403 405204811 405944519 406880035 408365555
3545 408365555 408779221 410148811 410883598 412133636 413868065 415056305 416902046 417460632 419500046
3553.7 419500046 421211662 421758728 422832985 423566513 425458527 426867905 427849770 428662910 430487633
3562.4 430487633 431833153 431936493 435429115 437193718 436900635 437244873 437999725 441192551 442780914
3571.1 442780914 443918304 445466537 447667122 449679832 451138992 452864647 453399162 455250702
3578.8 455250702 456805077 457655258 459510612 461307220 462477303 463675041 467768364 470391235
3586.5 470391235 469420662 470568504 471357727 473359833 475557442 478687401 480992470 482330475 484683380
3595.2 484683380 484104805 486071281 489237633 490314598 492211227 493099899 494239578 496633797 499346657
3603.9 499346657 502016487 504584885 506832314 506506157 508853912 510356636 510571594 515552673 517404594
3612.5 517404594 516914215 520417900 521617355 525388985 528888626 529495926 532876930 534203682 534618149
3621.2 534618149 536726074 539062347 541637268 544574089 546712532 548332062 552925186 554069710
3628.9 554069710 549198074 553833351 558588676 563127327 565494843 565630112 567888412 570933380
3636.6 570933380 574112091 576391563 578579597 581212769 583712273 585220184 586693268 589636650
3644.4 589636650 592776031 597298508 597232056 594798393 599925728 601401215 601318779 602344894 607510414
3653 607510414 612450943 616076622 620434456 616084976 618635521 623939819 625433540 627003365 628010406
3661.7 628010406 630529480 632274628 634341469 637017326 638114395 641959534 644227448 644246597 645096207
3670.4 645096207 640607681 643672409 650449371 656501083 652982788 641269531 647272491 654792480
3678.1 654792480 658610535 656489182 657219772 660288086 662072983 663383179 664513016 665310898 668071136
3686.8 668071136 672268066 664481735 662840500 670131531 666269073 666641464 671763458 673460999
3694.5 673460999 674815750 674511642 673858490 675350418 676755829 679354630 681279526 676078110 675137253
3703.2 675137253 679962540 681052628 680754929 681535797 683707581 686674805 680833893 683119812 685921555
3711.9 685921555 675966492 681156693 685710526 685593033 686198654 688426666 688933868 685930710 687281418
3720.5 687281418 691354370 688739243 685875931 689357452 690147705 689549637 688138657 688733292 691326294
3729.2 691326294 692213821 696203156 693324432 688255234 695843277 697021255 687868576 686964951 690906219
3737.9 690906219 691979675 693266754 695884781 692830658 694376373 702514648 695626297 683320236
3745.6 683320236 690625153 695275879 699130096 695629272 687950287 696951828 693924561 689170761
3753.3 689170761 693551025 696452179 699707336 696541672 697615662 701071777 695183792 695310745
3761 695310745 698956375 699743805 698925552 700532303 698621292 695981750 699041519 702245789 702741547
3769.7 702741547 696680298 698091354 700922470 700728989 701514435 701089172 701053085 701414871 703374786
3778.4 703374786 703124008 698146286 700945206 702239456 701878128 703298035 701859665 701141510 701628342
3787.1 701628342 702408066 702965851 702710266 703069839 703576508 703854752 702837524 703231277 705503006
3795.8 705503006 703219986 700816574 702505341 705619431 709902191 704699554 696156845 699607162
3803.5 699607162 702324753 705726318 709763565 701669617 698082275 702139130 704154358 704528580
3811.2 704528580 704439087 704225464 705331116 709782410 708838501 697882462 701618118 706218872 709644089
3819.9 709644089 711174164 698086166 698487091 701676025 702320328 704475479 705646973 702608871
3827.6 702608871 702606506 704490585 707176132 708229675 701369705 703339310 708874588 703774414 703065567
3836.3 703065567 709881592 704581909 700101089 705155792 702088089 702226715 706920395 704930954
3844 704930954 702812805 705609589 706494827 705882187 707313461 706357574 706911621 710425491 703836212
3852.7 703836212 703180466 693672867 696403427 704971313 704410400 703436203 705077972 706496506 708255692
3861.3 708255692 704193726 704405136 709126740 704386139 700661316 704013748 707558365 710835495
3869.1 710835495 704033585 697619705 701490326 706648407 708708267 701376114 702882996 706161804
3876.8 706161804 705630417 706913376 709738617 705719070 700640259 704865189 705725250 706998978 711339340
3885.4 711339340 700907059 700929031 704254074 705222397 708445129 706932755 700415192 701582565 704704132
3894.1 704704132 704326630 705041122 705631485 706442413 707133484 700493774 704633255 706092224 701402130
3902.8 701402130 705901566 704416504 702680130 703130646 703483658 704800415 705154572 705866470 705183945
3911.5 705183945 704762650 704855728 704414520 705032196 705788498 703296738 701600876 705133667 705480957
3920.2 705480957 703300247 704791946 705368500 705602798 703268967 701220093 703523178 704965973 705472946
3928.8 705472946 705143509 704370575 704552155 703310776 703095016 704033508 703777084 704098587 704640350
3937.5 704640350 704322433 704838104 705001602 705373993 705817719 702354889 701320724 702593994 703631668
3946.2 703631668 704663544 703030853 703610458 704222488 702481918 703243103 703489380 703336258 703444214
3954.9 703444214 703905182 704012299 703416824 704361343 703801880 703011017 703082047 702419586 702341232 702663727
3964.5 702663727 703739166 704106674 703795242 703567276 703079376 703376465 703479080 702833328 702631378
3973.2 702631378 702792282 702745667 702943497 702700043 702299347 702529297 703028183 703263779 702930756 702754898
3982.8 702754898 702018890 702443848 703464737 702432098 702179947 702929764 703593369 703212128 702479324
3991.5 702479324 703110580 703344269 703366394 703083725 702626495 702665634 702867889 703214722 703217621
4000.2 703217621
##END=$$ End of the data block
