##TITLE=$$ Begin of the data block
##JCAMP-DX=5.00 $$ ACD/SpecManager v 10.08
##SPECTROMETER/DATA SYSTEM=Varian
##DATE=15 Jan 2013 15:17:54
##DATA TYPE=INFRARED SPECTRUM
##DATA CLASS=XYDATA
##ORIGIN=
##OWNER=
##NPOINTS=3735
##FIRSTX=399.26403809
##LASTX=4000.35498047
##MAXX=4000.35498047
##MINX=399.26403809
##MAXY=74.28876495
##MINY=32.96207428
##XFACTOR=1.0000000000
##YFACTOR=0.000000100000000
##FIRSTY=49.99872589
##DELTAX=0.96440572
##XUNITS=1/CM
##YUNITS=TRANSMITTANCE
##XYDATA=(X++(Y..Y))
399.3D99987259n17807L16391Q390121O742707O690445m163399J164398L413391l791771
407.9E18231735K019959J192207j810875r592438k120056K762223l748322q19588K109108
416.6E08223953P213745K747193p957421l82766o36254m412155n909843P837524N708389
425.3E12432365k135124l78456r77783j613541l20968L82576n3215M71916J286125
434E09093895N07355k843209n30510L745499N756378M775925n449905p581444K212829
442.7E09686813K256928r12972L519860O69250o167984j333465J918296K139893l688583
451.3E08088036l070641J1826k061615J780243q78563N79071M926567m00353m269943
460E04704628q280334j302872K050705M116363K538910n21431m30565J32523L488235
$$ y = [499987259, 499469452, 499785843, 508175964, 514918671, 521609116, 517445717, 518610115, 522023506, 518231735, 520251694, 521443901, 519633026, 510040588, 507920532, 510682755, 506934433, 506114845, 508223953, 515437698, 518184891, 510227470, 509844704, 509208450, 504796295, 498886452, 506723976, 512432365, 510297241, 509918785, 508941002, 507327461, 507006493, 507389069, 507335854, 507807770, 509093895, 509601250, 506758041, 506227531, 509973030, 515729408, 520505333, 515055428, 507473984, 509686813, 511943741, 511030769, 514550629, 515219879, 509051895, 507718430, 509636726, 511776619, 508088036, 505017395, 505029221, 502967606, 504747849, 503869286, 504448357, 509374924, 508974571, 504704628, 496424294, 495121422, 497172127, 501288490, 503827400, 503305969, 502875404, 503007927, 506496162]
468.7E06496162l192977j594544K909699k291031l586769J1825L559914O01578o47202
477.4E02266655P42607k352638n411987l709832R31435J550217n69954Q47931N207061
486.1D99501495K101059m09774K8572k007370k971383o708831J24855M842224K117462
494.7D96618309P48177j124764L18871K09617J212235J128502k225724l959694j370201
503.4D91555328q59451j55868M862365L575745J33896j285095n42603K07558n909615
512.1D91582260m174957j147804J191330K749443j40763J428185J018944j369057j336174
520.8D89801407j590347k925225O43463K884598r42955m85802J115838J819572J851387
529.5D92171936m19617k854232l431206q15087l3416j300049l12767M802704L852043
$$ y = [506496162, 503303185, 501708641, 504618340, 502327309, 498740540, 498752365, 502312279, 502913857, 502266655, 503009262, 500656624, 495244637, 491534805, 492466240, 494016457, 493446503, 494294434, 499501495, 501602554, 501192780, 501221352, 499213982, 496242599, 489533768, 489658623, 494500847, 496618309, 497366486, 496241722, 496560593, 496770210, 497982445, 499110947, 496885223, 492925529, 491555328, 490695877, 490540009, 495402374, 498978119, 499112015, 497826920, 497284317, 497491875, 491582260, 487407303, 486259499, 487450829, 490200272, 490059509, 491487694, 492506638, 491137581, 489801407, 488211060, 485285835, 485929298, 488813896, 487870941, 487385139, 488500977, 490320549, 492171936, 491752319, 488898087, 485466881, 484651794, 484618378, 483318329, 483005562, 487808266, 491660309]
538.1D91660309j173706j686783l476448j905937P82165n05104j629639n21240O32286
546.8D82175903n2108P18307N97916L49464m81872j775856j585808j702843l40271
555.5D77902832o5231J127815K213440M22096n37338j427345n49927l40119j047706
564.2D77698517j110726m33769J563034J483078J760559J771660m95415k589988k128487
572.9D77518463p58247j434098p31277N05028Q97407J747628Q71734p82471j699676
581.5D76134491p66411m19617j351089q98399N30662K721291L555832J491012J21498
590.2D81119270n23185j187210p22466j675720j051979R92164J183472J952744Q29544
598.9D80916634Q40263K501259J48620j456642k623672l083153j026039n92766L06816
$$ y = [491660309, 490486603, 488799820, 485323372, 483417435, 484199600, 483694496, 482064857, 481543617, 482175903, 482123795, 482842102, 483440018, 483789482, 483307610, 481531754, 479945946, 478243103, 477902832, 477837601, 478965416, 481178856, 481600952, 481063614, 479636269, 479086342, 478746223, 477698517, 476587791, 476154022, 477717056, 479200134, 480960693, 482732353, 482236938, 479646950, 477518463, 476760216, 475326118, 474594841, 475099869, 475997276, 477744904, 478616638, 477834167, 476134491, 475368080, 474948463, 473597374, 472698975, 473229637, 475950928, 479506760, 480997772, 481119270, 480596085, 479408875, 478686409, 477010689, 475958710, 476950874, 478134346, 480087090, 480916634, 481756897, 484258156, 484406776, 482950134, 480326462, 477243309, 476217270, 475624504, 475931320]
607.6D75931320J787110J550636J409836J96151j796608k260818j667976j185723L03803
616.3D74267731J700515M14505P04918K319603J536866j53389j133423j308937j050682
624.9D77297707k34986M55818K010384L785324K713280J226616K81524o0005K09618
633.6D87685280n72395n18418O00357J312485J145477J447220K220917K337837J434670
642.3D97093430n86853l64418o78483j445007l17879J303444L590699K998657K156105
651E03749695J635322l32832j490288k188949j064911n98717m29459J44921J198921
659.7E00623703K047005J253700K52304q46214n90592j755638j635933J04637k488288
668.3D96964684J484413K687034K725029J757126J88179J07460l27720p51114q55828
$$ y = [475931320, 477718430, 479269066, 480678902, 480875053, 479078445, 476817627, 475149651, 473963928, 474267731, 475968246, 476382751, 477087669, 479407272, 480944138, 480790749, 479657326, 478348389, 477297707, 477062721, 477518539, 479528923, 483314247, 486027527, 487254143, 487535667, 487475662, 487685280, 487112885, 486594467, 487194824, 488507309, 489652786, 491100006, 493320923, 495658760, 497093430, 496506577, 496142159, 495463676, 494018669, 493700790, 495004234, 498594933, 501593590, 503749695, 505385017, 505052185, 503561897, 501372948, 500308037, 499709320, 499279861, 499424782, 500623703, 502670708, 503924408, 504176712, 503330498, 502739906, 500984268, 499348335, 499452972, 496964684, 498449097, 501136131, 503861160, 505618286, 505806465, 505913925, 505586205, 504835091, 503979263]
677E03979263k45628J303177K233810J993523L273506L616257j9074j505165j733360
685.7E12896309j185036N11780j45683L49235J441307J138268K257881K292328j33782
694.4E19422607q24050r75647r97315k61993q91457m043K182922K806511J974945R35287
704E23367767N69725j13182q57620j018486m69551r1515J126061K424393K560043K605972
713.7E30103607J113892q38051j421700p69844r71832l59650J561585J701660J845093
722.3E31964760Q81729Q26263J367722m19312p64083m18358k98615l8452J022034J747207
732E35870895J743470J766014P33566J183853M40750k002029l035088j879844J525077
740.7E36346664K155076J414031K413712J862907R04351L27301j033821j727791j593933
$$ y = [503979263, 503733635, 505036812, 507270622, 509264145, 512537651, 516153908, 516134834, 514629669, 512896309, 511711273, 512223053, 512077370, 512426605, 513867912, 515006180, 517264061, 519556389, 519422607, 518598557, 517622910, 516625595, 516363602, 515472145, 515468102, 517651024, 520457535, 522432480, 523367767, 523937492, 523824310, 522966690, 521948204, 521478653, 521387138, 522513199, 524937592, 527497635, 530103607, 531217499, 530379448, 528957748, 528187904, 527216072, 526856422, 528418007, 530119667, 531964760, 532846489, 533672752, 535040474, 534621162, 533857079, 533438721, 533140106, 533101654, 534123688, 535870895, 537614365, 539380379, 540113945, 541297798, 541738548, 539736519, 536701431, 534821587, 536346664, 538501740, 539915771, 542329483, 544192390, 545096741, 545424042, 544390221, 542662430, 541068497]
749.3E41068497k10533P52105N19142J717911K587929K824249J794243n60570j341781
758E49151192j165428o89469k25792J321945J903992J717644K456131K006264J298904
766.7E57775383m29878j776505j414985p38564o67648l55988N86014J213379K656631
775.4E56847839J823044N89409k6092j749039k381325k141609L01857J158256Q87833
784.1E55310173J104431J015473J889953J770897Q88748j724624k004776q43125j101951
792.7E56305199p75681k87819J683922J911278J439018k58255k277832j612587j637764
801.4E54489479j084404j453819j461678l86963J67160j04255j230851j790657k215766
810.1E44928246j702118k862664l273697j231994N20477J390457M05922m80041o95763
$$ y = [541068497, 540857964, 541610069, 542129211, 543847122, 546435051, 549259300, 551053543, 550492973, 549151192, 547985764, 547296295, 547070503, 548392448, 550296440, 552014084, 554470215, 556476479, 557775383, 557345505, 555569000, 554154015, 553415451, 552747803, 552391815, 552977829, 554191208, 556847839, 558670883, 559260292, 559234200, 557485161, 555103836, 552962227, 553264084, 554422340, 555310173, 556414604, 557430077, 559320030, 561090927, 561979675, 560255051, 558250275, 557407150, 556305199, 555529518, 555241699, 556925621, 558836899, 560275917, 560017662, 557739830, 556127243, 554489479, 553405075, 551951256, 550489578, 550102615, 550269775, 550165520, 548934669, 547144012, 544928246, 543226128, 540363464, 537089767, 535857773, 536378250, 537768707, 538174629, 537694588, 536998825]
818.8E36998825r3994m32282j105651o84548K94151J437417J419143K511406K209969
827.5E42554436K444191L345298J332665R18236J298828K077408J994857K862092L613548
836.1E62441559K504883L360405K078514Q51822P59430J413459R39675l48778J327972
844.8E75328941K120629L146934K334175J221047J439361J434975Q40492q35037R7237
853.5E87128754M04815J579399J982460J918984K888031K062836K436599Q83294j06316
862.2F01178856j211395j151314Q70819L59230L57132Q60977K400894J021157j483231
870.9F03203125k607422j772842k57759j855774j071701l96119O65627L50838l28980
879.5E95928993J120949r93805j636200j494980r53941p31392p43103N05333M75426
$$ y = [536998825, 536904831, 536472549, 535366898, 534682350, 534976501, 536413918, 537833061, 540344467, 542554436, 544998627, 548343925, 549676590, 550594826, 551893654, 553971062, 555965919, 558828011, 562441559, 564946442, 568306847, 570385361, 571237183, 571996613, 573410072, 574349747, 574000969, 575328941, 577449570, 580596504, 582930679, 584151726, 585591087, 587026062, 587866554, 587031517, 587128754, 587533569, 589112968, 591095428, 593014412, 595902443, 597965279, 600401878, 601285172, 601178856, 599967461, 598816147, 599686966, 600046196, 600403328, 601264305, 603665199, 604686356, 603203125, 600595703, 598822861, 598565102, 596709328, 595637627, 595241508, 595907135, 596257973, 595928993, 597049942, 596056137, 594419937, 592924957, 591971016, 591239624, 590496521, 591001854, 591477280]
888.2E91477280N90515N3978M55360p20978j394500r03588j143417k3041m18091P37419
897.9E88710937P26052j47057O24924M69398n35736j786956q2932P31926J024742J470680
907.5E91205978J535225J945229J040726Q75244o61164j173973j127662j530915j174926
916.2E90933762j420975j223374j349945q48503j406212j922607k128906k354431k225686
924.9E76053123l062362k491646k484436k377548j819763o78521J34430r98840j673698
933.6E60600739k176743j014557q34541j347733j192589n38292R17092l16200m34914
942.2E53662262n06935j411286j657104k057762j138878p09305j04179m85306m66690
950.9E45124817p5836n03083O4812q93097j652298k043724j985855j532059j714973
$$ y = [591477280, 592067795, 592121773, 592577133, 591856155, 590461655, 589558067, 588414650, 588391609, 587973518, 588710937, 589436989, 589289932, 589914856, 590384254, 589848518, 588061562, 587978630, 588710556, 589735298, 591205978, 592741203, 594686432, 595727158, 596602402, 595941238, 594767265, 593639603, 592108688, 590933762, 589512787, 588289413, 586939468, 586090965, 584684753, 582762146, 580633240, 578278809, 576053123, 572990761, 570499115, 568014679, 565637131, 563817368, 563138847, 563273277, 562274437, 560600739, 558423996, 557409439, 556574898, 555227165, 554034576, 553496284, 554413376, 554097176, 553662262, 553155327, 551744041, 550086937, 548029175, 546890297, 546180992, 546076813, 545591507, 545124817, 545048981, 544545898, 544610710, 543717613, 542065315, 540021591, 538035736, 536503677, 534788704]
959.6E34788704j483383j294518r31778j565819j356544r62372j943168k090264k162857
968.3E20998001j803131r90257j139984j881295j493415j385270k566185k497863k235985
976.9E05004616k986946l018647k689743l037262l163147l412818l595620l797493
984.7D79302940m046058l848687l468513k844543l596154m160385l314895k838326
992.4D51185379k823677l009338l203431l244819l312683k826004k192459k606354
1000.1D27966614k045632j591453j862641j527824j418686j289596j510621j300811
1007.8D15419350j346321j026192l33901n00907j032219k105217j322747r51690k434082
1016.5D04366074l030014k453232k147789k381058j542587j249542p63817j094780
$$ y = [534788704, 533305321, 532010803, 531079025, 529513206, 528156662, 527194290, 525251122, 523160858, 520998001, 519194870, 518204613, 517064629, 515183334, 513689919, 512304649, 509738464, 507240601, 505004616, 502017670, 498999023, 496309280, 493272018, 490108871, 486696053, 483100433, 479302940, 475256882, 471408195, 467939682, 465095139, 461498985, 457338600, 454023705, 451185379, 448361702, 445352364, 442148933, 438904114, 435591431, 432765427, 430572968, 427966614, 425920982, 424329529, 422466888, 420939064, 419520378, 418230782, 416720161, 415419350, 414073029, 413046837, 412712936, 412212029, 411179810, 409074593, 407751846, 406800156, 404366074, 401336060, 398882828, 396735039, 394353981, 392811394, 391561852, 390798035, 389703255]
1024.2C89703255k111473j918755j331444j082268k234191j908608j659088r69582
1031.9C76487846j20544l06168P68738O06728K65236k25220P05643J031990M25262
1040.6C79639511J212769P16591R65995M27323K6436j05782k80571k07138r19113J13792
1050.2C81589813J83487l75252q68377K34756P85866p83196n40008n60989M11720J112633
1059.9C81190453J648902J121216P09954K350463K315178K453423J404800J643448
1067.6C94837837K225533J683807J938477J271400J042977O17332R68285M71763L49999
1076.3D05407410R65118O54488R83734K78206P23724L93486K83966J153565J292228
1085D12135925J442299M81568J521186J253663N52062J186181Q66432J022262M19159
$$ y = [389703255, 387591782, 385673027, 384341583, 383259315, 381025124, 379116516, 377457428, 376487846, 376367302, 376061134, 376829872, 377436600, 377701836, 377476616, 378182259, 379214249, 379639511, 380852280, 381568871, 382534866, 382962189, 382988625, 382882843, 382602272, 382395134, 381476021, 381589813, 381773300, 381398048, 380529671, 380764427, 381550293, 380767097, 380227089, 379666100, 380077820, 381190453, 382839355, 383960571, 384670525, 387020988, 389336166, 391789589, 393194389, 394837837, 397063370, 398747177, 400685654, 401957054, 403000031, 403617363, 404585648, 405057411, 405407410, 406372528, 407027016, 408010750, 408288956, 409012680, 409406166, 409690132, 410843697, 412135925, 413578224, 414059792, 415580978, 416834641, 417386703, 418572884, 419439316, 420461578, 420880737]
1093.6D20880737J101647K008438J164551Q24089J820411J248436j92489J52473L52440
1102.3D29360733J198540R40170R44862K175026J380997Q64754N69000O4240k15455
1111D37282867p553J027222J411819J061821Q99544O96259K66762N39016j1215p67059
1120.6D42399483l59345J79825J34354n12085K19497R16672R32541J365318J544991
1129.3D46821251J454277J195450J201744J298141J066132O69975J572914J708908
1137D56988792J246148K655258K429847N94750P24640J480675J56631j50642K92625
1145.7D66418724m94728K58484R07593L77464K68440P52526M89044k94380k48108q93708
1155.4D67541351j082229r41811q79249k37923m35677l71437p23190o19583R6283K42195
$$ y = [420880737, 421982384, 423990822, 425155373, 425979462, 427799873, 429048309, 428855820, 429008293, 429360733, 430559273, 431499443, 432444305, 434619331, 436000328, 436865082, 437434082, 437498322, 437282867, 437275314, 438302536, 439714355, 440776176, 441675720, 442371979, 442638741, 443177757, 443166542, 442399483, 442040138, 442219963, 442354317, 441842232, 442061729, 442978401, 443910942, 445276260, 446821251, 448275528, 449470978, 450672722, 451970863, 453036995, 453706970, 455279884, 456988792, 458234940, 460890198, 463320045, 463914795, 464639435, 466120110, 466276741, 466126099, 466418724, 465923996, 466182480, 467090073, 467467537, 467735977, 468488503, 468977547, 468683167, 468435059, 467541351, 466459122, 465517311, 464638062, 464400139, 463964462, 463593025, 462869835, 462250252, 462346535, 462588730]
1165D62588730J088943J094284J010476J434707J605034J995049K157173J891021J853486
1173.7D76718903K117004K535591K359848J927109K462463K228432J696014J841469
1181.4D93886833J596413J387825J384048J055451J003608R36089P41119R01108O81725
1190.1E03574219Q67691M13704q25959r44023m77791p85140j323510o60476l25852
1198.8D99512863l84941n38444r89037q50945p76977j273651j650200j470871j131554
1207.4D90446243k52533J66207R6321J27754j60637k15721l16277o6375J2397l28369
1217.1D89509010l92341k4338P11441L52898K21481N20973L32947j40457r34372m48952
1226.7D89708290l26233r51195q40530l11851k60239n00183J11084j87226q72421o21147
$$ y = [462588730, 463677673, 464771957, 465782433, 467217140, 468822174, 470817223, 472974396, 474865417, 476718903, 478835907, 481371498, 483731346, 485658455, 488120918, 490349350, 492045364, 493886833, 495483246, 496871071, 498255119, 499310570, 500314178, 501250267, 501991386, 502892494, 503574219, 504441910, 504855614, 504029655, 503085632, 502607841, 501822701, 500499191, 499838715, 499512863, 499127922, 498589478, 497600441, 496749496, 495972519, 494698868, 493048668, 491577797, 490446243, 490193710, 490359917, 490456238, 490583992, 490423355, 490207634, 489891357, 489824982, 489837379, 489509010, 489116669, 489092331, 489803772, 490156670, 490378151, 490899124, 491232071, 491091614, 490157242, 489708290, 489382057, 488430862, 487590332, 487278481, 487018242, 486518059, 486629143, 486441917, 485569496, 484948349]
1236.4D84948349n31349l57781l92074n72663j18370K3194m56391l93524l03802o00739
1246D81244850p97729p21054m17786n86586n73158j61515J50681M21448J06277l25546
1255.7D78339882l75443m40864k01454R8762j24016k39219R803K06910N12733P82585
1265.3D78569679L29743J33590P96814Q81119M34418M07066N20325N60455P26128J194191
1274.9D84553528J236992O94008P22961N76210M49333P02057O48728R58366J268845
1283.6D91811028J502532J328736R96857Q04786O83937P96433L54881O88286J111030
1292.3E00078506J202088J070366P94678R80682J10855R994M46282P5378R690K32963
1301.9E05011482L06015K94228J88637P4310L54080r5100j78185J1215n10292q95500
$$ y = [484948349, 484417000, 484059219, 483667145, 483094482, 482976112, 482999306, 482542915, 482149391, 481845589, 481244850, 480447121, 479726067, 479308281, 478721695, 478148537, 477987022, 478137703, 478559151, 478665428, 478339882, 477964439, 477523575, 477322121, 477420883, 477296867, 477057648, 477067451, 477274361, 477787094, 478569679, 478899422, 479033012, 479829826, 480710945, 481145363, 481552429, 482072754, 482633209, 483359337, 484553528, 485790520, 486484528, 487207489, 487783699, 488233032, 488935089, 489583817, 490542183, 491811028, 493313560, 494642296, 495639153, 496443939, 497127876, 497924309, 498279190, 498967476, 500078506, 501280594, 502350960, 503145638, 504126320, 504237175, 504247169, 504693451, 504768829, 504778519, 505011482, 505317497, 505611725, 505800362, 505874672, 506228752, 506133652, 505955467, 505966682, 505456390, 504560890]
1311.6E04560890o52618Q8272m45137k72026j17111k13623N69763M95872M72069L77121
1321.2E04863472Q27789O59752J51787L92151J05247M36898L6277q1787L44963j36489
1330.9E07600060n49012n08957n38139p21168j38932l14522n53054p23839p74460K78206
1340.5E03056183O36597O29730l8872K26936M70276M27857N31120l07846p9308l43704
1350.2E05208969k98500j30157j41678j24741o78215j29242j95923n8441l55415k66991
1359.8E02829666j73912j330070o66886j65214M68406M1809l65676l07236r43680l16086
1369.4D99071121j42479l56064q18061o07529n39398k37084P54319j03379m5738j51901
1379.1D96823807l93563r62333j076927n85099j518593j266860r28498q08143j413956
$$ y = [504560890, 503908272, 503996544, 503551407, 503279381, 503162270, 502948647, 503518410, 504014282, 504486351, 504863472, 505691261, 506351013, 506502800, 506894951, 507000198, 507437096, 507473373, 507391586, 507736549, 507600060, 507051048, 506542091, 506003952, 505282784, 505143852, 504829330, 504276276, 503552437, 502777977, 503056183, 503692780, 504322510, 504283638, 504510574, 504980850, 505408707, 505939827, 505631981, 505552673, 505208969, 504910469, 504780312, 504638634, 504513893, 503835678, 503706436, 503510513, 503452072, 503096657, 502829666, 502655754, 501325684, 500658798, 500493584, 500961990, 501003799, 500638123, 500330887, 499387207, 499071121, 498928642, 498572578, 497754517, 497146988, 496607590, 496370506, 497124825, 497021446, 496975708, 496823807, 496430244, 495467911, 494390984, 493805885, 492287292, 491020432, 490091934, 489283791, 487869835]
1387.8D87869835j072655k78816r27544j358680j953965j701584k236518k174378o52237
1396.4D75513458j052437j461410k610207j522178p25899j015854j151657j471558
1404.2D64502258j573372j214370o49567q06084j121025q17604n95932l72772p57790
1412.8D56593742q35685n82619p23496q18290o61621J58844j062889o9619J031914
1421.5D53030281K17323K7962k60162Q73070J250686O31066P32345J26419R5177O13403
1431.2D57337570Q25806O86073R12972J008644l10555M60472K688904K178040J138344
1439.8D66926270P56950Q12492J2398N73959O52924J025734Q61587L46680J012116
1448.5D72981110J400299J177139K28462L71590O24542P95593K01187m01916r9869
$$ y = [487869835, 486797180, 486518364, 485590820, 484232140, 482278175, 480576591, 478340073, 476165695, 475513458, 474461021, 472999611, 470389404, 468867226, 468141327, 467125473, 465973816, 464502258, 462928886, 461714516, 461064949, 460258865, 459137840, 458320236, 457724304, 457351532, 456593742, 455758057, 455175438, 454451942, 453633652, 452972031, 453130875, 452067986, 451998367, 453030281, 453247604, 453275566, 453015404, 453888474, 455139160, 455770226, 456502571, 456628990, 456724167, 457337570, 458163376, 458849449, 459762421, 460771065, 460460510, 460920982, 463609886, 465787926, 466926270, 467683220, 468495712, 468508110, 469082069, 469734993, 470760727, 471622314, 471968994, 472981110, 474381409, 475558548, 475787010, 476158600, 476783142, 477578735, 477779922, 477378006, 477278137]
1457.2D77278137P68395L491401K074929J846161J058311N70145J081276P5836J489448
1465.9D89734039J547776K010574K021255K130738J846161L38287J691704K775192
1473.6E04095726L779144K830696J625405J994972J997604J576043J415367J928367
1481.3E21243324J864739J605758J683274J284218N68656k77977r9334J078491K6474
1490E28977623l14598J027641P73735m23660r37386j015319m281311J88903m42085
1498.7E23553543k002716m7798p07817n51796o51360J74065n30624p061043k676888
1507.3E09497566K899361J972618L36227J109581j28593r65729m64172j261368j237869
1516E11757622k856179P05834J568642P44934j057511k085876J552124J577797R28345
$$ y = [477278137, 478046532, 481537933, 483612862, 485459023, 486517334, 487087479, 488168755, 488244591, 489734039, 491281815, 493292389, 495313644, 497444382, 499290543, 499628830, 501320534, 504095726, 507874870, 510705566, 512330971, 514325943, 516323547, 517899590, 519314957, 521243324, 523108063, 524713821, 526397095, 527681313, 528249969, 527971992, 527872658, 528951149, 528977623, 528663025, 529690666, 530464401, 530040741, 529103355, 528088036, 523806725, 523995628, 523553543, 521550827, 521503029, 520795212, 520243416, 519592056, 519766121, 519235497, 512174454, 509497566, 512396927, 514369545, 514705772, 515815353, 515686760, 514721031, 514256859, 512995491, 511757622, 508901443, 509607277, 511175919, 511920853, 510863342, 508777466, 510329590, 511907387, 512835732]
1524.7E12835732j541291O46820P52526O76689J755638R41849Q10356J37558R2621
1533.4E17108498m39492J119004M68788l14102N73425l582497j877823K264138J655235
1542.1E16975174R09500P15408L56942m59366J249885j43013n3329k56920j47362N09262
1551.7E19656181k55966j90544l066368N73845M25682q18443o506577j0771217R999237
1560.4E09045830J07803L43247j156464j076927k797089k852897j184044k853585k102165
1569.1D95473709p487907j111565j535644k691842j782302k830315j738129j0959968
1576.8D65336037p14531j889992l265724l295975m447212k451401m116859k326317
1584.5D42828026l621178l146934l162346l779373k365342m597969k269325l988342
$$ y = [512835732, 511294441, 511941261, 512693787, 513370476, 515126114, 516067963, 516878319, 517015877, 517108498, 516669006, 517788010, 518256798, 517942696, 518516121, 514933624, 513055801, 515319939, 516975174, 517884674, 518600082, 518957024, 518497658, 519747543, 519604530, 519551201, 519294281, 519146919, 519656181, 519400215, 519209671, 516143303, 516717148, 517142830, 516324387, 509817810, 499046593, 509045830, 509153633, 509496880, 508340416, 507263489, 504466400, 501613503, 500429459, 497575874, 495473709, 487985802, 486874237, 485338593, 482646751, 480864449, 478034134, 476296005, 465336037, 464621506, 462731514, 459465790, 456169815, 451722603, 449271202, 445154343, 442828026, 439206848, 436059914, 432897568, 429118195, 426752853, 422154884, 419885559, 415897217]
1592.2D15897217k124405k247429l012772j579246l594475j664619l769684j677971
1599.9C96226616k466240k530136j347466k718849l80745k348785n12657k164383j510620
1608.6C80246735j769410k024116M74892k233658J39847j553498K88773j030235m526864
1617.3C68012466L228722o61201N18417j665993O85654j74561q58688J873932j7471
1626C70941277K329368q10470J096725J71204J26342Q45757J92223K628364J63078
1634.6C77683868K254448Q30231L551254J701699P94601K148094L14865K233773L77693
1643.3C91890526J565246R04503m91447L407249j97677L609848J343078K474060J116791
1652D05622177m735832J160660L022842M250603J070137K431755J572151J801605J744843
$$ y = [415897217, 413772812, 411525383, 408512611, 406933365, 403338890, 401674271, 397904587, 396226616, 393760376, 391230240, 389882774, 387163925, 386783180, 384434395, 383921738, 381757355, 380246735, 378477325, 376453209, 376928101, 374694443, 374834290, 373280792, 373569565, 372539330, 368012466, 371241188, 370579987, 371098404, 369432411, 370118065, 369943504, 369084816, 370958748, 370941277, 373270645, 372460175, 373556900, 373728104, 373854446, 374700203, 374892426, 377520790, 377683868, 379938316, 380768547, 384319801, 386021500, 386816101, 388964195, 389279060, 391512833, 391890526, 393455772, 394360275, 393868828, 397276077, 397078400, 400688248, 402031326, 404505386, 405622177, 400886345, 402047005, 405069847, 409320450, 410390587, 412822342, 414394493, 416196098, 417940941]
1660.7D17940941J252060K157097K62413L084335J646576K362060K543793K000771
1668.4D33250046K833290K183266M642868J934127L033638K648926K122879K674828
1676.1D55323868K754288M177703K862168L733673K828026L932876M223671J051293
1683.8D80887566L779106K280426M963531L621292L563424M175186L804016M110031
1691.5E11184578L847008L779220K982254L248902J430206M562607N080223M469070
1699.3E40584068J930847J344414O814690M483375L103943K055970K700843K342873
1707E65361023L167419L956452K600403K788658K507858K020111J899758O05964J227570
1715.6E86135216K806892J228256j871719M747238L596420K095185J563186J017380
$$ y = [417940941, 419193001, 421350098, 421612511, 424696846, 426343422, 428705482, 431249275, 433250046, 436083336, 438266602, 442909470, 444843597, 447877235, 450526161, 452649040, 455323868, 458078156, 462255859, 465118027, 468851700, 471679726, 475612602, 479836273, 480887566, 484666672, 486947098, 491910629, 495531921, 499095345, 503270531, 507074547, 511184578, 515031586, 518810806, 521793060, 525041962, 526472168, 531034775, 536114998, 540584068, 542514915, 543859329, 550674019, 555157394, 558261337, 560317307, 563018150, 565361023, 568528442, 572484894, 575085297, 577873955, 580381813, 582401924, 584301682, 584907646, 586135216, 588942108, 590170364, 588298645, 593045883, 596642303, 598737488, 600300674, 601318054]
1723.4F01318054J229859J450004J278916R04922J260796J612243R55735J789360L076133
1732F14876022K620545j671868j860008L655434K971763J323395K223969J335792P4959
1740.7F25550003L846664K692681J235618K265511K478142J613693J224365J566010
1748.4F42472687Q48160L733520L045044K473602M359131K868805K198410J530151
1756.2F63529510m9514K123642K551346J959381K347183N80063K176819L535156J621094
1764.8F80374680J243057R99069M21066j333160J831283K851944p16781n18036J808701
1773.5F86961823L995437J940537m80271J172638K51846O66733j68609K27585J902389
1782.2F96470108K100143J909409L78952N02091O08215M73785j36947J63421l52249
$$ y = [601318054, 602547913, 603997917, 605276833, 606181755, 607442551, 609054794, 610010529, 611799889, 614876022, 617496567, 615824699, 613964691, 617620125, 620591888, 621915283, 624139252, 625475044, 625550003, 629396667, 632089348, 633324966, 635590477, 638068619, 639682312, 640906677, 642472687, 643320847, 647054367, 650099411, 652573013, 656932144, 659800949, 661999359, 663529510, 663479996, 665603638, 668154984, 670114365, 672461548, 673041611, 675218430, 678753586, 680374680, 681617737, 682616806, 683037872, 681704712, 683535995, 686387939, 685671158, 685153122, 686961823, 690957260, 692897797, 692417526, 693590164, 693842010, 694508743, 694340134, 694567719, 696470108, 698570251, 700479660, 700858612, 701360703, 701968918, 702442703, 702305756, 702469177, 702116928]
1790.9G02116928j10702L46298J136322L657455J428604j24435O63300L89556q94394
1799.5G08608932j400146J306076J38931J626282K246094J474304J405411M120q7891
1808.2G15322113q5678j57929j650848M15649J742325J193390K047653J037369J149063
1816.9G21013107Q6518k98310l12195r47647J62812m82560J102219J416855n0812J188507
1826.5G22878494J833191J207123j271133k897263K73132J301194k20261N65491J448516
1835.2G25118484J119690J206055L93677Q82110o41708l87573l63464k91749l8299
1843.9G26997223l010101K850036K659149J064606N38941L20892L27530j089173n67398
1852.6G30091705n91659K01111O60781Q77762R83887L76358J162415N8822j88293q02994
$$ y = [702116928, 702006226, 702352524, 703488846, 707146301, 708574905, 708450470, 709113770, 709503326, 708608932, 707208786, 708514862, 708653793, 710280075, 712526169, 714000473, 715405884, 715410004, 715322113, 715236435, 715078506, 713427658, 713843307, 715585632, 716779022, 718826675, 719864044, 721013107, 721099625, 720801315, 720489120, 719541473, 719704285, 719221725, 720323944, 721740799, 721689987, 722878494, 724711685, 725918808, 724647675, 721750412, 722023544, 723324738, 723104477, 723669968, 725118484, 726238174, 727444229, 727837906, 728720016, 728078308, 727690735, 727327271, 727035522, 726997223, 723987122, 726837158, 729496307, 730560913, 731099854, 731420746, 731748276, 730659103, 730091705, 729500046, 729701157, 730361938, 731239700, 732223587, 732599945, 733762360, 733821182, 733632889, 732829895]
1862.2G32829895n72968M1733k15759Q19550L79867R31015n91049o37894J090241O58722
1871.9G34733353K06451p48520J61972R5902O64978J008377N14908N75180M6920L75443
1881.5G37634964n69839l03422n78765o19736N30548M48456J308899M74853j64032
1890.2G38161926M59976L84675n70527q60443o68487q31986J049881J067963J172485
1898.9G39365463Q82340L0899J58386o03409n28030p82089Q0947K21482J01776P63779
1908.5G39691544M39071M92020m3335N52826k26441o27441m69818l62320O60706j072388
1918.2G39034424K17132J437149J230011N17044j425018m94308L54919k77710r70154
1926.8G39623489J60141P67975O46668P64160M14047N11170m13971n72586r91745p61796
$$ y = [732829895, 732256927, 732298660, 732082901, 732902451, 733282318, 734213333, 733622284, 732984390, 734074631, 734733353, 734939804, 734191284, 734353256, 734449158, 735114136, 736122513, 736637421, 737212601, 737259521, 737634964, 737065125, 736761703, 736182938, 735563202, 736093750, 736542206, 737851105, 738325958, 738161926, 738621902, 739006577, 738436050, 737575607, 736907120, 736075134, 737125015, 738192978, 739365463, 740247803, 740278702, 740437088, 739833679, 739305649, 738523560, 738604507, 738825989, 738927765, 739691544, 740130615, 740622635, 740579300, 741132126, 740905685, 740278244, 739808426, 739446106, 740106812, 739034424, 739251556, 740688705, 741918716, 742435760, 741010742, 740516434, 740871353, 740593643, 739623489, 739783630, 740551605, 741198273, 741962433, 742376480, 742887650, 742473679, 741901093, 740909348, 740147552]
1936.5G40147552j67465p3318P03811N53666J264648J19553p46460O29883j46790j006546
1946.1G41278534j192322j50909J28708K20413K63977O57654J237106J86462n17349
1954.8G42112274r27582o35452o79474n1117L65601J297O20193M08707N66635l815
1964.5G41777267j49154m47846j218490m42658m23660K76642L36838N62133P59583
1973.1G41030655L26691K87323l45536m65469q07114k26440j6327R308K29263j24054
1982.8G39898300O38962N27344l357m69208k57416n77774o23779J77460n27878L815
1992.4G38786469M79736O80160L66593Q2855o3477j142501l79944m59290j89209J20087
2002.1G38281479q6365N59006J11465K63596J35803m12750j063385p86896j66092k70157
$$ y = [740147552, 739980087, 739906769, 740610580, 741164246, 742428894, 742548447, 741801987, 742431870, 742285080, 741278534, 740086212, 739935303, 740064011, 740284424, 740548401, 741206055, 742443161, 742629623, 742112274, 741184692, 740549240, 739869766, 739818649, 740184250, 740185547, 740805740, 741214447, 741781082, 741777267, 741628113, 741180267, 739961777, 739519119, 739095459, 739372101, 739708939, 740271072, 741030655, 741357346, 741644669, 741299133, 740833664, 740026550, 739800110, 739783783, 739793091, 740022354, 739898300, 740537262, 741064606, 741061249, 740592041, 740334625, 739756851, 739133072, 739310532, 738782654, 738786469, 739266205, 739946365, 740312958, 740395813, 740332336, 739189835, 738809891, 738350601, 738161392, 738281479, 738195114, 738754120, 738865585, 739129181, 739264984, 738852234, 737788849, 737001953, 736835861, 736565704]
2011.7G36565704L37906J82190K20719M79431L46069m90189n76324k53906o68564k76032
2021.3G35867004m57153J95541N33753K32239L38211p5913j92184p65839m06036m01001
2031G34868622k33307K83050M7074J34811o9961M79965R8648k21558n04760q74939
2040.6G34007645j84174j61972n6534n07431L37601P98111l6621m00925m57916N04989
2050.3G33842773m10385q62732k89535P1030L50341J62049N41229m8523J92490J3580
2059.9G33562317o76651l69034l52173l95889o83365K89002O96868O37894M75235k14310
2069.6G32969894n10482o89545j70059m94843m56924l1662L77655P61490L65448K97699
2079.2G32418671k12250n03159q00476l61023p8964j86157K56729j0529M72565O4163
$$ y = [736565704, 736903610, 737085800, 737306519, 737785950, 738132019, 737641830, 737065506, 736811600, 736143036, 735867004, 735409851, 735605392, 736139145, 736371384, 736709595, 736633682, 736441498, 735675659, 735269623, 734868622, 734635315, 734918365, 734965439, 735100250, 735030289, 735510254, 735608902, 735387344, 734882584, 734007645, 733823471, 733661499, 733604965, 733097534, 733435135, 734233246, 734196625, 733795700, 733337784, 733842773, 733432388, 732569656, 732280121, 732351151, 732701492, 732863541, 733404770, 733356247, 733548737, 733562317, 732885666, 732516632, 732164459, 731768570, 731085205, 731374207, 732071075, 732708969, 733184204, 732969894, 732459412, 731769867, 731599808, 731104965, 730648041, 730616379, 730994034, 731755524, 732120972, 732418671, 732206421, 731703262, 730902786, 730541763, 730462799, 730276642, 730533371, 730522842, 730995407, 731059570]
2088.9G31059570k05078J48392k37351n82885p32575j46103m30603l4561K67258K88162
2098.5G29394226P30362J56555j10779o03103o05088n69915l04261k48260l07159M34951
2108.1G27967529K85492N16892O0501k47193m34494p48825k64740m74014L05J68381
2117.8G26829834M04282L80706K61002J05820o68183p4920j17340j88218k04773l9901
2127.4G26688309k38495m93393P39593K61231o6834j20620l33863m19387m92783K73895
2137.1G25797653K57263L23105p9117L41111L83682k96784j5029m83246k02637j05820
2146.7G25920181Q9264q7585j34964M95758N3558L00369J18027L5248l22037p12356
2156.4G25755463l09601O3705O39038J57471K76794J37024p629J23444l05863k59399
$$ y = [731059570, 730854492, 731002884, 730765533, 730182648, 729450073, 729303970, 728873367, 728838806, 729106064, 729394226, 730124588, 730281143, 730170364, 729567261, 728962173, 728392258, 728087997, 727839737, 727532578, 727967529, 728253021, 728769913, 728830414, 728583221, 728148727, 727399902, 727135162, 726661148, 726661453, 726829834, 727234116, 727614822, 727875824, 727981644, 727313461, 727238541, 727121201, 726932983, 726728210, 726688309, 726449814, 725956421, 726696014, 726957245, 726890411, 726769791, 726435928, 726016541, 725523758, 725797653, 726054916, 726378021, 726298904, 726640015, 727023697, 726726913, 726711884, 726228638, 726026001, 725920181, 726009445, 725921860, 725786896, 726282654, 726336212, 726636581, 726754608, 726789856, 726467819, 725755463, 725445862, 725509567, 726148605, 726306076, 726582870, 726719894, 726712265, 726835709, 726529846, 726270447]
2166G26270447n60837j39465L3874K80914M68674M13284N94712j27869k39639m64935
2175.6G26529160m83246l42713j53045R9105N9815N89371P59735Q63800N5008l47672
2185.3G27629318p3547k06986m34265o77185K38190L04184J74179J46408K28500K77710
2194.9G27606506r5367L16620n91889p47604l84369J30234R04388K47574L67127L58352
2204.6G28111572M41132K63061l79104o17905o47964n50232l06168P06635O02798O60629
2214.2G28284454M14963R7733K3269p57293j49613m97970l03574K86636K77176N51605
2223.9G28227386R3461J96228Q8729K83280m10004o76269r6741j00708K77557k42843
2233.5G27640076L73840M17404O1035K11716o2637P934o27212n6305q6594j12610L29743
$$ y = [726270447, 725709610, 725570145, 725604019, 725884933, 726353607, 726766891, 727361603, 727233734, 726994095, 726529160, 726045914, 725703201, 725550156, 725649261, 725709076, 726298447, 727058182, 727921982, 727976990, 727629318, 727555771, 727348785, 726914520, 726237335, 726475525, 726779709, 726953888, 727100296, 727328796, 727606506, 727511139, 727827759, 727235870, 726488266, 726103897, 726234131, 727138519, 727386093, 727753220, 728111572, 728552704, 728815765, 728436661, 727818756, 727170792, 726620560, 726314392, 727021027, 727623825, 728284454, 728699417, 728797150, 728820419, 728063126, 727913513, 727415543, 727111969, 727398605, 727675781, 728227386, 728320847, 728517075, 728605804, 728889084, 728479080, 727802811, 727706070, 727605362, 727882919, 727640076, 728013916, 728431320, 728492355, 728704071, 728641434, 728649368, 728022156, 727965851, 727879257, 727766647, 728096390]
2244.1G28096390K2354L79486L30353P5531n52979l42178n67398n74417K46200M19236
2253.8G27532578P90252k35977l63159K6321M48838K33688q29086j43204k11029O9275
2263.4G27318497M0054L3340N60990K50168K28729j50452j93939p76367l13721J22986
2273G27120285R8114N24521k14462J28936j24816l2425O6986n51453n09262o19583
2282.7G25886841K11639o1188n6610N13001O17752M04129j35803j8845o55441l49198
2292.3G26356277k98690m40674L2959K18582O24466M17709L81546l98712l82767m00924
2302G26109772m97818p7973q67233j44730J78071P28225P96662L14941M36020l71170
2311.6G26604767k17667j176452p06330J01395j02768M91867M5700K18048k00348L16315
$$ y = [728096390, 728118744, 728498230, 728828583, 728904114, 728351135, 728008957, 727441559, 726867142, 727113342, 727532578, 728322830, 728086853, 727723694, 727750015, 728198853, 728432541, 727603455, 727460251, 727249222, 727318497, 727358551, 727391891, 727952881, 728203049, 728431778, 728281326, 728087387, 727311020, 726997299, 727120285, 727218399, 727742920, 727528458, 727657394, 727532578, 727500153, 727567139, 727015686, 726506424, 725886841, 726098480, 726037292, 725980682, 726493683, 727111435, 727515564, 727379761, 727360916, 726705475, 726356277, 726057587, 725616913, 725649872, 725868454, 726492920, 726910629, 727292175, 726893463, 726510696, 726109772, 725611954, 725533981, 724666748, 724522018, 724700089, 725428314, 726224976, 726539917, 726975937, 726604767, 726387100, 725210648, 724504318, 724605713, 724502945, 724994812, 725040512, 725258560, 725058212, 725374527]
2321.3G25374527L43552k29264n54504j153259m8981M46777J091996j32676k27966
2329.9G24910202K77405l45078J93863r01565k6017K70920o81839o60629M95605N63279
2339.6G24096146q75397k02408l96805O47431K50702r61304m11682o49872q67233l84522
2349.2G20245056Q99658O1798m19769O88324J161499Q13446q76694J28022o20117L86657
2358.9G22467880K47193q55713k6932l27454O35147k138519q06656J004105k82517
2367.6G19916534l29361n38024P705l66363K13012k97317p58438m88281j83564J91498
2377.2G17367401l66516k50854q22602o02112K2355K33306J56022o22483m48990m14734
2386.8G14250793k34222j93405j40915R3918Q5754M1504m06952J02539l34778q51135
$$ y = [725374527, 725718079, 725488815, 724934311, 723781052, 723732071, 724178848, 725270844, 725138168, 724910202, 725187607, 724842529, 725036392, 724134827, 724108810, 724379730, 723697891, 723037262, 723532867, 724096146, 723220749, 723018341, 722621536, 723268967, 723519669, 722558365, 722146683, 721496811, 720629578, 720245056, 721144714, 721206512, 720786743, 721475067, 722636566, 723450012, 722573318, 722701340, 722081223, 722467880, 722715073, 721859360, 721832428, 721504974, 722140121, 720001602, 719194946, 720199051, 719916534, 719587173, 719049149, 719056854, 718690491, 718903503, 718606186, 717847748, 717359467, 717175903, 717367401, 717000885, 716750031, 715927429, 715325317, 715347672, 715580978, 715737000, 715114517, 714665527, 714250793, 714016571, 713823166, 713682251, 713776169, 713861923, 713903427, 713496475, 713599014, 713264236, 712413101]
2396.5G12413101n05447j81961K40936k58408k91595j58844L40271P8278m56238m47617
2406.1G10772476q87527k05994k42462k04086M7607K8992K34833j92185j15280l35846
2415.8G08900528m53339o39190m42200k79465n45349j34659Q927M34036k99225n50918
2425.4G05999146J13754m8218l58124q51440j88217j77002m75083k19726O7062J38626
2435.1G04000778n70297l53394o4849k20795o22788l91998m95148n76629K43912m62494
2444.7G00486298k74506J42288j58386l94516l81928K30103k56424l25088m13742l63160
2454.3F98290939j47934l02505l14026n23605N3711l03421q19855o35224j00402J78375
2464F95376053k77863k68860m73709m7378j50070j03302k63520j299286m39605L1891
$$ y = [712413101, 711907654, 711725693, 711966629, 711708221, 711416626, 711257782, 711598053, 711676331, 711220093, 710772476, 709884949, 709678955, 709436493, 709232407, 709280014, 709309006, 709543839, 709351654, 709236374, 708900528, 708447189, 707807999, 707365799, 707086334, 706540985, 706406326, 706415253, 706849289, 706550064, 705999146, 706112900, 706064682, 705706558, 704855118, 704666901, 704489899, 704014816, 703795090, 703862152, 704000778, 703430481, 703077087, 703012238, 702791443, 702168655, 701776657, 701281509, 700704880, 700948792, 700486298, 700211792, 700354080, 700195694, 699801178, 699419250, 699649353, 699392929, 699067841, 698654099, 698290939, 698143005, 697840500, 697526474, 697002869, 697056580, 696753159, 695933304, 695298080, 695197678, 695376053, 695098190, 694829330, 694355621, 694308243, 694158173, 694054871, 693791351, 692492065, 692052460, 692084351]
2473.6F92084351j07727l75290n86396m81567l04184j7166m29764m40903n67093l48663
2483.3F88425598k76565j01700J57776k87857k45438r98383o64444k25601m88205k40936
2492.9F85054245l26080j34354n78232q2626J13373m86679n09339q27255n71899m81949
2502.6F81169205n73502n00793J82342Q0948j09253J98059p30896o25381l58353m26559
2512.2F78305817p28684n76248j94092n91049L3112j51596l41797l23868k33460k39181
2521.9F74958954q39081k80151o21567n22308j1216K2812j26495m69895L8834m67987
2531.5F71681900l71551m15802p95823l03268m67300l77884n07965l88871j09863m5395
2541.1F67898178k16598j72043p2174q67691n99366m16336l93219j1367j52970k32086
$$ y = [692084351, 691976624, 691601334, 691014938, 690533371, 690229187, 690212021, 689782257, 689341354, 688774261, 688425598, 688149033, 688047333, 688205109, 687917252, 687671814, 686673431, 686008987, 685783386, 685295181, 685054245, 684728165, 684593811, 684015579, 683932953, 684046326, 683559647, 683050308, 682223053, 681651154, 681169205, 680595703, 680094910, 680277252, 680358200, 680248947, 680447006, 679716110, 679090729, 678732376, 678305817, 677577133, 677000885, 676806793, 676215744, 676248856, 676097260, 675755463, 675431595, 675198135, 674958954, 674119873, 673839722, 673218155, 672695847, 672684631, 672707443, 672580948, 672111053, 672149887, 671681900, 671310349, 670894547, 670098724, 669795456, 669328156, 668950272, 668442307, 668053436, 667943573, 667898178, 667681580, 667509537, 667437363, 666569672, 665970306, 665553970, 665160751, 665149384, 664996414, 664764328]
2550.8F64764328k53677k44980o72608m73022j21002j86081k66876l69339j83335k14920
2560.4F61778488j38779l90777n38559n40085l41720k79618o88858k31628k11182k01416
2570.1F58215866K518n5008k82974o92826l50342k54058l88489m98505k19116k94952
2579.7F55182114k31247K04010n31845n61753m67300j44959k58560p76138k4185k83737
2589.4F52106400l21503m730k34375m68064n90744m43344l67508j28174n86624m69665
2599F48491669j54572l78876n5465P4768n188m48685r98077j121292j31607L68042
2608.6F45640717k33536n71518p43256k63290l58124m44870n37262n44357K8839m05274
2618.3F41568069n33065p20063l20701L23448l41721m51965l68271m88128m21105k48337
$$ y = [664764328, 664510651, 664265671, 663593063, 663120041, 662999039, 662812958, 662546082, 662176743, 661993408, 661778488, 661639709, 661248932, 660710373, 660170288, 659828568, 659548950, 658860092, 658628464, 658417282, 658215866, 658218384, 658163376, 657880402, 657187576, 656837234, 656583176, 656194687, 655696182, 655477066, 655182114, 654950867, 655154877, 654623032, 654061279, 653593979, 653449020, 653190460, 652414322, 652390137, 652106400, 651784897, 651780167, 651545792, 651077728, 650486984, 650043640, 649676132, 649547958, 648961334, 648491669, 648337097, 647958221, 647902756, 647977524, 647972336, 647523651, 646525574, 645404282, 645272675, 645640717, 645407181, 644835663, 644092407, 643829117, 643470993, 643026123, 642488861, 641944504, 641973343, 641568069, 641035004, 640314941, 639994240, 640317688, 639975967, 639524002, 639155731, 638667603, 638246498, 637998161]
2627.9F37998161k13508l42446r18045q64105J30882L8872l39737o69632m98848j57127
2637.6F34164467m71382n05905n75791n05905n21927m02412l45764k41776o8626n94406
2647.2F29930573o50063n49316m05579k01950m05769n83153j35422K480o37551m57153
2656.9F25907097n96123n56335j54991k81945r3040l02162l32413l65181l14369K4261
2666.5F22934799q9912n02625r34715o40640l80631j97525L2196j96457m75120l43361
2676.1F19206009l66631n69000j18408j09978j58119l76854m03023J77574l93028q60519
2685.8F16028023n29862q01k86293m61464q354n11703n94521l94363l81890j37748
2695.4F12721024K83012j4839p94983o55785n99975n26505n23186l29780j42327j30882
$$ y = [637998161, 637784653, 637442207, 636524162, 635660057, 635790939, 635829811, 635490074, 634820442, 634321594, 634164467, 633693085, 633187180, 632611389, 632105484, 631583557, 631181145, 630835381, 630593605, 630524979, 629930573, 629280510, 628731194, 628325615, 628123665, 627717896, 627134743, 626999321, 627001801, 626364250, 625907097, 625310974, 624754639, 624599648, 624317703, 624224663, 623922501, 623590088, 623224907, 622910538, 622934799, 622844887, 622342262, 621407547, 620766907, 620386276, 620188751, 620220947, 620024490, 619549370, 619206009, 618839378, 618270378, 618151970, 618041992, 617883873, 617507019, 617103996, 617281570, 616888542, 616028023, 615498161, 615497360, 615211067, 614749603, 614741249, 614229546, 613635025, 613240662, 612858772, 612721024, 613004036, 612989197, 612194214, 611538429, 610938454, 610411949, 609888763, 609558983, 609416656, 609285774]
2705.1F09285774M006k89536J23634j02119n61752n26848o72875l51333m05884k39487
2714.7F06263580k82592l33367j20087l41033k40136P0076K56195k75917n65147n08347
2724.4F03923225l96804q355k13661n05028k50282j449o04592n30205M1275M311o7367
2735F01391068k87018j18676l39660n06134k22359N6610K46735j50795l17917m12674
2744.6E99339180m47617l97758o5422J4763j31569k4796m41475j74141r1362j79061
2754.3E97400742k35100p56188m12407R5025K77214m39835n71518j30157l13683m7684
2763.9E94866409j17759k25678l27721l23257m31633n25856L6697p2746n29823n38941
2773.5E91809692L8987R1209l73306n13535k80342k79846j054039n84488R3574p1754
$$ y = [609285774, 609289780, 609000244, 609123878, 609021759, 608460007, 607933159, 607260284, 606908951, 606503067, 606263580, 605980988, 605647621, 605527534, 605186501, 604946365, 605016441, 605272636, 604996719, 604431572, 603923225, 603526421, 603518066, 603304405, 602799377, 602549095, 602547646, 601943054, 601412849, 601454124, 601458435, 601391068, 601104050, 600985374, 600645714, 600139580, 599917221, 599973831, 600220566, 600069771, 599751854, 599339180, 598891563, 598493805, 598428383, 598443146, 598311577, 598286781, 597845306, 597671165, 597579803, 597400742, 597165642, 596409454, 595997047, 596092072, 596369286, 595929451, 595357933, 595227776, 594914093, 594866409, 594748650, 594522972, 594195251, 593871994, 593440361, 592914505, 592951202, 592878456, 592348633, 591809692, 591848679, 591939888, 591566582, 591053047, 590772705, 590492859, 589438820, 588854332, 588947906, 588876152]
2783.2E88876152l18718n20439k70577r2620q4305m14658k58751l80630p46727n09262
2792.8E85279465n65453m61235m38194j54839m13666n71784l04833p50656m55513l60565
2802.5E80802727l02773m65927o40449k25449o74973q00056m11034J32828l12958j296386
2812.1E75805550q75054l81431m67110o00166m55284m00010m34379n98297o83556m29993
2821.8E70480270m27932n84832p10220n35202m93240o42205r57794p56759k39563m49028
2831.4E64683495n57747o75431o86416j161804r97353n71365j143685p72133q79821
2840.1E57237740r45054j098403j462670j261291j555291j240730j750717j833763
2847.8E46089821j357575j482200j238518j358032q66432o94199k37503L0975j61323
$$ y = [588876152, 588557434, 588036995, 587766418, 587673798, 587589493, 587174835, 586916084, 586535454, 585788727, 585279465, 584714012, 584252777, 583814583, 583659744, 583246078, 582674294, 582369461, 581618805, 581163292, 580802727, 580499954, 580034027, 579393578, 579168129, 578493156, 577693100, 577282066, 577414894, 577101936, 575805550, 574930496, 574549065, 574081955, 573481789, 573026505, 572626495, 572192116, 571593819, 570910263, 570480270, 570052338, 569467506, 568757286, 568222084, 567728844, 567086639, 566128845, 565372086, 565132523, 564683495, 564125748, 563450317, 562763901, 561602097, 560604744, 560033379, 558889694, 558117561, 557237740, 556292686, 555194283, 553731613, 552470322, 550915031, 549674301, 547923584, 546089821, 544732246, 543250046, 542011528, 540653496, 539787064, 539092865, 538855362, 538886337, 538725014]
2856.5E38725014K71454l77694m28962r8725j84517m77447o22940k4872j24092n62859
2866.1E36094360n51223k19880o63909r62563m03900j34888k64397o77604n08805n62019
2875.8E31145172n21927l01895o84318p20635l70979o2218k19498l5209k86293r39637
2885.4E27002563r84573j145019o12832q6746o04591j344528q58918j23901l07045
2894.1E20934410m70467q37478p44171n77774r55696j079178l99018j65519q03376
2902.8E14901733k64358j11656n97611q77952j320649p16552k39601r51271j437760
2911.4E08384323p29103l42369r83963j402779j330833j244011p98187o46057j595498
2920.1D99311523j234855n17235n10788m92477p85218M6158M78592K72827K46239Q5716
$$ y = [538725014, 538996468, 538618774, 538189812, 538091087, 537906570, 537429123, 536806183, 536781311, 536657219, 536094360, 535543137, 535323257, 534659348, 533696785, 533292885, 533157997, 532893600, 532215996, 531707191, 531145172, 530623245, 530321350, 529637032, 528916397, 528545418, 528483200, 528263702, 528228493, 527942200, 527002563, 526017990, 524872971, 524260139, 524173393, 523568802, 522224274, 521365356, 521241455, 520934410, 520463943, 519626465, 518882294, 518304520, 517348824, 516269646, 515870628, 515705109, 514901733, 514637375, 514525719, 513928108, 513050156, 511729507, 511012955, 510773354, 509822083, 508384323, 507655220, 507312851, 506328888, 504926109, 503595276, 502351265, 501553078, 500907021, 499311523, 498076668, 497559433, 497048645, 496556168, 495770950, 495817108, 496295700, 496568527, 496814766, 496900482]
2929.8D96900482o5841l04375K19841L67241M95071R27429P01523L19443K89841M15611
2939.4E00266266N76630J106262M37431J84631O11077j7205M51622Q81615L23639J12953
2949.1E04934921O31218R20754K37732l35617k53754J73530M28772Q36182L69034q4496
2958.7E07858276M62914M62646M46091K49939M9133O0273K94303N13878N72815P09954
2968.3E11680222K02980M14581P87697M35333J86768L35388M51660n3635K30141M73518
2978E15144653J94168L25737M54102L74527Q6212k51388l25470J72920l0747j24855
2987.6E16019859Q5526L5057O83823L15895n7793J81694l16963o58951j00517L26461
2997.3E16514091m86602o49071k04506k15950j21765j24664n07965o08254l49922o02837
$$ y = [496900482, 496834641, 496530266, 496750107, 497117348, 497612419, 498539848, 499241371, 499560814, 499850655, 500266266, 500842896, 501949158, 502386589, 502571220, 503182297, 503165092, 503616714, 504498329, 504821968, 504934921, 505566139, 506486893, 506724625, 506389008, 506135254, 506308784, 506737556, 507573738, 507942772, 507858276, 508321190, 508783836, 509229927, 509479866, 509528999, 509589272, 509883575, 510397453, 510970268, 511680222, 511883202, 512297783, 513085480, 513520813, 513707581, 514042969, 514494629, 514440994, 514671135, 515144653, 515338821, 515664558, 516118660, 516493187, 516579399, 516328011, 516002541, 516175461, 516144714, 516019859, 516105385, 516140442, 516824265, 517140160, 517082367, 517264061, 516947098, 516288147, 516187630, 516514091, 516027489, 515378418, 515173912, 514957962, 514836197, 514711533, 514203568, 513595314, 513245392, 512642555]
3006.9E12642555k33574k6779o49910n52063r956j71318q08106n34324l33214m50287
3016.6E08873024m11797j77536j51558n18798n22919q14285k91634j57432n51339n96122
3026.2E04679604j104660m97399m61273j87340J25809o24352m73556q74519p32117
3034.9D99850197m04167o56243n86204m38423k21520n39741m07944k13089m40559p60766
3044.5D95181541q14590o92558o89278m18320m91066k47230m37775r74808r55925o93397
3054.2D88766594l09219o08750n07622n92994r47037p20329k14577J41678o50749q85926
3063.8D83471069k18162J74179l09525q30001m95224o87104p25326m39644j60446j33858
3073.5D79645958o22978o71807m40101m95033m84276l42293o27556m65050m91638m23660
$$ y = [512642555, 512408981, 512382202, 511732292, 511180229, 511170273, 510998955, 510190849, 509656525, 509323311, 508873024, 508461227, 508283691, 508132133, 507613335, 507090416, 506276131, 505984497, 505827065, 505275726, 504679604, 503574944, 503077545, 502616272, 502428932, 502554741, 501930389, 501456833, 500582314, 499850197, 499446030, 498789787, 498203583, 497765160, 497543640, 497003899, 496595955, 496382866, 495942307, 495181541, 494366951, 493674393, 492985115, 492566795, 492075729, 491828499, 491390724, 490415916, 489459991, 488766594, 488457375, 487848625, 487341003, 486748009, 485800972, 485080643, 484866066, 485007744, 484356995, 483471069, 483252907, 483427086, 483117561, 482287560, 481792336, 481105232, 480379906, 479940262, 479779816, 479645958, 479022980, 478351173, 477911072, 477416039, 476931763, 476589470, 475961914, 475496864, 475005226, 474581566]
3083.1D74581566L04680n0888n34325q19321o66542k81639m38843n88836q84705q39043
3092.7D69782104n83343j70708j78375n50156l82194J57699R7199q94089q26034o30532
3102.4D65821571m16183j94702o34270l11203n54047p82585o79016o86340k84996j48392
3112D61129837p5455n40504q52623o86684l34396j47934n99403o96946m07447k97509
3121.7D56490936l52745l84063r18465q78830k18277m79279n14183n40313j017571
3130.4D51187210p57103j56631l74337j71432r3613j002807r72901o41632j06544j92986
3140D46717224q70781o15692m17480k91558o90422q80775n49927m29344n95474l97377
3149.6D40978394j14251r83963o51817n03502j048050o95915n10063k54212p85904
$$ y = [474581566, 474886246, 474835358, 474301033, 473481712, 472815170, 472533531, 472094688, 471505852, 470621147, 469782104, 469198761, 469028053, 468849678, 468299522, 467917328, 468075027, 468172226, 467278137, 466452103, 465821571, 465405388, 465210686, 464576416, 464265213, 463711166, 462928581, 462249565, 461563225, 461278229, 461129837, 461054382, 460513878, 459661255, 458974571, 458640175, 458492241, 457892838, 457195892, 456788445, 456490936, 456138191, 455754128, 454835663, 453956833, 453738556, 453259277, 452745094, 452204781, 451187210, 450430107, 450273476, 449899139, 449727707, 449634094, 448631287, 447658386, 447016754, 446910210, 446717224, 445846443, 445230751, 444813271, 444521713, 443831291, 442950516, 442400589, 441971245, 441375771, 440978394, 440864143, 439880180, 439228363, 438724861, 437676811, 436980896, 436470833, 436216621, 435430717]
3158.3D35430717n54275q6479o16455q84857q35724n47524q32519n42412n36995m63257
3168D29530220j11351o87675l19291l72581o70853n70297p45430q84399p43256m60663
3177.6D23964424o30722k01759l98445m59443k53677q00323p17240r60731p09763l93219
3187.3D18439102m39224l63274m49524l25431o58265n50384o52733p64847o10618p39251
3196.9D12885551l48930m63257p24067p79953j43967L36151m89616r50241n03159R8610
3206.5D08917122m13056r55314r36699o63834k20756k44026O9351m28314r80149o19316
3216.2D03525009o52923j88752J89515l47748q71353p83387m48227j31416J01166k48070
3225.8D00143814q79173r81331m94118k17056n55496o07720L0594j97296q07800m04282
$$ y = [435430717, 434876442, 434789963, 434173508, 433288651, 432452927, 431905403, 431072884, 430530472, 429993477, 429530220, 429418869, 428731194, 428411903, 428039322, 427368469, 426798172, 426052742, 425168343, 424425087, 423964424, 423333702, 423131943, 422733498, 422274055, 422020378, 421220055, 420502815, 419542084, 418832321, 418439102, 417999878, 417636604, 417187080, 416861649, 416203384, 415653000, 415000267, 414235420, 413624802, 412885551, 412536621, 412073364, 411349297, 410569344, 410425377, 410761528, 410271912, 409321671, 408818512, 408917122, 408504066, 407548752, 406612053, 405948219, 405727463, 405483437, 405552788, 405124474, 404144325, 403525009, 402872086, 402683334, 402872849, 402525101, 401653748, 400870361, 400422134, 400290718, 400391884, 400143814, 399264641, 398283310, 397789192, 397572136, 397016640, 396408920, 396439514, 396242218, 395434418, 395030136]
3235.5C95030136k81944p23953n11513R6779l59841o93321k00996l18146n36270m40445
3245.1C91060486o600l26881o18362l7995n33676o92825j89705m46167o69594m84467
3254.8C87054214j26800k24648m80461l36456l38745o12526n72243k28081Q8044Q0375
3264.4C84302673k65083n27191n55992n00222n71823j29242J13182p09457r00383N2223
3274C80308685L66860m77333q73452n62210J54343K73399n87349m39720l26576o80733
3283.7C77155914n08117k52877p4844q1482l23296n23986k8763m4213k70576o6032
3293.3C74981728m32778l27568K59285O7024r07211n20554j85775p81975L2806L6927
3303C72221909l78075m2191r6626k78892m49219l53165m05540n6000l63808j334953
$$ y = [395030136, 394748192, 394024239, 393512726, 393609505, 393249664, 392556343, 392355347, 392037201, 391500931, 391060486, 391053886, 390727005, 390108643, 390070648, 389536972, 388844147, 388654442, 388208275, 387538681, 387054214, 386927414, 386702766, 386222305, 385885849, 385547104, 384934578, 384362335, 384134254, 384222298, 384302673, 384037590, 383510399, 382954407, 382454185, 381882362, 381753120, 381866302, 381156845, 380256462, 380308685, 380675545, 380198212, 379324760, 378762550, 378916893, 379190292, 378602943, 378163223, 377836647, 377155914, 376647797, 376394920, 376320076, 376238594, 375915298, 375391312, 375362549, 375318336, 375047760, 374981728, 374548950, 374221382, 374480667, 374547691, 373640480, 373119926, 372934151, 372152176, 372184982, 372221909, 371843834, 371801643, 371705017, 371426125, 370976906, 370623741, 370218201, 370162201, 369798393, 368463440]
3312.6C68463440j056252m11224k74506l90739j14365J72921R15n90172n14564k88277
3322.3C64997177q58993o05011q08106r43222n24216l70597j72501o77528k95182k78282
3331.9C59463539n80253n09263j205215p54204o10962o05278J86157K23427m27932
3340.6C55180016j176606r02328l95126m29802q74215q75740l53241o42662n83992
3349.3C48946304l6659k32010o62918n53131j27640n7068n85861o20651N302o9656
3358.9C46006012n24025j049232p59850Q3313l87878p02858j07308r6397m05731n53666
3368.6C41502380q08448j65368L16926l81165o46210p48939o53725l81584j91689j40228
3378.2C37701950k78816k4452n12658o41288L8948k75650p51534m42657M4708J80054
$$ y = [368463440, 367407188, 366995964, 366721458, 366330719, 366216354, 366389275, 366390190, 365800018, 365285454, 364997177, 364138184, 363533173, 362725067, 361781845, 361257629, 360887032, 360714531, 360037003, 359741821, 359463539, 358883286, 358374023, 357168808, 356414604, 355803642, 355198364, 355384521, 355607948, 355180016, 354003410, 353101082, 352705956, 352276154, 351401939, 350526199, 350172958, 349530296, 348946304, 348909645, 348677635, 348014717, 347461586, 347333946, 347276878, 346691017, 346070366, 346075668, 346006012, 345481987, 344432755, 343672905, 343756218, 343368340, 342665482, 342558174, 342461777, 342056046, 341502380, 340693932, 340528564, 340845490, 340464325, 339818115, 339069176, 338415451, 338033867, 337842178, 337701950, 337423134, 337398682, 336886024, 336244736, 336283684, 336008034, 335256500, 334813843, 334858551, 335038605]
3387.8C35038605M96o01349l22533N1766p33986m91219J31683j24626n88340n96848
3397.5C31763649R1095N10673J70975j85737k99454o64787l97454k66151l13339K30331
3407.1C30639801J59950l23066l78304N29099M82978l96003k11106j80969n5695q6059
3416.8C30180626j88942L45383J74217n79300l11241K35748Q3885K03667K69394L95164
3426.4C30808601J55106l70369k8915P8277M91638P60689L33977J33324k80953l53393
3436.1C31727982J10817N11817L47329j50071K19536P92542K57988L28560P41539J56288
3445.7C35044327j37367k89956N22576O20117K71225R18732J60980l14636L12576J141052
3455.3C38249626J078110j30768K04582N97039N81245N58739K27050M64249P65572
$$ y = [335038605, 335039101, 334437752, 334115219, 334166985, 333432999, 332941780, 333073463, 332948837, 332360497, 331763649, 331854744, 332365417, 332536392, 332350655, 332051201, 331386414, 330988960, 330722809, 330409470, 330639801, 330799751, 330476685, 330098381, 330627480, 331110458, 330714455, 330503349, 330322380, 330266685, 330180626, 329991684, 330337067, 330511284, 329931984, 329620743, 329856491, 329940376, 330144043, 330413437, 330808601, 330963707, 330593338, 330564423, 330642700, 331134338, 331895027, 332229004, 332362328, 332081375, 331727982, 331838799, 332350616, 332697945, 332547874, 332767410, 333559952, 333817940, 334146500, 334888039, 335044327, 334906960, 334617004, 335139580, 335759697, 336030922, 336949654, 337110634, 336795998, 337108574, 338249626, 339327736, 339196968, 339401550, 339998589, 340579834, 341138573, 341365623, 341829872, 342595444]
3464C42595444P25555N17159N07431J28021N01976R92508K01530m6081O68411J380997
3473.7C48172951P24792K10228O50559M92439O41785J134529Q05206Q9989L44848M10004
3483.3C53677330O99768J071320M98695P59087Q18061P16668R14688M34608L47328
3492C59937553N95398O89431Q74519Q30383L15972O08062J144867J105500R13887M77905
3501.6C67493477N49850R30977Q79822P28722R47342R26284R70726Q27561J28898J143837
3511.3C75527496J493607N25513J08375N99747J221619Q80241Q88100O43386M26484
3520C82314568Q09784J324272J502761M86489O79397J166993J126709P65037M95491
3528.6C90671501P65953J248436J424599P63092J220512J270905J067123N69573K26745
$$ y = [342595444, 343320999, 343838158, 344345589, 344473610, 344975586, 345968094, 346169624, 346123543, 346791954, 348172951, 348897743, 349107971, 349758530, 350250969, 350892754, 352027283, 352832489, 352922478, 353267326, 353677330, 354377098, 355448418, 355947113, 356706200, 357524261, 358240929, 359155617, 359590225, 359937553, 360532951, 361222382, 362096901, 362927284, 363243256, 363851318, 364996185, 366101685, 367015572, 367493477, 368043327, 368974304, 369854126, 370582848, 371530190, 372456474, 373427200, 374254761, 374383659, 375527496, 377021103, 377546616, 377654991, 378254738, 379476357, 380356598, 381244698, 381888084, 382314568, 383124352, 384448624, 385951385, 386437874, 387117271, 388284264, 389410973, 390176010, 390671501, 391437454, 392685890, 394110489, 394873581, 396094093, 397364998, 398432121, 399001694, 399228439]
3537.3C99228439J718865J210212Q20923Q37899P28721J116638J295014J814308O68068
3546D09439087O46973J032829J468735J404647J352425J954498k0752J149369J670761
3554.7D20098572J010856J491356P44324J789055K028961J136894M55780J866379J864014
3563.4D32486191N80177L042107R88502k23083P77321J124992L289070J408234J478920
3572D44952431J904182J345291J315575J676369K236595Q94317J499978J182594J204300
3580.7D58211632K430115J865463J371345J876908M203910K076569j062660J306724
3588.4D72280006j58996K265167L107910L081703J950341O79397K226982J78910J996612
3597.1D87608032K892761R48906K356797J124458J151466K509842K066613K467498
$$ y = [399228439, 400947304, 402157516, 402978439, 403816338, 404545059, 405661697, 406956711, 408771019, 409439087, 410086060, 411118889, 412587624, 413992271, 415344696, 417299194, 417278442, 418427811, 420098572, 421109428, 422600784, 423345108, 425134163, 427163124, 428300018, 428755798, 430622177, 432486191, 433066368, 436108475, 437096977, 436873894, 437651215, 438776207, 442065277, 443473511, 444952431, 446856613, 448201904, 449517479, 451193848, 453430443, 454324760, 455824738, 457007332, 458211632, 460641747, 462507210, 463878555, 465755463, 469959373, 472035942, 470973282, 472280006, 472121010, 474386177, 477494087, 480575790, 482526131, 483205528, 485432510, 485611420, 487608032, 490500793, 491449699, 493806496, 494930954, 496082420, 498592262, 500658875, 503126373]
3604.8E03126373K721863K778664J046295J942558L07121K94075N214348J558419j044655
3613.5E17945061L855743J596222L308373L069381L36609K741776J552581J991005
3621.2E36396751L670578K578164J468391K133636K534409K723999N095863K217331
3628.9E58819122n413170K753640M472236M710083K050248J33132L024369L568573
3636.6E74118233L057670J930428J601486K370720K714310J961479J402206K749749
3644.4E91906281L361473L614921j7700p52678M369240J598358L91884J726379M598084
3653F10796242L809356L553620M490013m574165J985893N265541K342758K167130J029853
3661.7F30866241K324830J985435J975098K248459J261406L751831J490631m08249
$$ y = [503126373, 505848236, 508626900, 509673195, 511615753, 511922874, 512216949, 517431297, 518989716, 517945061, 521800804, 523397026, 526705399, 529774780, 530111389, 532853165, 534405746, 536396751, 540067329, 542645493, 544113884, 546247520, 548781929, 551505928, 556601791, 558819122, 553405952, 556159592, 560631828, 565341911, 567392159, 567525291, 570549660, 574118233, 577175903, 579106331, 580707817, 583078537, 585792847, 587754326, 589156532, 591906281, 595267754, 598882675, 598864975, 598112297, 602481537, 604079895, 604471779, 606198158, 610796242, 614605598, 618159218, 622649231, 618075066, 620060959, 625326500, 627669258, 629836388, 630866241, 633191071, 635176506, 637151604, 639400063, 640661469, 644413300, 645903931, 645495682]
3669.4F45495682J745529l296890K988891O527939O751175j371841j3435822M467545
3677.1F49872208O780624L846054r47189Q49380K394944J500930J752396J769791J266174
3685.8F69085312L039093M343796p728272k277756O933671l662262K83279M854813
3693.5F74871674J660690J313095o69632o92596J835937J097412J842194J935196l967514
3702.2F79226456m74396M251022P93762j65100L59192J909104L151703n401764K769775
3710.9F86419754L566818r810257M061737M351426P85675O08444J614227N54733l033065
3719.6F89119492J199951M553756k793731m248734L098374J375198J64795j066971
3727.3F91402130M94690K574387Q58993L430405l582993n828705O066895N02014n269699
$$ y = [645495682, 647241211, 643944321, 646933212, 653461151, 660212326, 658840485, 645404663, 649872208, 656652832, 660498886, 659551697, 660401077, 662796021, 664296951, 666049347, 667819138, 669085312, 672124405, 676468201, 668739929, 666462173, 673395844, 669733582, 670016861, 674871674, 676532364, 677845459, 677175827, 676483231, 678319168, 679416580, 681258774, 683193970, 679226456, 678752060, 683003082, 683796844, 683631744, 683990936, 685900040, 689051743, 683649979, 686419754, 689986572, 680176315, 684238052, 688589478, 689375153, 689983597, 691597824, 692152557, 689119492, 690319443, 694873199, 692079468, 687830734, 690929108, 692304306, 692469101, 691402130, 691896820, 694471207, 695330200, 698760605, 695177612, 689348907, 695415802, 695917816, 690648117]
3736F90648117r1858K074051J335907J982346J920166l205796K362213Q450547p392121
3744.7F98083572j0520019O492081K957077L567504k508316o995468P583466l689728
3752.4F94970169l020935M749756K770309K446900l250580J303177L980484n086670
3760.1F98862610n22156L518295L82386j142426J814804j616058k669220L102722M034348
3768.8G05765305J57089p075424J532592K847519R4147N42603l05939P60803K60239
3777.4G04578934J495437N46799n067062J536789J682815N51605J384659j595688p47604
3786.1G04366684J7166K76413Q80051N3711o8055j25579J88369j6021J404571J880722
3795.8G08858032l444595k261353J911621L223954M695434n144424j0040741L033447
$$ y = [690648117, 690556259, 692630310, 693966217, 695948563, 697868729, 694662933, 697025146, 705475693, 698083572, 687563553, 694055634, 697012711, 700580215, 698071899, 691076431, 698659897, 694970169, 691949234, 696698990, 699469299, 701916199, 698665619, 699968796, 703949280, 698862610, 698340454, 701858749, 702241135, 701098709, 702913513, 701297455, 698628235, 701730957, 705765305, 705922394, 698846970, 700379562, 703227081, 703321228, 703863831, 703557892, 704318695, 704578934, 706074371, 706621170, 701554108, 703090897, 704773712, 705325317, 706709976, 705114288, 704366684, 704383850, 704660263, 705540314, 705594025, 705525970, 705400391, 705588760, 705572739, 706977310, 708858032, 705413437, 703152084, 705063705, 708287659, 712983093, 707838669, 697797928, 700831375]
3803.5G00831375L032608L269577L917389p744293l045807M874496K459641M53644
3811.2G08048630J9989r8114Q80050L510437l221740j0763245N331574M651107K660370
3819.9G11019058K76718j2608566K975617M196701N81588J902085O50863l396835K20490
3828.6G05817719J926345J943512J50833n842132K464142N368957m330749p09305O012421
3837.2G12801743o965867m041671O659012k494812k93046M249039j565704j877213
3844.9G06471481K094956P39746r64050M67300q67691J748810M626312m472504J195298
3853.6G11039658j0288010L29742P107163p09763r92660J320495J414261J698380l491211
3862.3G07428055j65482L969574n036468l761368L953400M009094L255691p236938
$$ y = [700831375, 703863983, 707133560, 711050949, 703306656, 700260849, 705135345, 707594986, 708048630, 708068619, 707970505, 708850555, 712360992, 709139252, 698376007, 703707581, 708358688, 711019058, 711295776, 698687210, 701662827, 705859528, 706441116, 708343201, 708994064, 705597229, 705817719, 707744064, 709687576, 709838409, 703996277, 706460419, 711829376, 707498627, 706789322, 712801743, 705835876, 701794205, 708453217, 705958405, 705665359, 709914398, 708348694, 706471481, 708566437, 709306183, 708342133, 708809433, 707941742, 709690552, 714316864, 709844360, 711039658, 700751648, 701081390, 708188553, 707478790, 706486130, 707806625, 709220886, 710919266, 707428055, 707262573, 711232147, 706195679, 702434311, 706387711, 710396805, 713652496, 706415558]
3870G06415558o291962L682709N276947K468414p717590J356049L265075o943J371689
3878.7G09819946K259598m283295n721359M514694J624451J136475L394012r513702
3886.4G03230820J361465L300858N04379L167267p51877o606751N62439K831116j02463
3895.1G07497253J002274J16577J020126O59180p417984M482575K017212m519959K916870
3903.8G07774124k379150o26068J012497R50622J799011r8877l08914p23495K07977
3912.5G07607727K17362j005250K52305J255111j910248j493148L671569N3864l013763
3921.1G05635529J687774J191483J35116k782058k500611K953720K055893n0811j278306
3929.8G07047729q37326J544037r79843j239090P69425m2267N95856R71069k54135
$$ y = [706415558, 700123596, 703806305, 709083252, 711551666, 703834076, 705190125, 708455200, 708448257, 709819946, 712079544, 707796249, 702074890, 706589584, 708214035, 709350510, 712744522, 703230820, 704592285, 707893143, 708397522, 711564789, 710812912, 704206161, 704768600, 707599716, 707497253, 708499527, 708616104, 709636230, 710295410, 702877426, 707360001, 709377213, 704857254, 707774124, 705394974, 704768906, 705781403, 706732025, 708531036, 708432159, 708123245, 707399750, 707607727, 707825089, 706819839, 707072144, 708327255, 706417007, 704923859, 708595428, 708649292, 705635529, 707323303, 708514786, 708649902, 705867844, 703367233, 706320953, 708376846, 708326035, 707047729, 706210403, 707754440, 706774597, 705535507, 706304932, 706262665, 706858521, 707829590, 707575455]
3938.5G07575455m82025j20240J070175Q06199l326645j061631J344223N03769k46505
3947.2G06062775j983109J344223R90143j202011J864395K17743j263657k17361N78461
3955.8G06391602j50376j151428P89947L20740j84707l66593m43115O36673j9379j32904
3965.5G05690460k41165K03323O53611j19248J43814J55411j107483p56531R24836
3974.2G05547028P84149l74451j095581j61743M07410L35235M44107j55868k79694
3982.8G05450592o00128O53000N89828p10144J32065J33057R33380J80053j039962
3991.5G05721741j45493l9520K31781k31781m59137j85776K64435M27933K34604
4000.2G05818787
$$ y = [707575455, 707093430, 706973190, 708043365, 708849564, 705522919, 704461288, 705805511, 706309280, 706062775, 704079666, 705423889, 706414032, 705212021, 707076416, 707294159, 706030502, 705813141, 706391602, 706241226, 705089798, 705879745, 706200485, 706015778, 705649185, 705206070, 705842743, 705823364, 705690460, 705449295, 705652618, 706306229, 706186981, 706330795, 706486206, 705378723, 704622192, 705547028, 706331177, 705956726, 704861145, 704699402, 705106812, 705442047, 705886154, 705730286, 705450592, 704850464, 705503464, 706093292, 705383148, 705515213, 705648270, 706581650, 706761703, 705721741, 705576248, 705536728, 705768509, 705536728, 705077591, 704891815, 705156250, 705584183, 705818787]
##END=$$ End of the data block
