##TITLE=$$ Begin of the data block
##JCAMP-DX=5.00 $$ ACD/SpecManager v 10.08
##SPECTROMETER/DATA SYSTEM=Varian
##DATE=15 Jan 2013 15:17:48
##DATA TYPE=INFRARED SPECTRUM
##DATA CLASS=XYDATA
##ORIGIN=
##OWNER=
##NPOINTS=3735
##FIRSTX=399.26403809
##LASTX=4000.35498047
##MAXX=4000.35498047
##MINX=399.26403809
##MAXY=74.41820526
##MINY=32.89024353
##XFACTOR=1.0000000000
##YFACTOR=0.000000100000000
##FIRSTY=52.84035492
##DELTAX=0.96440572
##XUNITS=1/CM
##YUNITS=TRANSMITTANCE
##XYDATA=(X++(Y..Y))
399.3E28403549o234016j2048950Q150215N517654n048447m120140J588593J501694
407E17710152n031853J238747K089500n646133l317299K267227n14946K984505M192733
415.7E15972633l284378j904716j1096420P736816J0190582o128044j72653m084892
423.4E07228928r49021M145470k29683L629913J6594m724502J958236L137970m711113
432.1E09502792l766975J335716O42395j063995K444992M366951K156334J080398m28657
440.7E16269951j683540n407448l070755O586876J515426n391121Q28133M320908N49316
449.4E14517746m987564o256790l502655r9259N950051N037269J950493K174110m811897
458.1E09971504o65626J081962m474296p97310K051201M18281J478272J387062l510475
$$ y = [528403549, 522169533, 510120583, 518270798, 523788452, 518740005, 514619865, 516208458, 517710152, 512678299, 513917046, 516006546, 510360413, 507043114, 509310341, 508795395, 511779900, 515972633, 512688255, 510783539, 499687119, 507423935, 517614517, 511486473, 511313820, 507228928, 506279907, 510425377, 510195694, 513825607, 513842201, 509117699, 511075935, 514213905, 509502792, 505735817, 507071533, 507713928, 506649933, 509094925, 513461876, 515618210, 516698608, 516269951, 514586411, 509178963, 506108208, 512695084, 514210510, 508819389, 509647522, 513968430, 514517746, 509530182, 503273392, 499770737, 499671478, 505621529, 510658798, 512609291, 514783401, 509971504, 509305878, 510387840, 505913544, 505116234, 507167435, 507585716, 509063988, 510451050, 506940575]
466.8E06940575k423630L515816j629792n016708l342056j556015m21562K574729M721947
475.5E03363304J22223k124977J058998J315842m381333l718795p45583k853966J78032
484.1D92213745L032494N363388O316604K268181k949829p673874m124603k295837
491.8D92150269j367188K097931L958435M620590K670250N76592q97522k680703k938537
500.5D98190117K27013q01697m999008m024811Q10013M669380L066711J864929o35833
509.2D98366814k852669j369057j189842p28645j166458m95682J24855K68936L8872
517.9D90997124q06351r0523r46426l227806l213959K484436L572044J105195P89108
526.6D90662842j85280P22389j153259j085777q87528k323379l53623j112709j10855
$$ y = [506940575, 504516945, 508032761, 506402969, 501386261, 498044205, 496488190, 496066628, 498641357, 503363304, 503485527, 501360550, 502419548, 503735390, 499354057, 495635262, 494889679, 492035713, 492213745, 495246239, 500609627, 506926231, 509194412, 506244583, 498570709, 494446106, 492150269, 490783081, 492881012, 496839447, 501460037, 504130287, 504706879, 503809357, 501128654, 498190117, 498417130, 497615433, 492616425, 488591614, 489401627, 494071007, 497137718, 499002647, 498366814, 495514145, 494145088, 492955246, 492226601, 491060143, 490564461, 490689316, 490958252, 490997124, 490190773, 490100250, 489153824, 485926018, 482712059, 485196495, 488768539, 489873734, 490662842, 490477562, 491199951, 490046692, 488960915, 488073387, 485750008, 485396385, 484283676, 484172821]
535.2D84172821K132149K193451R73396j079597j985245l444634j571121K79999R21554
543.9D82592773J044312q31108l97873K8381J304856J738929j478347k198105m65584
552.6D81338234j476555k564392p6J361427K324638K042160p90367q65936n85785j195145
562.3D79588203j725006j162338m99191p71332P58820K350616K487831L64418j230049
570.9D80161972j76468j591987l080025j254158o2599J50337J078071J597329Q91952
579.6D77714424k62909q58002m01687n23186k83928k73590l21388J972237K213668
588.3D78975639J490326J311798o65054j089020j091804j780510q00934J91917J036721
597D77579079K307968J502876r7160L85322L45269k43645j848717l251572p00912Q89778
$$ y = [484172821, 486304970, 488498421, 489471817, 488392220, 486406975, 482962341, 481391220, 481671219, 482592773, 483637085, 482805977, 482408104, 482436485, 483741341, 485480270, 484001923, 481803818, 481338234, 479861679, 477297287, 477297211, 478658638, 480983276, 483025436, 482235069, 481369133, 480783348, 479588203, 477863197, 476700859, 476201668, 475430336, 476189156, 478539772, 481027603, 481392021, 480161972, 479985504, 478393517, 475313492, 474059334, 473996735, 474147072, 475225143, 476822472, 477714424, 477451515, 476593513, 476191826, 475668640, 475384712, 475111122, 474789734, 476761971, 478975639, 480465965, 481777763, 481112709, 480023689, 478931885, 477151375, 476350441, 476542358, 477579079, 479887047, 481389923, 481292763, 481678085, 482023354, 481779709, 479930992, 476679420, 475978508, 476868286]
606.6D76868286J211014Q59604M24194J922951r77745l427429j292382p05948j258811
615.3D73623734q37365J924820L024216J586151R98001p2670J23215K97241j561394
624D79105949j428146j7471Q66394K279777K471924J885834J054497N6381M11186M08211
633.6D87094536j69296J45378R65843J043053R40208J887932K438354K550583J374092
642.3D98270683k28080j38169j449585j597824J97334J414490K520142K362747K024040
651E03375778J265145J27449o28624j837387j965943o79130K80838J86424J533584
659.7E01658134K284585Q01048r24835j049347p21283j998444q91952J2130m10843
668.3D98759193J806107J695862K833023K205009L78456k20527o57234j716500p07626
$$ y = [476868286, 478079300, 478938904, 479363098, 481286049, 480308304, 476880875, 475588493, 474882545, 473623734, 472786369, 474711189, 477735405, 479321556, 480319557, 480246887, 480370102, 480667343, 479105949, 477677803, 477660332, 478526726, 480806503, 483278427, 485164261, 486218758, 486275139, 486686325, 487094536, 486925240, 487070618, 488036461, 489079514, 490019722, 491907654, 494346008, 496896591, 498270683, 498042603, 497904434, 496454849, 494857025, 495054359, 496468849, 498988991, 501351738, 503375778, 504640923, 504768372, 504139748, 502302361, 500336418, 499657288, 499938126, 500124550, 501658134, 503942719, 504743767, 503818932, 502769585, 502048302, 500049858, 499157906, 499170036, 498759193, 500565300, 502261162, 505094185, 507299194, 507677650, 507457123, 506799889, 505083389, 504375763]
677E04375763M92744J26725J751442K934112L295174K452431J153907K64092j876602
685.7E14969788j366043p81479q12035N94940K076187K771988J905899O31562M04281
694.4E20395088J327934j385307k711792o17981l01361J228104J337776J644936K354469
703.1E23271866P85522O71082N35850o36749j371574l02429K34527M12979J242752
711.7E24843826J871262L300705K208290k98195j473770j941261j712380L01094K179756
720.4E29279327J693879J300735J196861J363907M54712P7248K37961p54548r97924
729.1E33852158r79157J299515K001343K172660L082924J458817J277656n47561l090782
737.8E40527573l628426j397896J882248K327843K448578J485405J280670J539993
$$ y = [504375763, 504868507, 504995232, 506746674, 509680786, 512975960, 515428391, 516582298, 516846390, 514969788, 513603745, 512822266, 512010231, 512605171, 514681358, 517453346, 519359245, 519990807, 520395088, 521723022, 520337715, 517625923, 517007942, 516706581, 517934685, 519272461, 520917397, 523271866, 524057388, 524728470, 525264320, 524627571, 523255997, 522953568, 523188095, 523601074, 524843826, 526715088, 530015793, 532224083, 531925888, 530452118, 528510857, 526798477, 527099571, 529279327, 530973206, 532273941, 533470802, 534834709, 535289421, 535366669, 535604630, 534850082, 533852158, 532873001, 534172516, 536173859, 538346519, 541429443, 542888260, 544165916, 543618355, 540527573, 536899147, 535501251, 537383499, 539711342, 542159920, 543645325, 544925995, 546465988]
745.5E46465988K26441j030350j877785j943016j551857K09923J617813K638321L142319
754.2E47897797K957954J978035p32346k285690k426720p00073N27649J659050K406006
762.8E51281662J737747K677765K046013R38606o83059k013932j475296r11979O7138
771.5E53664665n60493n0621J582298K442360J889725J95427n42107j850205j615829
780.2E55155220o93550j87836M83704J351585K369843J736908J234855J075516n4283
788.9E62471962j875000j323090l71742j164856q09288J69335R64164R37805J733513
797.6E60732803P29943k375946k728539j008873l67203k860336k664528M6387P18689
806.2E50222397j32332k54822l32908k352601k464714k498703k332191j516418r73626
$$ y = [546465988, 546692429, 545662079, 543784294, 541841278, 540289421, 540499344, 542117157, 544755478, 547897797, 550855751, 552833786, 552101440, 549815750, 547389030, 546688957, 547216606, 548875656, 551281662, 553019409, 555697174, 557743187, 558681793, 557998734, 555984802, 554509506, 553597527, 553664665, 553104172, 553053551, 554635849, 557078209, 558967934, 559163361, 558621254, 556771049, 555155220, 554461670, 554273834, 554757538, 556109123, 558478966, 560215874, 561450729, 562526245, 562471962, 560596962, 559273872, 558902130, 557737274, 556927986, 557097321, 558061485, 558999290, 560732803, 561462746, 559086800, 556358261, 555349388, 554982185, 552121849, 549457321, 549503708, 550222397, 550090065, 549835243, 549502335, 547149734, 544685020, 542186317, 539854126, 538337708, 537364082]
814.9E37364082M59061K07024j43052o63566n15671k14653j033554N8060J305961J301308
824.6E38125000J380157K679062K626305J811447J324616R26170J864738J833497K629776
833.3E55200768J519508J529388M261360L494950K899856K131195K203980J134262
841E74375267k25334N57899J68534J594543J807747J831360L312759K909699J418304
849.6E87750778M29917L41262k99072p06558J64032K008552K194939K932434K394715
858.3E97210999Q75778K238502J827355N70488j771660q51593P92465k37465P12242
867F01367111N03998J588860J063919l07732j336174k788429j768647j330032m71191
875.7E96521683n53170P60727N87426j159973K35061R8686n94520j607056j443252
$$ y = [537364082, 537823143, 538030167, 537887115, 537223549, 536707878, 536493225, 535459671, 535517731, 536823692, 538125000, 539505157, 542184219, 544810524, 546621971, 547946587, 548872757, 550737495, 552570992, 555200768, 556720276, 558249664, 562511024, 566005974, 568905830, 571037025, 573241005, 574375267, 574149933, 574707832, 574876366, 576470909, 578278656, 580110016, 583422775, 586332474, 587750778, 588180695, 588521957, 588222885, 587516327, 587680359, 589688911, 591883850, 594816284, 597210999, 598086777, 600325279, 602152634, 602723122, 600951462, 600099869, 600892334, 600654869, 601367111, 601871109, 603459969, 604523888, 604216156, 602879982, 600091553, 598322906, 596992874, 596521683, 595968513, 596729240, 597316666, 596156693, 596391754, 596490440, 595895920, 594288864, 592845612]
884.4E92845612j251374n22041O73599J13030N75294K14043Q964o61201n55115p03277
894E90737534j171341j00861p20100N02700P55883J43928L43743R3650k6245j252365
903.7E89306526k37465N48249O10466Q34999J521949K196122J236229N68122j035423
912.3E95549774q24051p47223j198425j120071j932373j198883r12323j472550k009544
921E84134331j462937j792640k448044k824555l132248j814956k185593j810989j645203
929.7E65017166j697616j041680j164551p98263j622582j042938o48994r98764j391335
938.4E54610443r54132J104851N4436q00019j071625j308326j725960j962585q23899
947.1E47123184j162872m30870k08435M539K861o08062J3351j417503j841965j588135
$$ y = [592845612, 591594238, 591072197, 591745796, 591858826, 592434120, 592648163, 592657127, 591995926, 591440811, 590737534, 589566193, 589465332, 588745232, 589247932, 590003815, 590147743, 590491486, 590585136, 590558891, 589306526, 589069061, 589617310, 590227776, 591062775, 592584724, 594780846, 596017075, 596585197, 595549774, 594725723, 593978500, 592780075, 591660004, 589727631, 588528748, 587616425, 586143875, 584134331, 582671394, 580878754, 578430710, 575606155, 572473907, 570658951, 568473358, 566662369, 565017166, 563319550, 562277870, 561113319, 560315056, 558692474, 557649536, 557000542, 556001778, 554610443, 553656311, 554761162, 554815598, 554015579, 552943954, 551635628, 549909668, 547947083, 547123184, 545960312, 545529442, 545321007, 545325546, 545328407, 544720345, 544733696, 543316193, 541474228, 539886093]
956.7E39886093j507759j671982j950493j078071j375618j158676j453324j606407
964.4E28083763j123619j891899j809273j319923j583748k182541j948624j419830
972.1E14804306j158142j533966k320480k233277k324180k605973k736015l110466
979.8D96781807l826065l857231l445015l704720l751144l418389l428344l141556
987.6D68209343k869988l681602l644638k625656k717858l579902l808937l493424
995.3D41787338l193321k922783j938095j975441l423996j853256j277161k653351
1003D22549934k338028j734199n44739r88617j772003j388664q46520p69539q60862
1011.7D11306763l40653j320686j810684j855011k167168k461739k598800k309571
$$ y = [539886093, 538378334, 536706352, 534755859, 533677788, 532302170, 531143494, 529690170, 528083763, 526960144, 525068245, 523258972, 521939049, 520355301, 518172760, 516224136, 514804306, 513646164, 512112198, 509791718, 507558441, 505234261, 502628288, 499892273, 496781807, 492955742, 489098511, 485653496, 481948776, 478197632, 474779243, 471350899, 468209343, 465339355, 461657753, 458013115, 455387459, 452669601, 449089699, 445280762, 441787338, 438594017, 435671234, 433733139, 431757698, 428333702, 426480446, 425203285, 422549934, 420211906, 418477707, 417932968, 416944351, 415172348, 413783684, 412937164, 412167625, 411306763, 410966110, 409645424, 407834740, 405979729, 403812561, 401350822, 398752022, 396442451]
1019.4C96442451k622566j518783j093903r94606j514358k104302r04617j255875j658668
1028.1C82774773j744156j277657j331482r82818l09601q69827J61514J31569K32734
1036.7C76785049R08471P64236J40495L98522J359062Q00095J272354R46655M93813
1045.4C83868752J95655p94372p83768m77829L27530l93181p33223k04620K0981k49214
1055.1C80776711k59858O02341q0528O9923N72739J369133P75795L24096K368165K306671
1064.7C88825188J944770J848259K325402K417221K216263J697311O91757J169663
1072.4D03135834K39372L43704J614495J473083N23377J45187N95856N11131J267624
1081.1D09849663L97644j69220J273193J243973N42068J496964K011642M88053P23190
$$ y = [396442451, 393819885, 392301102, 391207199, 390212593, 388698235, 386593933, 385689316, 384433441, 382774773, 381030617, 379752960, 378421478, 377438660, 377129059, 376259232, 376420746, 376552315, 376785049, 377693520, 378457756, 378598251, 378996773, 380355835, 381155930, 382428284, 383374939, 383868752, 384064407, 383270035, 382486267, 382008438, 382335968, 381942787, 381209564, 381004944, 381025925, 380776711, 380516853, 381119194, 381038666, 381108589, 381681328, 383050461, 383826256, 384150352, 386518517, 388825188, 390769958, 392618217, 394943619, 397360840, 399577103, 401274414, 401966171, 403135834, 403375206, 403718910, 405333405, 406806488, 407329865, 407475052, 408070908, 408582039, 409849663, 410247307, 410078087, 411351280, 412595253, 413137321, 414634285, 416645927, 417133980, 417857170]
1089.8D17857170L59116R37233J971359M49181R23843J249962R44214J064109J841584
1098.5D27597771J605987M7951J21651M50592J548347J664696J251717J200752P93915
1107.1D36283379R02061M20799N29137k26746p67212Q62580J841888J402207M74815
1115.8D41722908M16527Q73527R58329J30996l14254l43552p71752q16421n61447O19926
1125.5D41914787J301079J136322R01795J262359K036820J602363J183930J113433
1133.2D52452888Q93822Q55675J958237J852340Q45528J838036J848945J125031J254806
1141.9D64925308J096230m5548o74629K70767N22270K87209M54330M70315N55229Q17489
1151.5D68678970M24118q51020o29158J04904q80356r97887l61404p49436p49511j90087
$$ y = [417857170, 418216286, 419153519, 421124878, 421574059, 422497902, 423747864, 424692078, 425756187, 427597771, 429203758, 429251709, 429373360, 429823952, 431372299, 433036995, 434288712, 435489464, 436283379, 437185440, 437606239, 438135376, 437908630, 437141418, 438003998, 439845886, 441248093, 441722908, 442139435, 443012962, 443971291, 444102287, 443788033, 443444481, 442672729, 441856308, 441294861, 441914787, 443215866, 444352188, 445253983, 446516342, 448553162, 450155525, 451339455, 452452888, 453346710, 454202385, 456160622, 458012962, 458858490, 460696526, 462545471, 463670502, 464925308, 466021538, 465975990, 465301361, 465572128, 466094398, 466381607, 466835937, 467306252, 467861481, 468678970, 469103088, 468252068, 467622910, 467727814, 466847458, 465849571, 465488167, 464738731, 463989220, 463799133]
1161.1D63799133j48353q13027r72633L82614J012726O73714J086387J884194K607002
1169.8D69511757K169800J707534J919137K117271J865463J940346K346916J795349
1177.5D85373573K087632K676506K146759J858711J705437J131973J444053J418534
1185.3D99843178M77447M50363J038170J305847Q38318P26319L10287m38995p13120
1193.9E03837814o76384j042862j718063p33490n23682m10995k4605j247444j061058
1202.6D96399231m65775j340103j562385j048508j276855n85175M88853L48473K13432
1211.3D91171188m33693n83267K00730J32446p13425q11348O9924L27797K84462L78074
1220.9D90022888N87044L51868J32293K38495o50215p74765p62787j190452q72345
$$ y = [463799133, 463650780, 462837753, 461865120, 462247734, 463260460, 463934174, 465020561, 466904755, 469511757, 471681557, 473389091, 475308228, 477425499, 479290962, 481231308, 483578224, 485373573, 487461205, 490137711, 492284470, 494143181, 495848618, 496980591, 498424644, 499843178, 500320625, 500770988, 501809158, 503115005, 503953323, 504679642, 504989929, 504550934, 503837814, 503161430, 502118568, 500400505, 499667015, 499143333, 498732338, 498707733, 497460289, 496399231, 495933456, 494593353, 493030968, 491982460, 490705605, 490120430, 490609283, 490957756, 491171188, 490737495, 490154228, 490354958, 490487404, 489773979, 488962631, 489032555, 489360352, 489644814, 490022888, 490609932, 490961800, 491094093, 491332588, 490682373, 489907608, 489144821, 487954369, 487082024]
1229.6D87082024r3041L62435k67563n00260n03044n78422l54538n05906m88204m10386
1239.3D83743095l81546j88942q4800j75476l21427n17654l82195k30789r27658r84879
1248.9D79547729l33557j36566L3684o10j89667j54381l74603o80428k66227K03170
1258.5D77648544K594l18145j42785L19519L88947M52385M22173J63421O90498J089669
1268.2D80716820O62842J48277K34222O98586R12285J023140R96627O74477J96495
1276.9D86263771N93224J129799R83505O34918N44090R84535J069947J527672J527481
1285.5D95258942Q40835N52101N72968Q74405O52962J210365J044807J27411N19791
1294.2E01654587J190376J024094L48854O29120L44581J59760P5569q4190M55513K78282
$$ y = [487082024, 486988983, 487351418, 487083855, 486583595, 486080551, 485502129, 485147591, 484641685, 484153481, 483743095, 483361549, 483172607, 483087807, 482912331, 482590904, 482073250, 481691055, 481460266, 480532608, 479547729, 479214172, 479077606, 479111290, 479110680, 478921013, 478766632, 478392029, 477711601, 477445374, 477648544, 477651138, 477332993, 477190208, 477509727, 477898674, 478351059, 478773232, 478936653, 479627151, 480716820, 481379662, 481527939, 481762161, 482460747, 483373032, 484396172, 485392799, 486067276, 486263771, 486856995, 487986794, 488970299, 489605217, 490149307, 491133842, 492203789, 493731461, 495258942, 496099777, 496651878, 497224846, 498099251, 498752213, 499962578, 501007385, 501134796, 501654587, 502844963, 503869057, 504217911, 504847031, 505191612, 505351372, 505426941, 505342751, 505798264, 506076546]
1303.9E06076546L62205K12403k1477l43476l21655j80168p73430m38995k50130j93977
1313.5E04127846j37444K9640j72844l87611L16658L93372Q11195N64499L73268M75235
1323.2E06393814L71704P69997M34570M80843N2566j01242K2850n05562m60929n62439
1332.8E06896172m93279k71683l20053r47265n27535L8300m59366R0866N85518N53093
1342.4E05144768J64108L94287K06528l8414N44929p0457k29111l17344l3951j44425
1352.1E05620918o81915n19180m23622M77066J42021m12750o56128k33193o8550j144028
1361.7E02100639m21638m45099k21825k7656k022J50566p86896q25882n55229k49481
1371.4D98715477j10016k64854q31070n30091M60701q3503m8905l16391m57878n20401
$$ y = [506076546, 506438751, 506651154, 506629677, 506286201, 505964546, 505784378, 505010948, 504571953, 504321823, 504127846, 503990402, 504020042, 503847198, 503459587, 503776245, 504169617, 504980812, 505545311, 505918579, 506393814, 506765518, 507535515, 507970085, 508450928, 508503494, 508402252, 508425102, 507919540, 507458611, 506896172, 506402893, 506131210, 505811157, 504863892, 504336357, 504374657, 503915291, 504006157, 504591675, 505144768, 505308876, 505703163, 505909691, 505871277, 506416206, 506345749, 506116638, 505799294, 505765343, 505620918, 504939003, 504419823, 503996201, 504473267, 504615288, 504202538, 503546410, 503313217, 503244667, 502100639, 501679001, 501233902, 501012077, 500984421, 500982399, 501132965, 500346069, 499520187, 498964958, 498715477, 498605461, 498340607, 497509537, 496979446, 497440147, 497356644, 497307739, 496991348, 496533470, 496013069]
1381D96013069q46062r92393j320038j083679j067696o28090j171150r56116p24144
1389.7D87223701j295967j006507j612816j400147k324142k789345q53767j507531
1397.4D74433479j751251k003708j067848p69081j314964j105271j036453j637383
1405.1D63747520j247711n38559r66491j003266o52580q90389p72705q77990o95725
1413.8D56102104l76015o53877o96296o07453n29671j020813Q64258R95636j12304
1422.5D53965569q3542K20413Q42781J081543N93834M96597K43569K62985M87976P34100
1432.1D58845825N87807R71489J220169M33655O86836J516266J781463J263771R42688
1440.8D68249969P26433J34659N57785N05753P78732P16705O11992R05228J548958
$$ y = [496013069, 495167007, 494174614, 492854576, 491770897, 490703201, 490075111, 488903961, 487947845, 487223701, 485927734, 484921227, 483308411, 481908264, 479584122, 476794777, 475941010, 474433479, 472682228, 470678520, 469610672, 468841591, 467526627, 466421356, 465384903, 463747520, 462499809, 461961250, 460994759, 459991493, 459338913, 458448524, 457675819, 456797829, 456102104, 455726089, 455072212, 454375916, 453768463, 453238792, 452217979, 453082237, 454077873, 453965569, 453882027, 454102440, 454945221, 456026764, 456620598, 457117195, 457360764, 457623749, 458111725, 458845825, 459433632, 460405121, 461625290, 462058945, 462745781, 464262047, 466043510, 467307281, 468249969, 468976402, 469111061, 469668846, 470174599, 470953331, 471670036, 472282028, 473187256, 474736214]
1449.5D74736214J242141J85242P48558N84374M49600j67504l17268J86119J052590
1458.2D78700066L652000J501541J708718J282463Q41674J301690O30950J624146J006775
1466.8D92250023J812172K072830J928406K104606J521454K099915J752662L008385
1474.6E08550453K413292J741295J949081J809655J924667J905212J584702J720772
1482.3E23599129J879806J127320J090202R93309J12076n1613K49176j71204O25077
1491E29453278J091728P16400n09377j251678j431694l658753J05095p13653j490288
1499.6E22311058j75362q54950m80499q30726J30806L15704n285111n604820K655296
1508.3E12181396L545838N11818L03840l59191j075516l06740n71327o05774k755318
$$ y = [474736214, 475978355, 476163597, 476912155, 477496529, 477946129, 477778625, 477461357, 477647476, 478700066, 482352066, 483853607, 485562325, 486844788, 487686462, 488988152, 489619102, 491243248, 492250023, 494062195, 496135025, 498063431, 500168037, 501689491, 503789406, 505542068, 508550453, 510963745, 512705040, 514654121, 516463776, 518388443, 520293655, 521878357, 523599129, 525478935, 526606255, 527696457, 528689766, 528801842, 528750229, 528999405, 528828201, 529453278, 530545006, 531261406, 530752029, 529500351, 528068657, 524409904, 524514999, 523801346, 522311058, 522135696, 521280746, 520800247, 519969521, 520100327, 520416031, 515130920, 509526100, 512181396, 515727234, 516239052, 516542892, 516183701, 515108185, 514801445, 514230118, 513624344, 510869026]
1517E10869026p29942J253166O50635j333199j423225K055626J270561R54132j013107
1525.7E12553673K99797J204681J287575J285858Q67806Q21457N4168J7090o10924
1534.3E17781181N99175K35710J57852P66525l247947j037674J832542J014977K94075
1543E18396416J311302O50062o38313J179733L06J49154j194610m44107J302566K77023
1552.7E20989532J002884k797050r20258O02265P19337l004379j3099403N979576L93066
1561.4E09865570O36978j328926j190567k197304k855110j430702k860642k319221
1569.1D96320076p604675j269799j534347k506561j917763k991028j671753j0003776
1576.8D66820374p67441k518997l813401l323097l979759k155647m180413k353554
$$ y = [510869026, 510139084, 511392250, 512042885, 510709686, 509286461, 511342087, 512612648, 513566780, 512553673, 512853470, 514058151, 515345726, 516631584, 517499390, 518320847, 518375015, 518392105, 517781181, 518380356, 518616066, 518773918, 519540443, 516292496, 515254822, 517087364, 518102341, 518396416, 519707718, 520357780, 519719467, 520899200, 520899506, 521048660, 519854050, 519409943, 520712509, 520989532, 521992416, 519195366, 518275108, 518877373, 519596710, 516592331, 503492928, 509472504, 509865570, 510502548, 509173622, 507983055, 505785751, 502930641, 501499939, 498639297, 496320076, 488715401, 487445602, 485911255, 483404694, 481486931, 478495903, 476824150, 466820374, 466052933, 463533936, 459720535, 456397438, 452417679, 450262032, 446081619, 443728065]
1584.5D43728065l699378l378029l239708l783913k534904m658318j993523l629608
1592.2D16810684k207069k680054l430519j844254l400917j095771l385239k002258
1599.9C96764603l077698k489662j102333k695504l71360k445069o40983k177925j127930
1608.6C80636139j353951k492485J86005k099953k5787j778412P7286m30527l457222
1617.3C69261093K204895j053734M57192j802292N78346R8076o77338J627846K50473
1626C70944557K379151j210213R39255J32904J73263J025429M81606K409019k10838
1634.6C77064133K859420L17345L179512K244110J415329K239647K82288J965599n3826
1643.3C91513557J944390J655082K77176K424126r58099L822899J076507K633820J781273
$$ y = [443728065, 440028687, 436650658, 433410950, 429627037, 427092133, 422433815, 420440292, 416810684, 414603615, 411923561, 408493042, 406648788, 403247871, 402152100, 398766861, 396764603, 393686905, 391197243, 390094910, 387399406, 387028046, 384582977, 383941994, 381764069, 380636139, 379282188, 376789703, 376975708, 374875755, 374849968, 373071556, 373148842, 372718315, 369261093, 371465988, 370412254, 370869446, 369067154, 369645500, 369743576, 369066238, 370694084, 370944557, 373323708, 372113495, 373052750, 373185654, 373358917, 374384346, 374865952, 377274971, 377064133, 379923553, 380240898, 383420410, 385664520, 387079849, 389319496, 389601784, 391567383, 391513557, 393457947, 395113029, 395390205, 397814331, 396856232, 400679131, 401755638, 404389458, 406170731]
1652D06170731l321076J026306J520043M172821J433143K474671J391258J781235J838875
1660.7D18488007J259727J973496N62820L546028J765366K291565K424736J989135
1668.4D34300880K918892J786194M414787K152596L117943K547073K014504K927055
1676.1D56179924L184967M402962K625084L317718K878456L871575L523216j95541
1683.8D79788361L351173L261566N652046M093285L851662L821869L978958M682960
1691.5E12481880L721352L766365L482895L446426M64249M625358M925690M567986
1699.3E41482201N484809k62145N177078M175606L079299K476655L241043K704620
1707E67559166K872887L621101K478790K460594K569237K478905J898384K04239P86438
$$ y = [406170731, 402849655, 403875961, 405396004, 409568825, 411001968, 413476639, 414867897, 416649132, 418488007, 419747734, 421721230, 422284050, 425830078, 427595444, 429887009, 432311745, 434300880, 437219772, 439005966, 443420753, 445573349, 448691292, 451238365, 453252869, 456179924, 459364891, 463767853, 466392937, 469710655, 472589111, 476460686, 479983902, 479788361, 483139534, 486401100, 492053146, 496146431, 499998093, 503819962, 507798920, 512481880, 516203232, 519969597, 523452492, 526898918, 527363167, 531988525, 536914215, 541482201, 546967010, 546704865, 551881943, 556057549, 559136848, 561613503, 564854546, 567559166, 570432053, 574053154, 576531944, 578992538, 581561775, 584040680, 585939064, 586143303, 586929741]
1715.6E86929741K560348J126213k306251N223923M339447K840385J739922M04014
1723.4F02857742Q39501J640548J443406P89375J369858J942138O33850J380349L017501
1732F15914268L119584j5984l358078L133240L036918J471177K357673J256218K07939
1740.7F27122955L582726K399597J112671K461166K957192J528549O83060J010131
1748.4F42858047J363144M722672L235626K067108M174195L059463K337723J545181
1756.2F65363159N1346J497498K169570K070542K570495P61338K011871L617401J561051
1764.8F81674271Q52737J015625J020508j358032J513290L169556l38898n70374J497803
1773.5F88476486L908081J966858l68118J330795j08795L43552O5918L15933J955871
$$ y = [586929741, 589490089, 590616302, 588310051, 593533974, 597873421, 600713806, 602453728, 602857742, 603697243, 605337791, 606781197, 607570572, 608940430, 610882568, 611516418, 612896767, 615914268, 619033852, 619017868, 615659790, 618793030, 621829948, 623301125, 625658798, 626915016, 627122955, 630705681, 633105278, 634217949, 636679115, 639636307, 641164856, 641847916, 642858047, 644221191, 648943863, 652179489, 654246597, 658420792, 661480255, 663817978, 665363159, 665414505, 666912003, 669081573, 671152115, 673722610, 674483948, 676495819, 680113220, 681674271, 682527008, 683542633, 684563141, 683205109, 684718399, 687887955, 687549057, 686978683, 688476486, 692384567, 694351425, 693983307, 695314102, 695205307, 695548859, 695614777, 695930710, 697886581]
1782.2F97886581K298966J799011O0425Q21609R19495J26724m33426N40543m6387l33481
1791.8G03640060N79224J210251L308716J242981K20108P10907K17819p47223j613312
1800.5G08769531J226959M77829J690064K087021J422119J543503j53122k15912o8207
1809.2G16779785l61481j748199N34134J872330R80529J925202J184006J112670K66800
1817.9G22545776J374k53830j013642J92643m29383J017685J237641m70887J268769
1826.5G24096146K165527J220627j462021k780914K56881J446076Q5525M07944J241913
1835.2G26677704Q77075J100464O20575R01718l13263k59476o65969k73743m3869l101654
1844.9G25519562L108978K621918N75409N64575L22952Q7967o38199k92816o79398
$$ y = [697886581, 700185547, 701984558, 702044983, 702866592, 703786087, 703912811, 703479385, 704019928, 703973541, 703640060, 704219284, 705429535, 708738251, 709981232, 710201340, 710912247, 711130066, 710382843, 708769531, 709996490, 710474319, 712164383, 714251404, 715673523, 717217026, 717063904, 716847992, 716779785, 716418304, 714670105, 715204239, 717076569, 718057098, 719982300, 721166306, 722278976, 722545776, 722547150, 722293320, 721279678, 721472321, 721042938, 722060623, 723298264, 722827377, 724096146, 726261673, 727482300, 726020279, 723239365, 723496246, 724942322, 725027847, 725435791, 726677704, 727554779, 728655243, 729275818, 730177536, 729864273, 729604797, 728938828, 728665085, 728621216, 725519562, 728628540, 731250458, 731825867, 732390442, 732713394, 732801361, 732163162, 731870346, 731190948]
1853.6G31190948M59519Q45261N74264O22864K11334J034393J88675r8877n77163k84729
1863.2G34166489k03324j46560J219406J80969N17654m50515o57730R70687Q64182
1871.9G36461258K10113q66317J08490K54898Q40072R02176M34800L01895J3122O58341
1881.5G39318848o10047n23071n98984k73132O21414M14658J385116K14920m15497
1890.2G39534225L69492L31955l72162o39496m18625n27649Q73948L66516O20117R93729
1899.8G41132050L77349K18430l74680j70822q45718k14234J85166L19519Q18405N16358
1909.5G41961823N00259j55335N45884j83487l69416n42450p72323L26309j117325
1918.2G40193939Q09784J521530Q44574N34210p53784k50015M6539l45840r21173J30081
$$ y = [731190948, 731650467, 732495728, 733069992, 733692856, 733904190, 734938583, 735127258, 735028381, 734451218, 734166489, 733963165, 733816605, 735036011, 735216980, 735734634, 735284119, 734626389, 735597076, 736461258, 736671371, 735805054, 735913544, 736168442, 737008514, 737910690, 738345490, 738647385, 738660507, 739318848, 738708801, 738185730, 737586746, 737313614, 737935028, 738349686, 739734802, 739949722, 739534225, 739903717, 740235672, 739863510, 739224014, 738805389, 738277740, 739151688, 739518204, 740138321, 741132050, 741509399, 741727829, 741353149, 741182327, 740336609, 740122375, 740307541, 740627060, 741445465, 741961823, 742462082, 742306747, 742852631, 742669144, 742299728, 741757278, 740984955, 741311264, 740193939, 741003723, 742525253, 743369827, 743904037, 743150253, 742900238, 742946777, 742600937, 741679764, 741809845]
1927.8G41809845O20193L69034M55017K80915O47049k83738l44009o87714n40466l19977
1937.5G42006149n10711Q13522O48575R20944J89972m44794L97415m37851p66601q26798
1947.1G41989822l43780J2283M75922L48587N83649R11026K4490n2872o30264o16379
1956.7G42702484q43048n19791L16315L32260P32651L28979N55192K6245l80707n58319
1966.4G42692261j054840l46146j01242L75824J93329O17981P09076M09774J05057
1975.1G43601074r29413n05600l08685M5700m57306m94766K10953K20184J102677O51855
1984.7G43136673j17035p72934m57840m87213q87222J23596j36719p2403M87747J090088
1994.3G41906738L39814l51182O87p04651m86831m63257l0899m5548j1520M06418J91497
$$ y = [741809845, 742430038, 742799072, 743254089, 743535004, 744182053, 743898315, 743554306, 742866592, 742326126, 742006149, 741495438, 742308960, 742957535, 743878479, 744068451, 743623657, 744021072, 743583221, 742816620, 741989822, 741646042, 741658325, 742134247, 742482834, 743066483, 743977509, 744001999, 743949127, 743318863, 742702484, 741859436, 741339645, 741655960, 741988220, 742720871, 743049850, 743605042, 743631287, 743250580, 742692261, 741637421, 741291275, 741190033, 741565857, 741759186, 742377167, 743086243, 743496017, 743601074, 742671661, 742166061, 741857376, 741903076, 741445770, 740951004, 741161957, 741382141, 742484818, 743136673, 743019638, 742246704, 741788864, 741301651, 740414429, 740538025, 740401306, 740328903, 740816650, 741906738, 742246552, 741895370, 741896057, 741191406, 740704575, 740241318, 740210419, 740164871, 740153351, 740559769, 740751266]
2005G40751266N46875j30538k08970q08334r97620l20968k70310K82669r384J97525
2014.6G39032211M33808N52215k01797n90744l06778o94885J8692m59214p9422N08957
2024.2G38213043K42920J83869l82996r5673o74438l06854j00708m49295J907L8452
2033.9G36670227L02200m6081Q9798j26343j70288k91290p10068l76511m25262N0201
2043.5G34966583J35193O34155L80326j96228k83966n11246K37884l53012l20129k56577
2053.2G34432983k4185M52194o4697L05405r1782K49863P0648m69360n58167q19092
2062.8G33483810j81732k65655N55343O04401J84250J03683m1809K87171m53797o55517
2072.5G33620148o19660j59607n5923L05862R28421K04239P8888k14920l99094r26971
$$ y = [740751266, 741298141, 741167603, 740958633, 740150299, 739152679, 738831711, 738561401, 738844070, 738834686, 739032211, 739466019, 740018234, 739816437, 739225693, 738918915, 738224030, 738242722, 737783508, 737704086, 738213043, 738455963, 738639832, 738256836, 738161163, 737486725, 737179871, 737079163, 736629868, 736631775, 736670227, 736972427, 736926346, 737016144, 736889801, 736719513, 736428223, 735718155, 735341644, 734916382, 734966583, 735101776, 735735931, 736116257, 735920029, 735636063, 735124817, 735362701, 735009689, 734689560, 734432983, 734408798, 734860992, 734796295, 735101700, 735009918, 735259781, 735330429, 734861069, 734302902, 733483810, 733302078, 733036423, 733591766, 734196167, 734380417, 734484100, 734442291, 734729462, 734275665, 733620148, 733000488, 732840881, 732784958, 733090820, 734019241, 734223480, 734302368, 734087448, 733688354, 732761383]
2082.1G32761383o01578l1357n7601L04031k30942N22080L69873J1215L33328l00903
2091.7G33079529n62821q51593k09732l75061l09143K29645N80215P42112l19825j47705
2101.4G31855621k22778n44968o66504m46777j35345j34507M91867J77460L94364J02081
2111G30870514k34222j36338p05795l37830k79007j11541j7166K28500L17383P4920
2120.7G29669418k45590o31180Q0185n2490j78680k41852m9820N2032k26593M79508
2130.3G28654938n951j70593J3046o8512n65415n66787N29480K64740K19726q6365
2140G28218307L17231O03714k0218J9531o71463n16891n0507L25317L3112J09329M83933
2150.6G28851395k84806Q2398l1052p6446r6817m06113m80042l00064N46875M22287
$$ y = [732761383, 732159805, 732128448, 732070847, 732374878, 732143936, 732666016, 733035889, 733047104, 733380432, 733079529, 732516708, 731665115, 731455383, 731080322, 730771179, 731000824, 731581039, 732323151, 732003326, 731855621, 731632843, 731087875, 730421371, 729974594, 729839249, 729704742, 730196609, 730374069, 730768433, 730870514, 730636292, 730499954, 729794159, 729456329, 729177322, 729065781, 729048615, 729277115, 729594498, 729669418, 729423828, 728792648, 728872833, 728820343, 728641663, 728399811, 728349991, 728402023, 728175430, 728654938, 728648987, 728478394, 728491440, 728422928, 727857513, 727290726, 727820206, 728084946, 728304672, 728218307, 728535538, 729139252, 729119034, 729138565, 728467102, 727950211, 727899704, 728225021, 728258133, 728367462, 728851395, 728566589, 728648987, 728617935, 728541489, 728444672, 728038559, 727558517, 727258453, 727805328, 728227615]
2160.2G28227615M96369J91498L40652m806r64509k21405j07727Q7967j9912k213J74789
2170.8G28198318K14768N78079K82669J2512p44628l69339l09144l69491M03595L42331
2180.5G28239670P11365O82220O45447j94931n98297j68229n12008m76990l95660L43246
2190.1G28275833M26941M46243L22724K02636M56467k87323p8812j44424k91214m22668
2199.8G28906403m8676K95181j2436Q68073J89819P6981L18298l67431l95737o36978
2209.4G29193497l77198q2931O27899P02667N69764K38037k68250r3918n13687j72958
2219G29822922j90964n5161K0981J95008O33926j65482K63520L50113Q4304k41928
2228.7G30717239o48803m31595m8065O57882M2572J38398J62658j6403K29721l11355
$$ y = [728227615, 728723984, 728915482, 729256134, 729251328, 728286819, 728065414, 727957687, 728045654, 728025742, 728023529, 728198318, 728413086, 728991165, 729273834, 729286346, 728541718, 728172379, 727863235, 727493744, 727897339, 728239670, 728951035, 729633255, 730278702, 730083771, 729485474, 729317245, 728805237, 728328247, 727932587, 728275833, 728702774, 729149017, 729471741, 729674377, 730130844, 729843521, 729764709, 729620285, 729329071, 728906403, 728857727, 729152908, 729140472, 730008545, 730198364, 730275345, 730593643, 730226212, 729830475, 729193497, 728816299, 728733368, 729361267, 730063934, 730633698, 730871735, 730603485, 730509567, 729995880, 729822922, 729631958, 729576797, 729597778, 729792786, 730426712, 730261230, 730524750, 730874863, 730959167, 730717239, 730068436, 729636841, 729588776, 730246658, 730289230, 730427628, 730590286, 730573883, 730803604, 730492249]
2238.3G30492249k15302k75650J7929k62604l99246M07333M96750K68860J35040J11619
2248G30776978k86026j33744m94079j65406L07923j85471K55509j25199J08414K15378
2257.6G30274277J65939J69983n94330m95987m92477K20184K98462L12500J98975J9378
2267.3G30076904N30091l64991k44293k97088n10025j67084K85644L43094m65240L83224
2276.9G29570236N05676l3950o63758o58569j07193m05960J4114J02158O44913L88794
2286.5G29356461J80206L01285l13111k38113o37360K8839l50647o11190Q1176J06202
2296.2G27903748N03616K29034O97556K9754j05285k52533j327744l35922l0746J64108
2305.8G27475586k74735R1019O30341L19976L04566k53830q698j204757o27365J15509
$$ y = [730492249, 730276947, 730001297, 730019226, 729756622, 729357376, 729764709, 730261459, 730530319, 730665359, 730776978, 730490952, 730357208, 729863129, 729697723, 730005646, 729820175, 730075684, 729950485, 730058899, 730274277, 730440216, 730610199, 730015869, 729519882, 729027405, 729247589, 729546051, 729858551, 730057526, 730076904, 730606995, 730242004, 729997711, 729700623, 729190598, 729023514, 729309158, 729652252, 729187012, 729570236, 730075912, 730041962, 729378204, 728719635, 728612442, 728206482, 728220596, 728322754, 728967667, 729356461, 729536667, 729837952, 729524841, 729286728, 728649368, 728678207, 728327560, 727716370, 727797546, 727903748, 728407364, 728636398, 729333954, 729363708, 729258423, 729005890, 727678146, 727342224, 727311478, 727475586, 727200851, 727291870, 727922211, 728242187, 728546753, 728292923, 728284225, 727079468, 726452103, 726567612]
2315.5G26567612j62583Q82416J72119L95966j59226k60238O06155m0588q57697j269836
2325.1G25874100p4387N61676N90363q20618k97317J158523L52097J05133m80500j28326
2334.8G26840744k08588m86297n71060M96826O79931r86709l49579J50528L04642j174546
2344.4G24695892q35800j72272q15963q6670K3193O23703K08664O40946J078109K40479
2354.1G25600281K71606j629410k60009P84454O28967p95669p30133M3869j006165
2362.7G22907791P46689q92715J3885k59476j167221N73807o00281k12784J60675M09317
2372.4G21679687n98144j199646l83148j77307J5335l43857k89154n49164j36871J1139
2382G18028870l23105r5825j95618j81046n49545l14865k60696k26517q5068j67160
$$ y = [726567612, 726405029, 727287445, 727459564, 727855530, 727696304, 727436066, 728042221, 728001633, 727143936, 725874100, 725799713, 726361389, 726951752, 726131134, 725833817, 726992340, 727344437, 727449570, 726969070, 726840744, 726632156, 726145859, 725574799, 726071625, 726751556, 725764847, 725415268, 725565796, 725870438, 724695892, 723860092, 723687820, 722871857, 722785187, 722808380, 723432083, 723640747, 724281693, 725359802, 725600281, 725871887, 724242477, 723982468, 724766922, 725395889, 724600220, 723870087, 723913956, 722907791, 723654480, 722761765, 722775650, 722516174, 721348953, 721922760, 721322479, 721109695, 721270370, 721679687, 721081543, 719881897, 719498749, 719321442, 719336777, 718992920, 718703766, 718154602, 718017731, 718028870, 717705765, 717609940, 717414322, 717233276, 716683731, 716368866, 716108170, 715881653, 715796585, 715629425]
2391.7G15629425J48468l52554J43509j18180p59124m21906o08902O1188R3536k40402
2401.3G13575058r2011J71280k3117l50723k70386n28717k42767n09567n46494r3307
2410.9G11089249J39923K58865k81143j45264m1809l39432o15844m60129l42331l85819
2420.6G08876266k13851k08970J77231k85186l27225J57318R6435l31039r94644m16641
2430.2G06529694j05057l08151o04630n6381M01153l13186j48621k47421k08130l56140
2439.9G04583130n06134m98734o07986K8229l45230l02124N2566J36032k2201p03736
2449.5G01813812o73599l89633O7367k65426n00794k37732N7755m5853o24237m90265
2459.2F98711395o70929j30996L10440r7657m96063l72009J3733n04227k50625l25852
$$ y = [715629425, 715777893, 715425339, 715568848, 715450668, 714691544, 714269638, 713660736, 713721924, 713815460, 713575058, 713483047, 713654327, 713631210, 713280487, 713010101, 712481384, 712238617, 711729050, 711182556, 711089249, 711229172, 711488037, 711206894, 711061630, 711019821, 710680389, 710064545, 709604416, 709262085, 708876266, 708662415, 708453445, 708630676, 708345490, 708018265, 708175583, 708272018, 707940979, 706946335, 706529694, 706424637, 706116486, 705511856, 705455475, 705856628, 705543442, 705394821, 705147400, 704939270, 704583130, 704076996, 703578262, 702970276, 702998505, 702653275, 702351151, 702403717, 702539749, 702517548, 701813812, 701140213, 700750580, 700817947, 700552521, 700051727, 699813995, 699871750, 699825897, 699201660, 698711395, 698040466, 697909470, 698219910, 698122253, 697626190, 697254181, 697267914, 696763687, 696513062, 696187210]
2468.8F96187210j61438l60260j085205l49731k18201O0348k68707m78287l61480o07834
2478.5F92356415n4474k10419n49011r26895l21808K4033o0654J74484m58603k26974
2488.1F89746094o89469q17413l23639l77350k38571l42941j43204m74396j65176o027
2497.7F86167908n13840r39331r97543O4621j32370o87256n59845o7673q7891k03170
2507.4F82043610M0664n79986k09656l53699r65042q95309o88172p6904K4719K5330
2517F78365555j08414O485l49274m41513l22036p98722o17675r97925n47180J17950
2526.7F74307251P5912M2191l92303l04032l47900l04489n77622o51398j96762r6130
2536.3F71554718k30331n39322l46451l75900j83411r5749q2626j89896o28662m46854
$$ y = [696187210, 696025772, 695665512, 694580307, 694230576, 694012375, 694072723, 693804016, 693325729, 692964249, 692356415, 692301941, 692091522, 691542511, 690615616, 690293808, 690317841, 690257187, 690431671, 689973068, 689746094, 689056625, 688239212, 687915573, 687538223, 687299652, 686956711, 686813507, 686339111, 686173935, 686167908, 685654068, 684714737, 683717194, 683781815, 683649445, 682962189, 682402344, 682334671, 682246780, 682043610, 682084274, 681504288, 681294632, 680940933, 679975891, 679080582, 678392410, 678315506, 678340225, 678365555, 678257141, 678263626, 677914352, 677472839, 677150803, 676352081, 675734406, 674736481, 674189301, 674307251, 674383163, 674425354, 674033051, 673729019, 673381119, 673076630, 672499008, 671847610, 671650848, 671554718, 671324387, 670785065, 670438614, 670062714, 669879303, 669783554, 669700928, 669511032, 668882370, 668435516]
2546F68435516q53653m79736K4262r156m1504o29196m71649l66821k44828l79562n18341
2556.6F64465332k79312l33481j82953j83334l4256l09448n14908l77121l57743l10821
2566.2F61581955m26559k86637k97012k15988m63028m18778j75934l16467k03323m44794
2575.9F58333435l72925m20227j81808j30158m02603o2027l79181n35507n02167k70614
2585.5F55076218l88413k63977J84479l19061j94703l61633k88467k10343n74264l75061
2595.1F52284775m83933k80151m03214o33316p41195m31900J72729J679j24665l22113
2604.8F49038696m74777m03137m58m98123q46481k16675m10843k68555l09143m05960
2614.4F45204544n29480l77426m8447p60727n37567l70025l36152k18429m88892l35922
$$ y = [668435516, 667581863, 667102127, 667126389, 667117233, 667075729, 666446533, 665974884, 665608063, 665363235, 664983673, 664465332, 664186020, 663852539, 663669586, 663486252, 663451996, 663142548, 662627640, 662250519, 661892776, 661581955, 661155396, 660868759, 660571747, 660355759, 659892731, 659473953, 659298019, 658981552, 658778229, 658333435, 657960510, 657540283, 657358475, 657228317, 656825714, 656763687, 656384506, 655848999, 655346832, 655076218, 654687805, 654423828, 654608307, 654289246, 654094543, 653732910, 653444443, 653234100, 652659836, 652284775, 651800842, 651520691, 651117477, 650484161, 649742966, 649311066, 649483795, 649485474, 649360809, 649038696, 648563919, 648160782, 648160324, 647662201, 646815720, 646599045, 646188202, 645919647, 645610504, 645204544, 644675064, 644297638, 644249191, 643488464, 642950897, 642580872, 642244720, 642026291, 641537399, 641201477]
2624.1F41201477k95181k42615m73022m62494n31273n66406n02625m17862P362k38533
2633.7F37478828l72924n16777o2333j06391r02176m20609k72789m58221p61299n13459
2643.4F33091850l77884o24961k175l26347n55191j97640l58734n17883l09067m03480
2653F29418488p03202k60925k47765l56140k38266k82402l84559n46761m06380j57699
2662.6F25834389r8419m53682m85573m67186l44544k35252l66707j34582n00374n54276
2672.3F22193794k60048j85508r5978j39847m10004o79931j33248l10821m46053k80571
2681.9F19251785k86827P9766l50876l99781n10902l95126k13395o86225l32909k82059
2691.6F15873451j92337k28576n18151j50680J38893N5465k93350n76591p99828n26657
$$ y = [641201477, 640906296, 640663681, 640190659, 639728165, 639196892, 638630486, 638127861, 637709999, 637717361, 637478828, 637105904, 636589127, 636526794, 636420403, 635518227, 635097618, 634824829, 634366608, 633605309, 633091850, 632713966, 632089005, 632086830, 631760483, 631205292, 631007652, 630648918, 630131035, 629821968, 629418488, 628715286, 628454361, 628206596, 627850456, 627612190, 627329788, 626945229, 626398468, 625992088, 625834389, 625735970, 625282288, 624796715, 624329529, 623984985, 623749733, 623383026, 623248444, 622748070, 622193794, 621933746, 621748238, 621652260, 621512413, 621102409, 620422478, 620289230, 619978409, 619532356, 619251785, 618964958, 619044724, 618693848, 618294067, 617783165, 617388039, 617174644, 616488419, 616155510, 615873451, 615681114, 615452538, 614934387, 614783707, 614922600, 614978065, 614684715, 614108124, 613308296, 612781639]
2701.2F12781639m73175n42679l21159n29862l82309N379J04141j71012l87917l70140
2710.9F09712906l11470m60625m86603q8806l47938l55683M6883L662l20740j38893
2720.5F07252693Q9722o33316o24047k68249q469k12516o86913l77998k28997J46141
2730.2F04448051j93748o12144l70598k20414J56174l8223l95393m68865o2675k89154
2739.8F01953011l89176J53961k01454j82190l71246k91176k1629k00768J82076p0381
2749.4F00561028n54352n94521j63765K44866P1334k91366m12064m78553l74489J80778
2759.1E98188896j36757l11165m13856n30930N5848j17913j72233k18048m72336n52979
2768.7E95318527l68385p629k82555m70314l24860L5362l1204r5367j01624m14352
$$ y = [612781639, 612308464, 611765785, 611444626, 610914764, 610532455, 610537834, 610641975, 610470963, 610083046, 609712906, 609401436, 608940811, 608454208, 608365402, 608017464, 607661781, 607708664, 607712326, 607391586, 607252693, 607342415, 606709099, 606085052, 605816803, 605808334, 605595818, 604908905, 604530907, 604301910, 604448051, 604254303, 603642159, 603271561, 603051147, 603207321, 603169098, 602773705, 602304840, 602242165, 601953011, 601563835, 601717796, 601516342, 601334152, 600962906, 600671730, 600650101, 600449333, 600631409, 600561028, 600006676, 599412155, 599248390, 599493256, 599564590, 599273224, 598861160, 598382607, 598008118, 598188896, 598052139, 597740974, 597327118, 596796188, 596852036, 596734123, 596561890, 596343842, 595871506, 595318527, 594950142, 594942513, 594659958, 594189644, 593864784, 593900146, 593868942, 593773575, 593671951, 593257599]
2778.4E93257599l80707n90935o73599n90095m51966m88891k79770L5171j03531p6408
2788E89656868m55742k73132m16146p04574n28717q09784l33710l57399k10380k20490
2797.7E85346794q85353o85692n32799o7482n0926n38215n97268l78303m22554m38805
2807.3E80749397k25143o37093n00221n17502q02727o47049o82411p20863o57463n04875
2816.9E74854050n25208j65748n45655p71942k14958n21545o00014o51741n57518o67954
2826.6E69631767q33130p25936o05889r3727n76172q17337m35333m66614j189270j469841
2836.2E62418518p87086q28247n82619p76177j339187j578827j356850p64274j452523
2844.9E52952728j561279j335030j477050j649361j780815j546669j465836n12504
$$ y = [593257599, 592876892, 592285957, 591612358, 591022263, 590570297, 590081406, 589801636, 589836807, 589733276, 589656868, 589201126, 588927994, 588511848, 587807274, 587278557, 586468773, 586135063, 585777664, 585567284, 585346794, 584461441, 583775749, 583242950, 583175468, 583124542, 582586327, 581989059, 581610756, 581188202, 580749397, 580524254, 579887161, 579386940, 578869438, 578066711, 577419662, 576737251, 576016388, 575358925, 574854050, 574328842, 574163094, 573617439, 572845497, 572630539, 572108994, 571508980, 570857239, 570299721, 569631767, 568798637, 568072701, 567466812, 567373085, 566796913, 565979576, 565544243, 565077629, 563888359, 562418518, 561631432, 560803185, 560220566, 559444389, 558105202, 556526375, 555169525, 554405251, 552952728, 551391449, 550056419, 548579369, 546930008, 545149193, 543602524, 542136688, 541624184]
2852.6E41624184j18676n61752p84302l80516L21579N9853p1945l03231l15704J43204
2862.3E39612694J74255m49066r45892m30947k86483n48287o11153n03616n74379m23126
2871.9E35014000k35596o37741o91452p67746n24559k69546k19117n10902p26013Q5106
2881.6E30516434k8954m62303q57544p72858j80473q64716j159286o18668n17349r53064
2891.2E24101219m73938l14789q67424m87861p69272p85332o93817r78279n01137l29628
2900.8E17899742p98073o77032R0179m97551j071815q00362o74248m81720o48078p92504
2910.5E11548538q36601p10564r02290j042709j148987j273461j033096j425171j269073
2919.2E01906586j044350r00002n96122n13916l04146n46913P2250J16348p2059N43594
$$ y = [541624184, 541505508, 540943756, 540159454, 539778938, 540100517, 540160370, 540088425, 539785194, 539469490, 539612694, 539786949, 539337883, 538391991, 537961044, 537674561, 537126274, 536515121, 536011505, 535437126, 535014000, 534778404, 534140663, 533449211, 532681465, 532156906, 531887360, 531668243, 531157341, 530431328, 530516434, 530487480, 530025177, 529167633, 528394775, 528214302, 527349586, 526190300, 525571632, 525054283, 524101219, 523627281, 523312492, 522445068, 521957207, 521187935, 520402603, 519708786, 518730507, 518229370, 517899742, 517101669, 516424637, 516514816, 516017265, 514945450, 514145088, 513470840, 512989120, 512341042, 511548538, 510711937, 510001373, 509099083, 508056374, 506907387, 505633926, 504600830, 503175659, 501906586, 500862236, 499962234, 499366112, 498852196, 498548050, 498001137, 498073387, 498189735, 498117676, 498661270]
2928.8D98661270J06659q6822o3820j89209P8621N63926R17130R39483O29006L89900
2938.5E01946144M54521J08643L54309R08928P32765O91299P95975K41356K32201Q54034
2948.1E07320175M94919M84505K57530n226l2425l44238M33616L83377L17002N87501
2957.7E09896736L67928M89196K22435K1172k5902M30985L44467J98555L78494K0905
2967.4E12344971O22635Q05931M24080O21795Q14591J41525l3951O53420K15606J75858
2977E16786461J49040J53504N48095L99132L21198l5248O0730J7357j25542O4468j57089
2987.6E18182106j53389K06337M90227M65278M87442j93824p37114n07469j3466L53241
2997.3E18579369m70963n95436k06795j70669k46048l92418l26615o22711k84729j47362
$$ y = [498661270, 498767929, 498681107, 498617287, 498428078, 498506699, 499070625, 499987755, 500927238, 501556244, 501946144, 502400665, 502509308, 502863617, 503772545, 504505310, 505196609, 505992584, 506233940, 506466141, 507320175, 507815094, 508299599, 508557129, 508551903, 508519478, 508175240, 508608856, 508992233, 509309235, 509896736, 510264664, 510753860, 510976295, 510997467, 510971565, 511402550, 511747017, 511945572, 512324066, 512344971, 512967606, 513773537, 514197617, 514819412, 515634003, 515775528, 515741577, 516394997, 516610603, 516786461, 516935501, 517089005, 517637100, 518036232, 518357430, 518322182, 518382912, 518400269, 518274727, 518339195, 518182106, 518028717, 518235054, 518725281, 519190559, 519678001, 519484177, 518747063, 518239594, 518226128, 518579369, 518108406, 517512970, 517306175, 517135506, 516889458, 516497040, 516170425, 515547714, 515262985, 515115623]
3006.9E15115623j47819q6441n93338m99001l71818m61388m39644l71666o27098m33044
3016.6E11084366j38703l75289l30353n55763n99137p65686l07350L4142p03164p12967
3026.2E06630096n84755k21633m10233m54941l19671q59452l84330l03574m93622o99501
3035.9E01898384p19490n70335n64652P9842p9346n54581q62465p32955n92843j018409
3045.5D96283150r19152p60307l85055j85891n4474k13432p65190o61774p51571o65856
3055.1D90920448l41606n07774o84014p66601r76372k98653N1728o99311m97703n05333
3064.8D85694809k23045J6594o77987p45544r46922o52886o38923m02642K94648o04783
3074.4D81113319p82089p1983N4817j30806n74722r16519o72760l73650o81953o94619
$$ y = [515115623, 514967804, 514881363, 514288025, 513789024, 513417206, 512955818, 512516174, 512144508, 511517410, 511084366, 510945663, 510570374, 510240021, 509684258, 509085121, 508319435, 508012085, 508046227, 507343063, 506630096, 506045341, 505823708, 505413475, 504958534, 504638863, 503779411, 503395081, 503091507, 502597885, 501898384, 501178894, 500608559, 500043907, 500123749, 500044403, 499489822, 498627357, 497894402, 497301559, 496283150, 495363998, 494603691, 494218636, 494032745, 493978271, 493764839, 492999649, 492337875, 491586304, 490920448, 490578842, 490071068, 489387054, 488620453, 487644081, 487345428, 487397156, 486697845, 486200142, 485694809, 485471764, 485488358, 484810371, 484064827, 483117905, 482465019, 481826096, 481423454, 481718102, 481113319, 480331230, 480259247, 480314064, 480183258, 479608536, 478692017, 478019257, 477645607, 476963654, 476269035]
3084.1D76269035j40571J69601l98598o73141m54597n17769k28653k31896p95059j064644
3093.7D71933708l20892J49841m22249m95834j09978o9732q25653j023598n20287o56662
3103.4D67638664o03637k41852j2703l04070r73205o51322N570m45709o54412k89459
3113D63467865l18565o21109p58171l37525m37355m28924l70789o87943n07888o52771
3122.6D58346825p06902o98318k51580m77295j109619j30577j41029n57976q90427
3131.3D53383102p70301l57209q83865k29454m65736q91610k70729l64914l29513n46265
3141D48273506p39555q79364o42929k71454n06745l62052k75536p04994r67598m77448
3150.6D42445831m84199o98548l89289o53077p29751o30913p62596n81589k73895l88527
$$ y = [476269035, 476128464, 476298065, 475899467, 475226326, 474771729, 474253960, 474025307, 473793411, 472998352, 471933708, 471612816, 471762657, 471340408, 470844574, 470734596, 470664864, 469839211, 468815613, 468295326, 467638664, 467035027, 466793175, 466780472, 466476402, 465503197, 464851875, 464857445, 464411736, 463757324, 463467865, 463149300, 462528191, 461770020, 461432495, 460995140, 460566216, 460195427, 459507484, 458999596, 458346825, 457639923, 456941605, 456690025, 456212730, 455103111, 454972534, 454831505, 454273529, 453383102, 452612801, 452255592, 451371727, 451142273, 450676537, 449784927, 449514198, 449149284, 448819771, 448273506, 447533951, 446654587, 446011658, 445740204, 445233459, 444871407, 444595871, 443890877, 442923279, 442445831, 441961632, 441263084, 440873795, 440220718, 439490967, 438860054, 438097458, 437515869, 437241974, 436853447]
3160.3D36853447m63219n91812r52377n28183o13175j163215p21131n9623k0523l13645
3169.9D31426544k82135o50291j241417r63478m19236m84657o16569p61681q37784
3178.6D25169296j72386j40839m92439n53436o94466m41780l49579o29615q16117o01043
3188.2D20277596n92728r25408n10559p476m78363q71659m77485o88057r85413n10674
3197.9D14229774j86271k72179m15459m57878o83059n31731n34744p28035l80745l69568
3207.5D09670105m56619m20571k86064l79524k01149k13165j204796p33414n607k78626
3217.2D05490570l99132n62744l32336k94953p25937r00116n26771j83449m08287l88985
3226.8D00767860j94740o33888o89659l6316j16081l42102n76668o83441k91710n27764
$$ y = [436853447, 436390228, 435798416, 434846039, 434317856, 433704681, 432541466, 431820335, 431760712, 431740189, 431426544, 431144409, 430494118, 429252701, 428289223, 427869987, 427385330, 426768761, 426007080, 425169296, 424996910, 424856071, 424363632, 423810196, 423115730, 422673950, 422324371, 421694756, 420878639, 420277596, 419684868, 418759460, 418248901, 418241425, 417763062, 416891403, 416413918, 415725861, 414740448, 414229774, 414043503, 413771324, 413355865, 412897987, 412214928, 411683197, 411148453, 410420418, 410039673, 409670105, 409213486, 408792915, 408506851, 408127327, 407926178, 407713013, 406508217, 405774803, 405769196, 405490570, 405091438, 404528694, 404196358, 403901405, 403175468, 402275352, 401748581, 401565132, 401156845, 400767860, 400573120, 399939232, 399249573, 399213257, 399097176, 398755074, 398178406, 397494965, 397203255, 396675491]
3236.4C96675491o09207n09567m88396l14865l52630n18723p47986k09122J22452j09710
3246.1C92937737m34418r21631l61290q1177l87573n25856q19740k19384L54271q2130
3255.7C89458809o87637q07534l81393m92134n56069k69737m12483l14903k62452m78935
3265.4C84795532k74429J27907j68686n73349j02082k59552o24389n02358l16391L08419
3275C82410622j82877j102676o81725K30675L319o55671l81469q13103n57671K98653
3284.7C78568077j82419k33421j60484M4708J70174p52831j111107l97224M35028M34227
3294.3C76814728m54560q43544n97991n78080k15225j13144m13132J00022K44102l12042
3303.9C73631134m29687r4414q5373q20770j100884k80914j81389o99425l26385m36898
$$ y = [396675491, 396066284, 395556717, 395068321, 394753456, 394400826, 393882103, 393134117, 392924995, 393047447, 392937737, 392503319, 391581688, 391220398, 391139221, 390751648, 390225792, 389406052, 389186668, 389540939, 389458809, 388771172, 387963638, 387582245, 387090111, 386534042, 386264305, 385851822, 385536919, 385274467, 384795532, 384521103, 384649010, 384480324, 383906975, 383804893, 383545341, 382920952, 382418594, 382102203, 382410622, 382227745, 381125069, 380443344, 380674019, 380677338, 380021667, 379640198, 378827095, 378269424, 378568077, 378385658, 378152237, 377991753, 378036461, 378206635, 377453804, 376342697, 375945473, 376380501, 376814728, 376360168, 375516624, 374918633, 374340553, 374125328, 374012184, 373599052, 373699074, 373943176, 373631134, 373201447, 373107033, 373021660, 372200890, 371100006, 370819092, 370637703, 369938278, 369611893, 369174995]
3313.6C69174995p39936j95847j51978l90090l45536n07202p90443n15328k01912l21655
3323.2C65015068m46358n21850n04837o67839q13599r06219n74265j19019m22859n67741
3332.9C59470482n77431o68869p15752o77185m39186j63879l80898j057624q23403
3341.6C53966255o25267k61803J33248p05719q95348o40182n57289n81208m31556l01743
3351.2C49099388n88760p3166k76833r65576q33092k18773J94283o05278p42798n99670
3360.8C44389725o83403o485j84975n36232n70602o87104o0920j38283n69496k00005
3370.5C40752220n50003p40318p16706p09152J70899K28653l35503p07588l57094K23770
3380.1C37259178l71818p97768n45349l33557l31192O4964k52190q22334n6305m4556
$$ y = [369174995, 368435059, 368239212, 368087234, 367697144, 367351608, 366844406, 366053963, 365538635, 365336723, 365015068, 364568710, 364046860, 363542023, 362874184, 362060585, 361154366, 360580101, 360461082, 360038223, 359470482, 358893051, 358224182, 357508430, 356831245, 356392059, 356228180, 355847282, 354789658, 353966255, 353340988, 353079185, 353212433, 352506714, 351611366, 350971184, 350413895, 349832687, 349401131, 349099388, 348510628, 348437462, 348160629, 347195053, 346361961, 346143188, 346337471, 345732193, 344989395, 344389725, 343706322, 343699837, 343514862, 342978630, 342408028, 341720924, 341660004, 341521721, 340952225, 340752220, 340202217, 339461899, 338745193, 338036041, 338206940, 338435593, 338100090, 337392502, 337035408, 337259178, 336887360, 336089592, 335544243, 335210686, 334879494, 334944458, 334692268, 333869934, 333813629, 333769073]
3389.8C33769073m69665m90570j74484Q9340k5292J12687m93470n15251j63345k98805
3399.4C31340218M57k3842l62091p08007l22495L08266K74620k13280k79922J91497
3409.1C30205421j87339k87667J13144o1683j30158p6l15018n2109L90015k89345r3345
3419.7C29291840R842l78342K60887M08821J34354m08554m16413Q68492J263123l47900
3429.3C30686150p11556J55678J79710O34575M35906L37410J58081n93529k35558j7013
3439C31029854M27399L70407K82707M47273O0310M31366N56145O25916J17035L2768
3448.6C34381180K18582j63651N29023N00717N89332R50509K08015J22833Q71239J146507
3458.2C39354286L48168k03133L43895R15604P97767P97501M49447M89502J016884
$$ y = [333769073, 333299408, 332808838, 332634354, 332723694, 332698402, 332811089, 332317619, 331802368, 331639023, 331340218, 331340675, 331316833, 330954742, 330246735, 329924240, 330232506, 330507126, 330293846, 330013924, 330205421, 330018082, 329730415, 329843559, 329781876, 329651718, 329651642, 329336624, 329284515, 329674530, 329385185, 329291840, 329301682, 328923340, 329184227, 329593048, 329727402, 329318848, 328902435, 329770927, 331034050, 330686150, 329974594, 330130272, 330309982, 330944557, 331380463, 331717873, 331875954, 331282425, 331046867, 331029854, 331457253, 331827660, 332110367, 332557640, 332617950, 333049316, 333605461, 334231377, 334348412, 334381180, 334599762, 334436111, 334965134, 335465851, 336055183, 337005692, 337213707, 337336540, 338207779, 339354286, 339702454, 339499321, 339843216, 340758820, 341556587, 342354088, 342803535, 343293037, 344309921]
3466.9C44309921J10359L76473J047745N66635L62472J10207K61116N09911N77850
3475.6C48232689O42280R02291Q92181P45697O68984K2468L17498J005630R22470L91388
3485.2C54743576M74777J249581R02023M06418Q27713J048851M46586K84157N97039
3493.9C60980721R91477Q90732L86658J172524R53712M29878Q82874J369667R78889
3502.6C69037132l12156P56530J444550P16057L15971R93309J205979J21536J121940
3511.3C75400848J221276O52542N84602N87807J152458R33075J180153R02824J46141
3520C82761726M50478J149063J025887N43785R92470J255607J920128R50394q164M07715
3529.6C91449089R43184J572533J334991J387863M84429J136093J204109j65443J549949
$$ y = [344309921, 344420280, 344796753, 345844498, 346411133, 346773605, 346883812, 347144928, 347654839, 348232689, 348874969, 349777260, 350669441, 351415138, 352084122, 352106590, 352424088, 353429718, 354352188, 354743576, 355218353, 356467934, 357369957, 357776375, 358604088, 359652939, 360099525, 360383682, 360980721, 361972198, 362862930, 363249588, 364422112, 365375824, 365805702, 366688576, 368058243, 369037132, 368724976, 369481506, 370926056, 371642113, 371958084, 372951393, 374157372, 374278908, 375400848, 376622124, 377274666, 377859268, 378447075, 379599533, 380532608, 381712761, 382615585, 382761726, 383212204, 384361267, 385387154, 385930939, 386923409, 388179016, 390099144, 391049538, 391041374, 391449089, 392392273, 393964806, 395299797, 396687660, 397172089, 398308182, 399512291, 399346848, 400896797]
3538.3D00896797J501122J378135J509018P77283M77257J137810J803093P95097Q59146
3547D11134758N25398K041855K082863J353836J568184l43781J280213J161957J349754
3555.6D22155037J846085R69314K160988R87320J291008J353836J309357J541633R25255
3564.3D34539833L269501J787109Q80356M02107L22037K654572J320915J799850J777802
3573D48754082J285171J319885J517602K004699J141548J758156J666832J513024J791000
3581.7D62751999K249451J382865P71218L894043J952171j078987K102966J305046
3589.4D75330772K051850K299843K355804J396294J926918L521156K19765J395912
3597.1D90498314K976799J374473K171937J026725O63071K287674K216186K602578
$$ y = [400896797, 402397919, 403776054, 405285072, 406062355, 406539612, 407677422, 409480515, 410275612, 411134758, 411660156, 413702011, 415784874, 417138710, 418706894, 418363113, 419643326, 420805283, 422155037, 424001122, 424970436, 427131424, 428118744, 429409752, 430763588, 432072945, 433614578, 434539833, 437809334, 439596443, 440476799, 440878906, 441200943, 443855515, 445176430, 446976280, 448754082, 450039253, 451359138, 452876740, 454881439, 456022987, 457781143, 459447975, 460960999, 462751999, 465001450, 466384315, 467155533, 471049576, 473001747, 471922760, 474025726, 475330772, 477382622, 479682465, 482038269, 483434563, 485361481, 488882637, 489102402, 490498314, 493475113, 494849586, 497021523, 498048248, 498711319, 500998993, 503215179, 505817757]
3604.8E05817757L404350L090706L35960K292214J538620m43802M695091K365952j031151
3613.5E22065697L517379J354676L348388L958168M58565J410103J086807K045746
3621.2E39245529L162117K822800K847557K548408J514512K754592O579781L168106
3628.9E64643402o577988K330819M282951M283905J819954J080322L058777K897377
3636.6E77819519K666664J394997K102737L107376K829514K263527J158294K272645
3644.4E95615273L303985M542503N31083k454529M873237J738625j31035J624298M501076
3653F14144516M316254L667717M212265m026223K705269N164948J612472K090111J400452
3661.7F35287781K357254J450004J826058K500534Q21838L984452L330459L28522R68857
$$ y = [505817757, 509222107, 512312813, 512648773, 514940987, 516479607, 516035805, 520730896, 523096848, 522065697, 525583076, 526937752, 530286140, 534244308, 534702873, 536112976, 537199783, 539245529, 542407646, 545230446, 548078003, 550626411, 552140923, 554895515, 561475296, 564643402, 558065414, 560396233, 564679184, 568963089, 570783043, 571863365, 574922142, 577819519, 580486183, 581881180, 583983917, 587091293, 589920807, 592184334, 593342628, 595615273, 598919258, 603461761, 603992844, 601538315, 606411552, 608150177, 608019142, 609643440, 614144516, 618460770, 622128487, 626340752, 622314529, 625019798, 630184746, 631797218, 633887329, 635287781, 637645035, 639095039, 640921097, 643421631, 644243469, 648227921, 651558380, 651886902, 652855759]
3670.4F52855759l840103K124176O505203P290802L04794j2336121K423935O276780
3678.1F61605225L603668j571350J089630K966919J989212J322403L55682P85446L619309
3686.8F75766144M972915p237472l326111O754303k455673k71607M352951J650391
3694.5F80205841J916428L04184j152344J188736J622925K509308J928710m765777
3702.2F83758011j291275M771042J979141n7983J06201J444854K616272n774841K602844
3710.9F90154266L620987r723816M570008L887787M74090R06449J385726N76783k908020
3719.6F92944260J607589M500199l476029l561020L561173J778183r0027k199249N29480
3728.3F95594559K815017P48749M195481k318039n958558O790543K48566o395035L75366
$$ y = [652855759, 649015656, 651139832, 657645035, 664935837, 665240631, 652904510, 655328445, 661605225, 665208893, 663637543, 664727173, 667694092, 669683304, 671005707, 671361389, 672146835, 675766144, 680739059, 673501587, 670175476, 676929779, 674474106, 674202499, 678555450, 680205841, 682122269, 682426453, 681274109, 682462845, 684085770, 686595078, 688523788, 683758011, 682466736, 687237778, 689216919, 689158936, 689265137, 690709991, 693326263, 687551422, 690154266, 693775253, 684051437, 688621445, 692509232, 692983322, 693889771, 695275497, 695852280, 692944260, 694551849, 699052048, 695576019, 692014999, 695576172, 697354355, 697264328, 695065079, 695594559, 698409576, 699158325, 703353806, 701035767, 695077209, 701867752, 702116318, 695721283, 696096649]
3736.9F96096649J529846R53980J744003K348557k428589K046127Q374939p079849
3744.7G03585663j1972122P003631L777161L445206l082123q170319Q331528j215744
3752.4G01702881m752884M284363L224640K227554l829651J372452M314728n247040
3760.1G03297043j090164K791671P47910J67694J900024k433853k667999L462677M185104
3768.8G10360107Q30994o513214P86819K669526O6986J94931j80741Q87757K63595
3777.4G09366760J498795K98004m604950K333603J675644k35825Q82721k198944o17676
3786.1G08398132R77860J53427N45731K48718n8060k13013k0217n17731R99298K732925
3795.8G13247070k623672l105698J455002K806778M782639l716507r828492J933289
$$ y = [696096649, 697626495, 698580475, 700324478, 702673035, 700244446, 702290573, 710665512, 703585663, 691613541, 698617172, 702394333, 705839539, 702757416, 694587097, 702918625, 701702881, 696949997, 701234360, 704459000, 706686554, 702856903, 704229355, 708544083, 703297043, 702206879, 704998550, 705746460, 705914154, 707814178, 705380325, 702712326, 706175003, 710360107, 711191101, 704677887, 705464706, 708134232, 708201218, 708396149, 708215408, 709103165, 709366760, 710865555, 711163559, 706558609, 708892212, 710567856, 710332031, 711214752, 709015808, 708398132, 709375992, 709529419, 710075150, 710323868, 710265808, 710052795, 710032578, 709514847, 710514145, 713247070, 710623398, 707517700, 708972702, 711779480, 716562119, 712845612, 703017120, 704950409]
3803.5G04950409L152313M383698M151992p900772l675079L779984J942977O61774
3811.2G11447296J083527Q58078M73327K434082k287979r336013L690338M028625L870392
3819.9G16261673K073746j3049317J143036L574982Q86612J389847k68021k420044
3827.6G09592514J305618K448426K404861O8970o668396K111282N200577m409027j566086
3836.3G10488739M762039n768204k665176O290283l517685P0725N523147j994857l076249
3844.9G10112762K227555J722717k64358N48477n85709J188507L794632m563751J281204
3853.6G15462036j1046371O81839P560806j299133r21097J811371J443329J599044
3861.3G15291824l653259N73120N175781m337463n221024L070374M229813L355407
$$ y = [704950409, 708102722, 712486420, 716638412, 708737640, 705062561, 708842545, 710785522, 711447296, 712530823, 713388901, 713862228, 716296310, 714008331, 704672318, 708362656, 712391281, 716261673, 718335419, 705286102, 706429138, 710004120, 710890732, 712280579, 712012558, 709592514, 710898132, 713346558, 715751419, 715820389, 709151993, 711263275, 716463852, 712054825, 710488739, 715250778, 709482574, 706817398, 713107681, 709589996, 709660721, 715183868, 713189011, 710112762, 712340317, 714063034, 713798676, 714347153, 713761444, 714949951, 718744583, 714180832, 715462036, 704415665, 705097504, 712658310, 711359177, 710438080, 712249451, 713692780, 715291824, 711638565, 712211685, 717387466, 713050003, 707828979, 710899353, 715129166, 718484573]
3869.1G18484573p899627o376801L925476N308304K731247p616272Q32138L166962
3876.8G12556000j02692J919479L906174l664398p241516L532333J296005J399766
3884.5G13601151L943328r435196L72849L371048R31320K940674k76489o745758O31256
3893.2G09334183L550644q27713O97250Q30231J168441J212082o975479L297272J253815
3901.8G13540726m083252L369980k331086j242218J129151L10211R55353P17544N55268
3910.5G12921677l68500n5924l738o65588J0604J226349j987075j892472L309479J3504
3920.2G12508316k520294J328583J123581O78176k217254k016602K825546J330185
3927.9G13040237k93731N340m75845M28772j553650j112061R22699P1106M38080Q39691
$$ y = [718484573, 710584946, 704208145, 708133621, 713441925, 716173172, 708556900, 709389038, 712556000, 712453308, 714372787, 718278961, 714614563, 707373047, 710905380, 712201385, 713601151, 717544479, 708109283, 708482132, 711853180, 712784500, 715725174, 715448685, 708702927, 709334183, 712884827, 712057114, 712754364, 713584595, 714753036, 715965118, 708989639, 712286911, 713540726, 709457474, 712827454, 710496368, 709254150, 710383301, 710693512, 711648865, 712366409, 712921677, 712553177, 712497253, 712493515, 711827927, 711838531, 713064880, 711077805, 709185333, 712494812, 712508316, 709988022, 711316605, 712440186, 713118362, 710901108, 708884506, 711710052, 713040237, 712746506, 712751846, 712276001, 712704773, 711151123, 710039062, 710961761, 711032867, 711470947, 712310638]
3937.5G12310638k9831n85556n34515O71768N51529l344574o53076J921768M54941
3946.2G10763092M02603r41009J132431N53970j763535J380845j70823q08868K53296
3954.9G10802002J1673P4539q4228P13272n36423j85852P2632o62079l510J15357O05240
3965.5G10922623k00730L4333J79290l90319Q11538O39496r31549n84030L37601k46354
3975.1G10571899K61383m32815n69534N61752L44467K44064l05328k02942q19321j52206
3984.8G09501419L44696n21469Q14362Q20999N52063n54657p18766N18265O63071M27627
3994.4G11847610j766738q21839O63986O73981M52728l89785
4000.2G10659943
$$ y = [712310638, 712280807, 711695251, 711160736, 711832504, 712384033, 709039459, 708386383, 710308151, 710763092, 711165695, 710224686, 711357117, 711911087, 710147552, 711528397, 711357574, 710548706, 710802002, 710813675, 710888214, 710803986, 711517258, 710980835, 710794983, 710867615, 710205536, 710202026, 710317383, 710922623, 710721893, 710756226, 710935516, 710545197, 711356735, 711996231, 711064682, 710480652, 710818253, 710571899, 710833282, 710400467, 709830933, 710392685, 710737152, 710981216, 710675888, 710472946, 709653625, 709501419, 709846115, 709324646, 710139008, 710960007, 711512070, 710957413, 710238647, 710756912, 711419983, 711847610, 710080872, 709259033, 709923019, 710597000, 711049728, 710659943]
##END=$$ End of the data block
