##TITLE=$$ Begin of the data block
##JCAMP-DX=5.00 $$ ACD/SpecManager v 10.08
##SPECTROMETER/DATA SYSTEM=Varian
##DATE=15 Jan 2013 15:17:44
##DATA TYPE=INFRARED SPECTRUM
##DATA CLASS=XYDATA
##ORIGIN=
##OWNER=
##NPOINTS=3735
##FIRSTX=399.26403809
##LASTX=4000.35498047
##MAXX=4000.35498047
##MINX=399.26403809
##MAXY=74.58172607
##MINY=32.88558578
##XFACTOR=1.0000000000
##YFACTOR=0.000000100000000
##FIRSTY=50.24261856
##DELTAX=0.96440572
##XUNITS=1/CM
##YUNITS=TRANSMITTANCE
##XYDATA=(X++(Y..Y))
399.3E02426186j055642m731025J0816231P926330K794342k439041m198151k925987
407E08613243L44429M329796k306824q376465o367836J217461K045670O946029R326210
415.7E15771713j69830K804413k19116k0272980L211098M960174p403335m067002J4730263
424.3E09345398P417831j955261k597847m223709q95958J415634n95894j583023J813584
433E08140755N24482l48472J510811l050232l647690K409439M763451Q07075p37762
441.7E10371857j826821N52330M096032J129875m681626o957016J901131L877564j021462
450.4E07441864l331146j305619j3961j282234L480644L349189l52020k537880j505470
459.1E03943367j699982m081306J080093Q64563N78881K232627M0589J395798J678543
$$ plain form
399.3 502426186 501370544 496639519 507455750 515382080 518176422 515737381 511539230 508613243
407 508613243 508957672 513287468 510980644 502604179 496236343 497453804 499499474 506445503 515771713
415.7 515771713 515601883 518406296 518187180 497914200 501125298 506085472 498682137 494615135 509345398
424.3 509345398 516763229 514807968 512210121 507986412 507090454 508506088 507910194 506327171 508140755
433 508140755 508665237 508316765 509827576 506777344 503129654 505539093 510302544 511109619 510371857
441.7 510371857 508545036 509097366 513193398 514323273 509641647 502684631 504585762 508463326 507441864
450.4 507441864 504110718 502805099 502791138 501508904 504989548 508338737 507986717 505448837 503943367
459.1 503943367 502243385 498162079 499242172 500106735 500685616 502918243 502958832 504354630 506033173
467.7E06033173N69038m865303o019173m028816j200104M129601J683311M599037M005700
476.4E04906464m83895j851043l073922l642578l433838O15731O76841J324044J213379
485.1D96251183k47841L796196J855125j140785k258606j466408j090164k040329j805611
493.8D91852760j157608N536080L146171k906913J537475P88994j855850m776917n200004
502.5D86964188L401680J091957M0435L943444L685798R59893j170197l129997m932137
511.1D90855064l059539O57119L25241J679345K276916l05786p73582j75248j796302
519.8D89683228j925736m90532j983795k16026J781311k33307m7341O5613J284523
528.5D87917938J684494o07986j327782k976189k255172L01170P53479J092682J607895
$$ plain form
467.7 506033173 506602211 501736908 495717735 491688919 490488815 494618416 496301727 500900764 504906464
476.4 504906464 504422569 502571526 499497604 495855026 492421188 493036919 493713760 495037804 496251183
485.1 496251183 496003342 499799538 501654663 500513878 498255272 496788864 495698700 493658371 491852760
493.8 491852760 490695152 496231232 499377403 496470490 498007965 498796959 496941109 492164192 486964188
502.5 486964188 490365868 491457825 491498260 495441704 499127502 500087395 498917198 495787201 490855064
511.1 490855064 487795525 488452644 488777885 490457230 492734146 492428360 491654778 491479530 489683228
519.8 489683228 487757492 487266960 485283165 485067139 486848450 486615143 486567802 486633415 487917938
528.5 487917938 489602432 488994446 487666664 484690475 482435303 482736473 483489952 484582634 486190529
537.2D86190529K269554J231956m74700k647477l207740j499863k148171l36227K469330
545.9D81847191O45637J237297K439003P63665k127266k940750j139145j163101k65656
554.5D79296875R82361m26712j14937M28352q6631K46162k33803j032066k164154k160225
564.2D74735222n70946j7280J770095K107964J633758K173005j342659k544632j932984
572.9D76011543j918258O20422M8408L4066J387558K66418Q53081N22690j667137j577759
582.5D74581032j425133j020470L85514O24695J030731J973266K759934K072487m0856
591.2D80941200j012497j189918q31986j012687p51572J506996K321129J452675J279411
599.9D82702751K067833P15370k267723l274498l010788k294349o02074J527824J855469
$$ plain form
537.2 486190529 488460083 489692039 489217339 486569862 483362122 481862259 479714088 479377861 481847191
545.9 481847191 482492828 483730125 486169128 486932793 484805527 481864777 480725632 479562531 479296875
554.5 479296875 480279236 479852524 479737587 480165939 480079308 480325470 480091667 479059601 476895447 474735222
564.2 474735222 474164276 474146996 475917091 478025055 479658813 481831818 480489159 477944527 476011543
572.9 476011543 474093285 474713707 474762115 474796181 476183739 476450157 477303238 477825928 476158791 474581032
582.5 474581032 473155899 472135429 472520943 473145638 474176369 476149635 478909569 480982056 480941200
591.2 480941200 479928703 478738785 477906799 476894112 476142540 477649536 479970665 481423340 482702751
599.9 482702751 484770584 485485954 483218231 479943733 476932945 474638596 474036522 475564346 477419815
608.5D77419815J682243J434937j469574j993141p22084j491738j014251K09884M83857
617.2D74539948R19837K019768J703263l39394o99654N67208L19557r69582j071281
625.9D76989670P64046K514305K076110J570130K139091J696320N14717r3651r90753
634.6D87179985j250687P82242K142563J603928J542854K689781K163162L52784l26729
643.3D96879883m11453m31519r37157p44438J862374L541679K572746J530686Q29506
651.9E04692307M46510k18697k414589l213119j643982R46579K633743J562424N98945
660.6E03390121J222268O61354k86789j081276j719170o22787j774254l810768M820404
669.3E00799103K821884K114105J798439O7406j062622n13878j8311j02462m71497
$$ plain form
608.5 477419815 479102058 480536995 479067421 477074280 476352196 474860458 473846207 474056091 474539948
617.2 474539948 475459785 477479553 479182816 478843422 478143768 478710976 479030533 478060951 476989670
625.9 476989670 477753716 480268021 482344131 483914261 486053352 487749672 488264389 488170738 487179985
634.6 487179985 485929298 486711540 488854103 490458031 492000885 494690666 496853828 497206612 496879883
643.3 496879883 496468430 496036911 495099754 494355316 496217690 499759369 502332115 503862801 504692307
651.9 504692307 505138817 504920120 502505531 499292412 497648430 498595009 501228752 502791176 503390121
660.6 503390121 504612389 505273743 504986954 503905678 502186508 501563721 499789467 495978699 500799103
669.3 500799103 503620987 505735092 507533531 507600937 506538315 506024437 506006126 505903664 505432167
678E05432167M4975J608429L080788L292160J831856J565437P27463j507340j841125
686.7E14234810j460991k06833J045609J505355J156426J614761K920952J365776m93660
695.3E21682205j899452j724510m52690m96025P69157J850548K371521J950111R23577
704E24974442O56013j0796l76129q72993m57802l20854J27067J970635K484398K165641
713.7E30339622J319352N35240o02913j356316r98420k43683J291733J869278J401062
722.3E33554955J239395R30710J62734K52038m56467j544571o34537L63426J265488
731E35133171J191635K655754L521805J172943K26326j145973j671715j844711j803703
739.7E37435532N88150J521682J578980K172470J981926J111641L27186j420860k379074
$$ plain form
678 505432167 505477142 507085571 510166359 513458519 515290375 516855812 517583275 516075935 514234810
686.7 514234810 512773819 512566986 513612595 515117950 516274376 517889137 520810089 522175865 521682205
695.3 521682205 519782753 518058243 517605553 517109528 517878685 519729233 522100754 524050865 524974442
704 524974442 525630455 525619659 525243530 524370537 523912735 523591881 523718948 525689583 528173981 530339622
713.7 530339622 531658974 532194214 531591301 530234985 529236565 528992882 530284615 532153893 533554955
722.3 533554955 534794350 535725060 535887794 536139832 535683365 534138794 533504257 533867683 535133171
731 535133171 536324806 538980560 542502365 543675308 543901634 542755661 541083946 539239235 537435532
739.7 537435532 538023682 539545364 541124344 543296814 545278740 546390381 546717567 545296707 542917633
748.4E42917633j388397k02789M99496Q06770L101921L388100J978912J444741p28913
757.1E51817474j511383j120338q24814j128502N36194K777672K719650L627014K322960
765.7E59215927J5373j021728j455536j069946j100922o44226J7395N99785R00841
774.4E55456963J958808J703721M89578K01530j756286j640625k94037o05736l61938
783.1E55151978L49884J451301K812233K339592P69386j02081j761894k138024p56988
791.8E58115387L66554j07231K98882J795768N81856Q30498J8921k181092k446098
800.5E57273445k459755j705284k152824j124459L14331O21872J27297q37403j302528
809.1E48754692k448883j607094k123451k481346j223488q20732j3390M6234O60439
$$ plain form
748.4 542917633 541529236 541326447 541825943 542632713 545734634 549122734 551101646 552546387 551817474
757.1 551817474 550306091 549185753 548360939 547232437 547768631 550546303 553265953 556892967 559215927
765.7 559215927 559231300 558209572 556754036 555684090 554583168 553938942 553956337 554556122 555456963
774.4 555456963 557415771 559119492 559609070 559810600 558054314 556413689 556119652 555513916 555151978
783.1 555151978 555501862 556953163 559765396 562104988 562874374 562772293 561010399 558872375 558115387
791.8 558115387 558481941 558374710 558673592 560469360 561051216 561881714 561900635 559719543 557273445
800.5 557273445 554813690 553108406 550955582 549831123 550145454 550767326 550894623 550057220 548754692
809.1 548754692 546305809 544698715 542575264 540093918 538870430 538049698 538036308 538082542 538742981
817.8E38742981k38190j376343j040115j01852N37071l16429J308441K318687K019310
826.5E41853561K559586L029480K603035J039619J034851M74205J267052K327538K942543
835.2E59131470M118728L025208K558517J790696J824378J612893P44323O25306j38474
843.9E75293045P08809K636757L710594K009277J978569J569825J98898J247330n31693
852.5E88821411r05685O83822J759682J870194K719230L550987J201859N26771P59354
861.2F00987625J040459m42772j014519k93083n06821Q30384R21478J943512J290359
869.9F04756622l00827j497955k552338j451721k210998j575814l60069J242371J648979
878.6E97698250R918k72293q21419k84729j189575j508827j434784j239090M57611
$$ plain form
817.8 538742981 538504791 537128448 536088333 535986481 536523552 536207123 537515564 539834251 541853561
826.5 541853561 544413147 547442627 550045662 551085281 552120132 552594337 553861389 556188927 559131470
835.2 559131470 563250198 566275406 568833923 570624619 572448997 574061890 574806213 575431519 575293045
843.9 575293045 576001854 578638611 582349205 584358482 586337051 587906876 588105774 589353104 588821411
852.5 588821411 587915726 588599548 590359230 592229424 594948654 598499641 599701500 600228271 600987625
861.2 600987625 602028084 601585312 600570793 600277710 599770889 600601273 601522751 603466263 604756622
869.9 604756622 604455795 602957840 600405502 598953781 596742783 595166969 594806900 596049271 597698250
878.6 597698250 597708168 597435875 596614456 596329727 595140152 593631325 592196541 590957451 591415062
887.3E91415062L44162Q09784P49092J11809m54102r67216j505890n44815P33108q01201
896.9E89889793k53410K44675O03943N69152o16836m78897q02384K29111K05345M36669
906.5E90027161J648597J674576J281243O38542O84852k83050k9183p76901j565895
915.2E93299942j295738k069168j042366j115685j724396j924400j326713j383553
922.9E81417923k810631l100052l145637k129402k397309k802810j827393o26183r8075
931.6E62480431p77741r89647j942215j619644p26814o54297r32159q02651M06075
940.3E54441338o42815o86226k31705j074905j395531j643104j068383j211280r73015
949E45514374o86035l62587j0796j82342M81796j147309k337150j708069j698570j358834
$$ plain form
887.3 591415062 591759224 592569008 593318100 593429909 592975807 592008591 590502701 589957886 590690994 589889793
896.9 589889793 589636383 589881058 590485001 591054153 590437317 589958420 589156036 589385147 589590492 590027161
906.5 590027161 591675758 593350334 594631577 595270119 595954971 595671921 595642738 594865837 593299942
915.2 593299942 592004204 589935036 588892670 587776985 586052589 584128189 582801476 581417923
922.9 581417923 578607292 575507240 572361603 570232201 567834892 565032082 563204689 562578506 562480431
931.6 562480431 561702690 560713043 558770828 557151184 556424370 555770073 554837914 554035263 554441338
940.3 554441338 553798523 553112297 552880592 551805687 550410156 548767052 547698669 546487389 545514374
949 545514374 544828339 544465752 544454956 544272614 544754410 543607101 541269951 539561882 537863312 536504478
958.6E36504478j474037j326866j255302j701050j417694j029473p90061j127778j959495
967.3E24422722k374153k462387j724816j413040j832428j311760j674309k853241
975E08776588k361106j530648k875404l580704k463608k687454l636856m008827l383713
983.7D82248268l422661l993225l276748k958870l889656l767090k882920l693962
991.4D54363136l241539k847290l616142l336029l187790k918015k615737k099953
999.1D30500641k595062k012101j170501k069664j690674j509400j440849j671066
1006.8D16341324j761170p14683k40440p48177q31909p50122j745072j572799j896096
1015.5D06080856k518577k389756k344779j829644k199669k031822j724205r05685
$$ plain form
958.6 536504478 535030441 533703575 532448273 530747223 529329529 528300056 527509995 526382217 524422722
967.3 524422722 522048569 519586182 517861366 516448326 514615898 513304138 511629829 508776588
975 508776588 506415482 504884834 502009430 498428726 495965118 493277664 489640808 485631981 482248268
983.7 482248268 478825607 474832382 471555634 468596764 464707108 460940018 458057098 454363136
991.4 454363136 451121597 448274307 444658165 441322136 438134346 435216331 432600594 430500641
999.1 430500641 427905579 425893478 424722977 422653313 420962639 419453239 418012390 416341324
1006.8 416341324 414580154 413865471 413625031 412876854 412044945 411294823 409549751 407976952 406080856
1015.5 406080856 403562279 401172523 398827744 396998100 394798431 392766609 391042404 390136719
1023.2C90136719q62580j492118j704102k093468p85904j282158j978569j520767j063347
1031.9C77353706r15908l91427J337281J70173m00467Q0872N32837J133957Q93211
1040.6C79794235R48410J071892J021271q2932N58243J65596m09584L1052r10416k84576
1050.2C81903191o26183j47362j51977o60973K34757P7934k66686p73544P07474M65355
1059.9C80761986R33685K163048J426353K375336K303085K274437J560517J287956
1067.6C95086403J640320J715240J958122J135254J036835O76346J545944J319656
1075.3D06114120Q8349L33328N51682J115875J113739N95856p92008J155243K325363
1084D12601547L06435O85196J218490J968117L91464m07829J019898J104507J478271
$$ plain form
1023.2 390136719 389274139 387782021 386077919 383984451 383198547 381916389 379937820 378417053 377353706
1031.9 377353706 376437798 376046371 377383652 377553825 377153358 377234230 377767067 378901024 379794235
1040.6 379794235 380742645 381814537 382835808 382752876 383311119 383476715 383067131 383098183 382187767 381903191
1050.2 381903191 381277008 381129646 380977669 380316696 380551453 380629387 380362701 379589157 380296631 380761986
1059.9 380761986 381695671 383858719 385285072 387660408 389963493 392237930 393798447 395086403
1067.6 395086403 396726723 398441963 400400085 401535339 402572174 403248520 404794464 406114120
1075.3 406114120 406202469 406535797 407087479 408203354 409317093 409912949 409120941 410276184 412601547
1084 412601547 412907982 413593178 414811668 416779785 417171249 416763420 417783318 418887825 420366096
1092.7D20366096J494332J753120J001625Q09632J211967R03168O23016L21694R57145
1101.4D29441795P04651J013603J322594R18236J338882J667328Q40492k87551L94783
1110D37354813L07541L81011J117821O93360L86123L81127R09080J090546J209869
1118.7D43831291m9057j113243p04307o88439L01285O03638P39860Q67691Q43964J174507
1128.4D45807190J255836J820870J264915Q50296N31083L64799J713867K523728J762352
1137D57894936Q05549J681938K180939J081810P97501J025123K80190J31950O71311
1145.7D66551247Q201K41699R35555L35884L42522N94864l1319o10733k75879m28123
1155.4D67663918j120949r08852o10237m44794l29933m46968q48579l98674K38609
$$ plain form
1092.7 420366096 421860428 423613548 424615173 425424805 426636772 427539940 428162956 428484650 429441795
1101.4 429441795 430146446 431160049 432482643 433400879 434739761 436407089 437247581 436960030 437354813
1110 437354813 437662354 438043365 439161186 439854546 440240669 440621796 441530876 442621422 443831291
1118.7 443831291 443782234 442668991 441964684 441276245 441577530 442181168 442921028 443788719 444632683 445807190
1128.4 445807190 447063026 448883896 450148811 450999107 451530190 451894989 453608856 456132584 457894936
1137 457894936 458700485 460382423 462563362 463645172 464442673 465467796 465747986 465879936 466551247
1145.7 466551247 466559448 466801147 467736702 468072586 468415108 469009972 468978653 468367920 468092041 467663918
1155.4 467663918 466542969 465634117 465023880 464579086 464249153 463802185 462953606 462554932 462793541
1164D62793541K24304R49593J216354J223984J387176J739312K363014J674728J188355
1172.7D74760361J868477J929626K363472K814331K376366K013817J692543J515808
1180.4D91334801J633758K460099J905517O42510R74998J213265Q20922R52416J530914
1189.1E03469200Q14133L78609K20718o69861p22694p71981r28382p90024p49665q89053
1198.8D99361000o44302j85318n34020j285438j200829j230507j433944q15011r30175
1207.4D91101456n28755L00216J07269R8382j62812m61044j63269Q6441l70293n53360
1217.1D89454231j51100p5951N25895O72149K06032o1684r5977M00962j09214o01692
1226.7D90163651n50423j093140q86230j31188m5280k31018m84352n54428k78435l93448
$$ plain form
1164 462793541 463017845 463967438 465183792 466407776 467794952 469534264 471897278 473572006 474760361
1172.7 474760361 476628838 478558464 480921936 483736267 486112633 488126450 489818993 491334801
1180.4 491334801 492968559 495428658 497334175 497976685 498951683 500164948 500985870 501938286 503469200
1189.1 503469200 504283333 504661942 504882660 504212799 503490105 502718124 501789742 500999718 500250053 499361000
1198.8 499361000 498716698 498531380 497997360 496711922 495511093 494280586 492846642 492031631 491101456
1207.4 491101456 490572701 490872917 490980186 491078568 490915756 490454712 490291443 490377884 490007591 489454231
1217.1 489454231 489303131 489227180 489753075 490425224 490631256 490569572 490473595 490874557 490765343 490163651
1226.7 490163651 489613228 488520088 487633858 487502670 487457390 487226372 486742020 486187592 485909157 485515709
1236.4D85515709p67822m04663k16980q28286k16598K01721n03921k74849j95198l27111
1246D81982002m33311n92079o71502p87544j9340P7476m04663k62413m005j30997p41081
1256.6D78012543n42031N3368N2071l22762j49422M77143M83780M63447L01438J21116
1266.3D78950691M87137N69229O91605P93075O73066N71403P00874J095772R77631
1274.9D85510483R32312O77795J26534J77574P69997J133613P87583Q83255J192169
1283.6D92191315J349487J378746J199989J068383R03205P60232L83987P67517R55391
1292.3E00958252P71942Q74481N86052O24161P26395N36003L30963L57857J1634k1972
1301.9E05755768J90887K36016O49986L80707N7830m46090m62685k52914n63202l86009
$$ plain form
1236.4 485515709 484747887 484343224 484126244 483297958 483081360 483283081 482779160 482504311 482309113 481982002
1246 481982002 481548691 480956612 480285110 479497566 479478226 479555702 479151039 478888626 478884621 478753624 478012543
1256.6 478012543 477470512 477523880 477575951 477253189 477103767 477580910 478064690 478528137 478829575 478950691
1266.3 478950691 479437828 480007057 480698662 481491737 482164803 482736206 483437080 484532852 485510483
1274.9 485510483 486442795 487120590 487247124 487424698 488194695 489328308 490115891 490999146 492191315
1283.6 492191315 493540802 494919548 496119537 497187920 498091125 498851357 499235344 500002861 500958252
1292.3 500958252 501730194 502604675 503190727 503814888 504541283 505077286 505408249 505766106 505777740 505755768
1301.9 505755768 505946655 506182671 506832657 507213364 507271194 506825104 506362419 506109505 505546303 505160294
1311.6E05160294k74849k25029o44226l22266n798j0300M61502L97949N73387N87044
1321.2E05697708Q95958N23071Q7586M85802J77536K48489p4501k8000J29700j90621
1330.9E07952728k35367m04205k93159m13933n30090j006241p20826j24473k63138
1339.6E03961296P25O73561J026154L93219L31268J51558o1684J76773j15547j06926
1349.2E06430397q21114j7242L13492m93927l51029m27932R2659k93961m49409l47634
1358.8E03634300m09126m48341o72112k59399o14395L55262L68920l87955p20139p69119
1368.5E00077896j07155m76150m44260m31747o57082q14323R9792P42188k0104j7586
1378.1D97951469o00662n12886n24559j079254j124344j175995p07016j026268j226272
$$ plain form
1311.6 505160294 504885445 504660416 504016190 503693924 503688126 503677826 504139328 504537277 505110664 505697708
1321.2 505697708 506593666 507116737 507204323 507690125 507867661 508116150 508041649 508013649 508143349 507952728
1330.9 507952728 507717361 507313156 507019997 506606064 506075974 505069733 504348907 504224434 503961296
1339.6 503961296 503962021 504635582 505661736 506054955 506386223 506537781 506476097 506652870 506537323 506430397
1349.2 506430397 505609283 505592041 505905533 505411606 505060577 504632645 504725304 504431343 503981934 503634300
1358.8 503634300 503225174 502776833 502104721 501845322 501230927 501586189 501955109 501567154 500847015 500077896
1368.5 500077896 499970741 499494591 499050331 498618584 497961502 497147179 497246971 497989159 497969055 497951469
1378.1 497951469 497350807 496837921 496313362 495234108 494109764 492933769 492226753 491200485 489974213
1386.8D89974213j289788m32319q61817j558494r73931j409378j136627k353287k589798
1395.5D77368774o52961j436882j327057j985436j483612r03625j345711j178131j265869
1404.2D65789490j537133j092224r62448j255913j008071p43447p74498o98051o26030
1412.8D57091675l42255n31998n21545m22211r47914m62074j055183O08177J124496
1421.5D54541168R384j22032q2664J078605J138916L41187N87768P9842K79923P93380
1431.2D58645477P52220O75087P23420R43908L71361K02942J528969K366638J724853
1439.8D67934875P46232L64074J04256Q84056O77452N90782M81110Q00857J278382
1448.5D73862076J098976J138420M06227M74587K1324L91960P90863N07278M44375
$$ plain form
1386.8 489974213 488684425 488252106 487390289 485831795 484857864 483448486 482311859 479958572 477368774
1395.5 477368774 476715813 475278931 473951874 471966438 470482826 469579201 468233490 467055359 465789490
1404.2 465789490 464252357 463160133 462197685 460941772 459933701 459190254 458415756 457717705 457091675
1412.8 457091675 456749420 456217422 455695877 455273666 454325752 453863678 452808495 453416672 454541168
1421.5 454541168 454550552 454428520 454345856 455424461 456563377 456904564 457492332 457572174 457852097 458645477
1431.2 458645477 459397697 460072784 460796204 461740112 462111473 462314415 463843384 466210022 467934875
1439.8 467934875 468681107 469045181 469149437 470033493 470710945 471301727 471782837 472583694 473862076
1448.5 473862076 474961052 476099472 476505699 476980286 477001610 477393570 478184433 478691711 479136086
1457.2D79136086N21469K949295J715316J503220J056519J180687J519203K66914J485443
1465.9D91334152J373902K071113J915093J743850K235031J159859J451111K635460
1473.6E05919571L244896K284889J572151K022896K014885J927223J639252J711311
1481.3E22337074J721192J427879J381760J389274P90940q7967J25160M10461q54530
1490E28641243R64775J490402N46990o96068j156502q95462l987045n0965q93554j920662
1499.6E22043152M959r35898j65214m67415l30544j482963p944870l14408L119545
1508.3E13526344K084580K62680O64100k75192q73375k73857j103248j073990k445679
1517E10492363M95720J287346K57072j497726r90181J887741J038780J054726q81195
$$ plain form
1457.2 479136086 479657555 482606850 484322166 485825386 486881905 488062592 489581795 489848709 491334152
1465.9 491334152 492708054 494779167 496694260 498438110 500673141 501833000 503284111 505919571
1473.6 505919571 509164467 511449356 513021507 515044403 517059288 518986511 520625763 522337074
1481.3 522337074 524058266 525486145 526867905 528257179 529048119 528960152 529085312 529495773 528641243
1490 528641243 529606018 531096420 531643410 530947342 529790840 528895378 524908333 524857368 523963814 522043152
1499.6 522043152 522048111 521112213 520946999 520479584 520149040 518666077 510721207 510406799 513526344
1508.3 513526344 515610924 515873604 516537704 516262512 515389137 515115280 514012032 512938042 510492363
1517 510492363 510988083 512275429 512532501 511034775 510044594 511932335 512971115 514025841 513144646
1525.7E13144646K9792J500969J429329P86667O79131R01870N01366K18926j106835
1534.3E18085861R82628M50363n2566K77672l548584n04151O87561J165161J384125
1543E18928070J675911L31345r24034J538162j73531j23520o94046K1172J100807l54004
1552.7E21326332J183k525444M90265N40313r13963n210304j0487061N892792J047821
1561.4E10161934J249618j140937j571999k964897k600212j073265k998162k286796
1569.1D96775284p249336q27179j381607k954102k171593k771225j613617j1287040
1576.8D66519585o04668j958733l462791l148995m062881k376060m183884k319794
1584.5D44401779l909149l298874l003311l992691k620545m589347k146454l933296
$$ plain form
1525.7 513144646 513174438 514675407 516104736 516891403 517570534 518472404 518973770 519192696 518085861
1534.3 518085861 519068489 519518852 519466286 519743958 516195374 515691223 516378784 517543945 518928070
1543 518928070 520603981 520935326 520011292 521549454 521375923 521252403 520558357 520579529 521680336 521326332
1552.7 521326332 521327515 518802071 519292336 519832649 518918686 513708382 503221321 509114113 510161934
1561.4 510161934 511411552 510270615 508698616 505733719 503133507 502060242 499062080 496775284
1569.1 496775284 489525948 488698769 487317162 484363060 482191467 479420242 477806625 466519585
1576.8 466519585 465914917 463956184 460493393 457344398 453281517 450905457 446721573 444401779
1584.5 444401779 440492630 437193756 434190445 430197754 427577209 422987862 420841408 416908112
1592.2D16908112k436257k595787l176842j635971l533020j468849l275566j826897
1599.9C96958923l242187k253494j021462k910881j88522k278824m24042k468185j567154
1608.6C80604172r94759k547035k10991k245140J4877j600494J52817l05558l245773
1617.3C69622116J817131j414833O03104j422043O21033k56196o84585K096100K5482
1626C71007309J758614j211319J448135O7787k03018Q40797N79377K777710m9401K850914
1635.6C79866905R11904K748413J876220J633721K422104K37999J950569K63977K048836
1644.3C93960648Q78334j741600K910270Q88100M385719J247788K178573J035271l454056
1653D02289047J62964L325386M461861R95903K389641J604728K006226J852646J476593
$$ plain form
1592.2 416908112 414471855 411876068 408699226 407063255 403530235 402061386 398785820 396958923
1599.9 396958923 393716736 391463242 390441780 387530899 387342377 385063553 384639511 382171326 380604172
1608.6 380604172 379609413 377062378 376851387 374606247 374621124 373020630 373173447 372867889 369622116
1617.3 369622116 371439247 370024414 370627518 369205475 369826508 369570312 368885727 370981827 371007309
1626 371007309 372765923 371554604 373002739 373070526 372867508 373708305 374287682 377065392 377015991 379866905
1635.6 379866905 380778809 383527222 385403442 387037163 389459267 389697266 391647835 391911812 393960648
1644.3 393960648 394838982 393097382 396007652 396895752 401281471 402529259 404707832 405743103 402289047
1653 402289047 402452011 405777397 410239258 411235161 413624802 415229530 417235756 419088402 420564995
1661.6D20564995K374458J11504L219413J700631K358207K603455K180176K873573
1669.4D37986412J764488M307137J877022L134498K696152K267036K666626L201294
1677.1D59900665M557381K533646L249473L035927M141350L626518k31476M523392
1684.8D85336876K944374N131264L442192L698654M325600M070816M362411L512917
1692.5E16825104L749389L045311K595597J600609N305061M721413L767814L989487
1700.2E45599785K002907N530204M201165L294372K257118K169800K201081L169136
1707.9E70425568M009590L048820K677727K411842K341690J806488Q4191R76028K342186
1716.6E90124130Q02002p97424M836044L735771K310791J632080J069680Q70437J262741
$$ plain form
1661.6 420564995 422939453 423050957 426270370 427971001 430329208 432932663 435112839 437986412
1669.4 437986412 439750900 444058037 445935059 449069557 451765709 454032745 456699371 459900665
1677.1 459900665 464458046 466991692 470241165 473277092 477418442 481044960 480813484 485336876
1684.8 485336876 488281250 493412514 496854706 500553360 504878960 508949776 513312187 516825104
1692.5 516825104 520574493 523619804 526215401 527816010 533121071 537842484 541610298 545599785
1700.2 545599785 547602692 553132896 557334061 560628433 562885551 565055351 567256432 570425568
1707.9 570425568 574435158 577483978 580161705 582573547 584915237 586721725 586805916 587781944 590124130
1716.6 590124130 590926132 590128708 594964752 598700523 601011314 602643394 603713074 604583511 605846252
1725.3F05846252J261139Q93555J612930J754456N52330J672707L423690L028374j773643
1734F18271790j899224L523255K907867J403732K108956J467895L77617L755531K826806
1742.7F34744225J148223J420746K062035J773910J207581J613464J964035M147797
1750.4F50082016K762070K614364M278946K733917K266541J760712j22376J269684
1758.1F67645874K368088K347336K560806J012421K022933L149033J372681J089935
1765.8F83569107J044312M06799j236191K017593L040619l72696j042480J248322M043960
1774.5F92719345K211075K21252J261368j77536O36444K8153K77557J891098J909561
1783.2G00978317J930542P06101P38983P65457K55203o54983j1521j4953P00073Q71811
$$ plain form
1725.3 605846252 607107391 608000946 609613876 611368332 611920662 613593369 617017059 620045433 618271790
1734 618271790 616372566 619895821 622803688 624207420 626316376 627784271 628161888 631917419 634744225
1742.7 634744225 635892448 637313194 639375229 641149139 642356720 643970184 645934219 650082016
1750.4 650082016 652844086 655458450 659737396 662471313 664737854 666498566 666376190 667645874
1758.1 667645874 670013962 672361298 674922104 675934525 677957458 681106491 682479172 683569107
1765.8 683569107 684613419 685020218 683784027 685801620 688842239 688469543 687427063 688675385 692719345
1774.5 692719345 694930420 695151672 696413040 696235504 696871948 696900101 697177658 699068756 700978317
1783.2 700978317 702908859 703614960 704353943 705119400 705374603 704719620 704708099 704693146 705393219 706265030
1792.8G06265030M41666L136978J071243M6234J001358J69907q09174j166382J235810
1801.5G11392670K92892J453400K279510J538086J348725K08892k22168m16564l50800
1810.2G17524643j279297P75528J400757O67496J937027J551895J180191j34354o027
1818.8G23617859k43378q25958K42615n87769R76868J105499m06189J172485K115250
1827.5G27167282J395950j309814k879486L58353J511535n6228N49621J271668J077957
1836.2G29086838J135101K00958J156922k87018m43268n41763j82648J19705l110275
1844.9G27134552K694016K333221J079788P46842J65252J84021r89456l69491m88511
1853.6G32490234L22647O31409Q70209J155014J50146P22733J53732K75116p96585
$$ plain form
1792.8 706265030 706706696 709843674 710914917 710961151 711962509 712132416 711323242 710156860 711392670
1801.5 711392670 711685562 713138962 715418472 716956558 718305283 718514175 718292007 717875443 717524643
1810.2 717524643 716245346 717020874 718421631 719089127 721026154 722578049 723758240 723623886 723617859
1818.8 723617859 723374481 722548523 722791138 722203369 723180237 724285736 723879547 725052032 727167282
1827.5 727167282 728563232 727253418 724373932 724732285 726243820 726187592 726737213 728008881 729086838
1836.2 729086838 730221939 730422897 731579819 731292801 730849533 730307770 730125122 730244827 727134552
1844.9 727134552 729828568 732161789 733241577 733988419 734153671 734337692 733348236 732978745 732490234
1853.6 732490234 732812881 733444290 734314499 735469513 735619659 736342392 736496124 736771240 735974655
1862.2G35974655q13141l2272j54572J029282J49155Q50296P4463o79017P41196M25644
1871.9G37565689J65100o21872N3940J20239O96183Q86230P27615O78254j71738K28348
1881.5G40327988n26047m2572n23987q04291N29709M51050J091766K28501J67694Q29696
1891.2G41729507K82517o86188q65631n03845l99094R96628N66177P02897P89108K90985
1900.8G42903061R7351p10220q3695m76150l62168L1433N71366P71637L65753O29654
1910.4G43738022l95889L72390R3918k98920n00412o49566M31976r53674N34363J451645
1920.1G43823853Q68377K57797q64639k46506l2806m76227r22851M39834Q28858L93371
1929.7G44069061N89066M24805O49871k77328n19333r46960m62494m9591l07236N32379
$$ plain form
1862.2 735974655 735161514 735129242 734974670 736003952 736153107 737003403 737077866 736398849 737140045 737565689
1871.9 737565689 737730789 737108917 737162857 737283096 737979279 738865509 739593124 740271378 740099640 740327988
1881.5 740327988 739801941 739759369 739235382 738431091 738960800 739411850 740503616 740732117 740899811 741729507
1891.2 741729507 742012024 741325836 740460205 739956360 739557266 740553894 741120071 741822968 742612076 742903061
1900.8 742903061 743000412 742290192 742206497 741730347 741368179 741399612 741970978 742742615 743108368 743738022
1910.4 743738022 743342133 743714523 743808441 743509521 743009109 742359543 742791519 741837845 742372208 743823853
1920.1 743823853 744692230 744950027 744085388 743838882 743806076 743329849 742406998 742846832 743675690 744069061
1929.7 744069061 744658127 745082932 745732803 745455475 744936142 743989182 743526688 743477097 743169861 743702240
1939.4G43702240M68140J363906K82975r57489J79977l23105n52063n00488k60925
1948.1G43403168n55039K48413N84870P27463J027755R9793r0332q48618n84640o79627
1957.7G43333206l05404M11453p6752O59103M35029L07617r537k71530o01120r48410
1967.3G42933655k14691k18125L96881K47574O74515P23801K20642K20566p13120l90015
1977G43881683l85513l90320n95627k44445M48837K40021Q93325M79050q7433n10330
1986.6G43729248l58734o56204o64292L24707l96118j06430M85687R30024N53817j84173
1996.3G43657532l27683p99789k13547o34613k38342R6359N8517L33329R0027N03692
2005.9G42525482k06070n4626n27115q81043l60031l97110M64554R1324J12457J92261
$$ plain form
1939.4 743702240 744170380 745534286 745817261 744859772 745039749 744716644 744164581 743664093 743403168
1948.1 743403168 742848129 743096542 743681412 744408875 745436630 745536423 745446091 744597473 744012833 743333206
1957.7 743333206 743027802 743439255 743362503 744021606 744456635 744764252 744754715 744483185 743882065 742933655
1967.3 742933655 742718964 742500839 742897720 743145294 743819809 744543610 744764252 744984818 744271698 743881683
1977 743881683 743496170 743105850 742510223 742265778 742714615 742954636 743847961 744327011 744239578 743729248
1986.6 743729248 743370514 742714310 742050018 742374725 741978607 741872177 742357864 743287888 743841705 743657532
1996.3 743657532 743329849 742530060 742316513 741681900 741443558 741539917 741598434 741931763 742021790 742525482
2005.9 742525482 742319412 742264786 741737671 740856628 740496597 740099487 740564041 740655365 740767822 740960083
2015.6G40960083J48773k22931o59485k82821o43692k05841k46201K53906L66059P3623
2025.2G39541473N82962l509k96097o95267k99682m27094l98330P0648j02310N09262
2034.9G38482056J08261J48315j38092j86004k19346p46612k50244o53839k84653K8915
2044.5G36288757O03714M93470j90049L5553o76574j3733m5777m47006j09863j10092
2054.1G35828400K57263J70746K83127J51901K84118j23825n28946o29501q55560l41797
2063.8G34495926j67084N47257M59671M30069L00979k34680R9640l66364o49261o61392
2073.4G34254761j6098J12686J89438P41882L09677L15628j94473n46112p83234o40030
2083.1G33744125k02484o6528K30255l1509M46853K06147Q7356J76468m40292o75431
$$ plain form
2015.6 740960083 741108856 740885925 740226440 739943619 739299927 739094086 738847885 739101791 739467850 739541473
2025.2 739541473 740124435 740120926 739824829 739129562 738829880 738402786 738004456 738075104 737972794 738482056
2034.9 738482056 738590317 738738632 738600540 738414536 738195190 737448578 737198334 736544495 736259842 736288757
2044.5 736288757 736892471 737385941 737195892 737231445 736554871 736541138 736495361 736048355 735938492 735828400
2054.1 735828400 736085663 736256409 736539536 736691437 736975555 736851730 736322784 735693283 734837723 734495926
2063.8 734495926 734328842 734876099 735335770 735765839 736066818 735832138 735931778 735565414 734916153 734254761
2073.4 734254761 734238663 734351349 734540787 735282669 735592346 735907974 735713501 735167389 734384155 733744125
2083.1 733744125 733541641 733475113 733705368 733673859 734120712 734326859 734414215 734590683 734150391 733474960
2092.7G33474960p63473j62277j78070M20074L50265j02920M91638J10703j07956n06363
2102.4G33026581o18210p32956l10059K1973r8343M64096O1112L37295K02484o8893
2112G32285080l16696r19495l97034l04336L5400k212K64587M58145K32773j09558
2121.6G31226654q46939j10779P095l2043j83258k33536M1657l5248N49545k0675j60676
2132.3G30201797l3874n6000l54156o39572M83551M17404o9733j53808L99551J67160
2141.9G30362320k10571K30636l80707m79583n05982K45056M41132J65863L74985j48697
2151.5G30094452K38495K52228J75933n10559o77490j38321k69165L60108K95791M68445
2161.2G30289917K29645J96686Q0261o73142j32980l02658j62811n4398P6065M31824
$$ plain form
2092.7 733474960 732711487 732549210 732371140 732791214 733141479 733038559 733530197 733640900 733532944 733026581
2102.4 733026581 732408371 731675415 731365356 731387329 731288986 731753082 731814194 732151489 732353973 732285080
2112 732285080 731968384 731048889 730651855 730347519 730382919 730380707 730645294 731103439 731336212 731226654
2121.6 731226654 730379715 730268936 730276031 730243988 730060730 729827194 729868851 729833603 730383148 730362473 730201797
2132.3 730201797 730167923 730111923 729757767 729118195 729601746 730019150 729949417 729795609 730195160 730362320
2141.9 730362320 730151749 730382385 730001678 729522095 729016113 729261169 729702301 729868164 730243149 730094452
2151.5 730094452 730332947 730585175 730761108 730250549 729573059 729434738 729165573 729525681 729821472 730289917
2161.2 730289917 730519562 730716248 730796509 730123367 729990387 729687729 729524918 729470520 729546585 729978409
2170.8G29978409M77981N58777J4420k77863r12170k64664K25830j52893R4299j24588
2180.5G29617538L36991P48062Q61130K53219m10690l84216k76718l55149n45425J28784
2190.1G29973526K22015O92444N18646j6098J54648j67694J94779l55072l02887j86692
2199.8G30727615k36206L24021J29928O32477M26941M85153K9297r69620o76422k89078
2209.4G30584106l967j22299N31845O25382N21774L38669j69144j18332m22058J7014
2219G31782990o3172m7836j79215n4397N18570N1193M17099P6294r3308k76184n72281
2229.7G31559753k12020j89972L10287p4158Q6899M44336N23148K06527m62570j68457
2239.3G32023773l55682J449k46582r7351O40564L23334J23978n9433L60946j12991
$$ plain form
2170.8 729978409 730456390 731015167 731029587 730751724 729839554 729574890 729800720 729647827 729742126 729617538
2180.5 729617538 729954529 730702591 731563721 731816940 731406250 731022034 730745316 730390167 729844742 729973526
2190.1 729973526 730195541 730887985 731406631 731390533 731545181 731377487 731572266 731217194 730914307 730727615
2199.8 730727615 730491409 730815430 730945358 731577835 732004776 732489929 732519226 731549606 730873184 730584106
2209.4 730584106 730580139 730457840 730989685 731615067 732136841 732475510 732306366 732188034 731765976 731782990
2219 731782990 731719818 731671982 731492767 731438370 731956940 732008133 732425232 732501526 732408218 732132034 731559753
2229.7 731559753 731347733 731157761 731468048 731393890 731480789 731925125 732448273 732654800 732192230 732023773
2239.3 732023773 731668091 731669540 731422958 731325607 731966171 732289505 732413483 732354050 732714996 732602005
2248.9G32602005n92728o36673l15551J20620j30233J60675l6927L12348L70254M36783
2258.6G32290573K31171o57959k93503l46298K48337K71759j11847j06354J69372O94886
2268.2G32390137k13547l25546n79987j65253J63804k60087J10245r2849N05447K91138
2277.9G31823502l6545l75366n47715q1100p37000k71377j66474M2878O01806N07584
2287.5G30760193M46167P6599j64490o19888m51126o99234k81067M18091L77426L18756
2297.2G30181427j32141N61981P7057k14996k62833q53195k47956m53414k14386K28805
2306.8G28670349R42001O37207J74790K25525m68216j83869j175384p74307j52893
2315.5G27895203q545R57031L05634Q00018N23147k79541q28781o99997m61425p72629
$$ plain form
2248.9 732602005 732009277 731372604 731057053 731177673 731047440 731208115 731171188 731483536 731853790 732290573
2258.6 732290573 732521744 731863785 731570282 731223984 731472321 731744080 731632233 731525879 731695251 732390137
2268.2 732390137 732176590 731851044 731271057 731105804 731269608 731009521 731119766 731026917 731532364 731823502
2277.9 731823502 731786957 731411591 730863876 730782776 730045776 729774399 729607925 729650803 730252609 730760193
2287.5 730760193 731206360 731282959 731118469 730498581 730047455 729348221 729067154 729485245 729862671 730181427
2297.2 730181427 730049286 730611267 730688324 730473328 730210495 729357300 729109344 728655930 728441544 728670349
2306.8 728670349 729612350 730249557 730424347 730649872 730181656 729997787 728822403 728048096 727895203
2315.5 727895203 727886658 728843689 729149323 729949341 730472488 730192947 729364166 728664169 728202744 727430115
2325.1G27430115R0027o8512K47650n06592n2643N83573K72674J112671n75714k28119
2334.8G28305130L97491o02264j241531n51606M97818J70594J57776p32575N7221k52991
2344.4G26205063q87756L33023j40610q28476j49155R61228L30581L54462J08948R3765
2354.1G26381073R20792j574250j169815K44065K082290J049881r81369j058120p69730
2362.7G25124817P27081j958694o16303M76303m33960L35846m19082o55670j107483
2371.4G21472855J63879J1673k85568K59628m57764l55911q1253K14462l68118o26831
2381.1G19947052m91333l58429Q6441q9340m08173p39364l83377j75782J526K78397
2390.7G17667618O3858l48587m02069L58810l61633p35932l95050m28848J28098K73132
$$ plain form
2325.1 727430115 727520142 727451630 727699280 727192688 727140045 727723618 727996292 729108963 728533249 728305130
2334.8 728305130 728702621 728100357 726858826 726307220 726805038 726975632 727133408 726400833 726458054 726205063
2344.4 726205063 725317307 725650330 725509720 724681244 724532089 725493317 725823898 726178360 726287308 726381073
2354.1 726381073 727301865 725727615 724557800 724801865 726884155 727934036 726952667 725894547 725124817
2362.7 725124817 725851898 723893204 723276901 723753204 723319244 723655090 723236008 722580338 721472855
2371.4 721472855 721636734 721648407 721362839 721622467 721164703 720808792 720727539 720942001 720573883 719947052
2381.1 719947052 719455719 719097290 719183731 719094391 718686218 717946854 717563477 717387695 717389221 717667618
2390.7 717667618 717731476 717382889 716980820 717339630 716977997 716242065 715847015 715418167 715546265 715819397
2400.3G15819397J66626m35104j34583r7122n97382m26025l27377n1728q32901n79452
2410G12504349N4855J02921K80685r7046K10877j20469n03463o00205m49218k99759
2419.6G11083527p77970l21655K12173J81046m44183l68271K15149L02047k18429r48181
2429.3G08915253m72107l91312n54428l75900K17972L83605q8119j90201p70111n97458
2438.9G06077194n66253m65851k30027k18582J6632n24368L2883K26974j66244m49524
2448.6G03732834m78211N9891n53589p26394n56412J9150L32184l4943m54788q47016
2458.2G00492706p0038j19476m01840o37131n07507J81961J6327p3700l60108q2168
2467.8F98439026l31879p26776m64325n23453k92511k96478k6779j99966n45350p09610
$$ plain form
2400.3 715819397 715986023 715550919 715416336 715319214 714721832 714295807 713968430 713916702 713083801 712504349
2410 712504349 712559204 712662125 712942810 712845764 713056641 712936172 712432709 711832504 711383286 711083527
2419.6 711083527 710305557 709983902 710196075 710377121 709932938 709564667 709779816 710081863 709863434 708915253
2429.3 708915253 708443146 708051834 707497406 707121506 707339478 707723083 707634964 707444763 706674652 706077194
2438.9 706077194 705510941 705045090 704815063 704596481 704613113 704088745 704121628 704348602 704182358 703732834
2448.6 703732834 703254623 703314514 702760925 702034531 701478119 701497269 701829453 701794510 701339722 700492706
2458.2 700492706 700422668 700303192 699901352 699264221 698756714 698938675 698955002 698881302 698521194 698439026
2467.8 698439026 698107147 697380371 696916046 696392593 696100082 695803604 695776825 695576859 695031509 694321899
2477.5F94321899n41000j46103m22592m54712o68716l38135j36719J06583L86886l0365
2487.1F92077026l50570j065064o19430m55094o46133m64783p4921K57950o73141j44272
2496.8F87841568j15891p74917p73468n94101L1052n09110p03278o19812J50910L78494
2506.4F84311447l24478k32468m92630k80685n06592n78766p34863o83441j99814n06668
2516.1F79771042L05l07388k72293o2790n48706n66788p35321l47977m35943l30735
2525.7F76163406j06659l6315j05057j13220K25219o13556o25991n93720p13654k25982
2535.4F73254471l49884m48609n17730q5984R8343j08795m02832k48184l26767p60956
2545F70103073j83792n31845p79648l27454J16730N0049m30527j16958n14756p27920
$$ plain form
2477.5 694321899 693780899 693634796 693212204 692757492 692088776 691750641 691613922 691720505 692107391 692077026
2487.1 692077026 691726456 690661392 690041962 689586868 688940735 688475952 688401031 688658981 687985840 687841568
2496.8 687841568 687725677 686950760 686177292 685583191 685614243 685105133 684401855 683782043 683932953 684311447
2506.4 684311447 683986969 683754501 683261871 682981186 682474594 681895828 681160965 680477524 680277710 679771042
2516.1 679771042 679771347 679463959 679191666 679128876 678580170 678013382 677278061 676930084 676494141 676163406
2525.7 676163406 676056747 676020432 675915375 675802155 676027374 675413818 674787827 674194107 673480453 673254471
2535.4 673254471 672904587 672455978 671938248 671852264 671950607 671841812 671438980 671190796 670864029 670103073
2545 670103073 669919281 669387436 668607788 668280334 668397064 668447113 668016586 667899628 667384872 666656952
2554.6F66656952n74646k25067P4234m63410l37143L1052M7989k20261l84674n11322
2564.3F64093704n00335n91889n55954j99051k86331P1640l22113n79605k85645l49121
2573.9F60495300j59225n47104m92401k14157J13907k34070m54178m4861o60324k90070
2583.6F57512817j23901m52576m80117l32795k05459o07682m6997O9657j21155n26581
2593.2F54685211p31582m33350n77164p0572l82461n38864k88773l66821P1563K33613
2602.9F51600800j35041o57196m90188n11856k42310l01209p34710n42908p92618j71966
2612.5F47020798J94473k37961p73392o58721r3613n58777m78897m11148k77481j12534
2622.1F43612747k36206j36337k50321j24206o25382r36660l88413l5171p91092j079026
$$ plain form
2554.6 666656952 666082306 665857239 665931473 665468063 665130920 665161972 665209961 664989700 664605026 664093704
2564.3 664093704 663593369 663001480 662445526 662246475 661960144 662031784 661709671 661130066 660844421 660495300
2573.9 660495300 660336075 659788971 659296570 659082413 659196320 658962250 658508072 658463211 657802887 657512817
2583.6 657512817 657388916 656936340 656456223 656123428 655917969 655310287 655263290 655332947 655211792 654685211
2593.2 654685211 653953629 653520279 652943115 652872543 652490082 651951218 651662445 651295624 651367187 651600800
2602.9 651600800 651465759 650808563 650318375 649806519 649564209 649263000 648528290 647985382 647192764 647020798
2612.5 647020798 647215271 646977310 646203918 645545197 645451584 644892807 644413910 644002762 643725281 643612747
2622.1 643612747 643376541 643240204 642989883 642865677 642240295 641303635 640915222 640880051 640088959 639009933
2631.8F39009933j70898M8065R3689n68695p67059l26920k93541k69127n95245j74522
2641.4F35985680k75154p94640p35817j81885L53050k53257p88803p56989l63541m91600
2651.1F31697044m72412l27568n04951k92244k74124L3569n73311r65881m43077k57264
2660.7F27619781o6986l75785l08495k90108j14021j90887m14353j73530p32003n10330
2670.4F24443283j58310k72064k81448k09618q7318k99111l32527n41115k46887k47574
2680F21767311o00471o31371m50783K33574l0365m00047n00450l51982k63443n92499
2689.6F18179474k82555l79677l92341k34375m13819j84059P2594j17607l68843o05164
2699.3F15273628r10606n90553j95198l9292l03383m49333k24266J2856J69944o07757
$$ plain form
2631.8 639009933 638839035 638887100 638980789 638412094 637645035 637318115 637024574 636755447 636160202 635985680
2641.4 635985680 635710526 634915886 634180069 633998184 634351234 634097977 633309174 632552185 632188644 631697044
2651.1 631697044 631224632 630897064 630392113 630099869 629825745 629859314 629286003 628320122 627877045 627619781
2660.7 627619781 627552795 627177010 626868515 626578407 626464386 626273499 625859146 625685616 624953613 624443283
2670.4 624443283 624284973 624012909 623731461 623521843 623434525 623135414 622802887 622261772 622014885 621767311
2680 621767311 621166840 620535469 620084686 620318260 620287895 619887848 619387398 619035416 618771973 618179474
2689.6 618179474 617896919 617517242 617124901 616890526 616476707 616292648 616365242 616247635 615878792 615273628
2699.3 615273628 614363022 613772469 613577271 613537979 613234596 612785263 612560997 612573853 612743797 612136040
2708.9F12136040m27056q1558m67567n21889n70450j99776m03175k06680j7586j67389
2718.6F09072914j11580l69987N0163j84250m15306m69742m87785q6479k91939k40212
2728.2F06465797l08075j37290k45553o23474k34680L5439j27983l60871n5237k59208
2737.9F04148865n70069n05752Q4801M57000k96325j8654o3439n54962k98920j01509
2747.5F02281036K52037J45417p29027j038628r3765r8381l65295j11809n5313J91421
2757.2F00377693l81775o73332l12767K24571j08604o36139M5700k84195m92020P9041
2766.8E97838173m5586n88112n11131k25487n55153m19235l4637P0915k91672k07786
2776.4E95030289k27967o11229l35502o19774l72658N7602m58069p72972k98080k87514
$$ plain form
2708.9 612136040 611708984 611627426 611159859 610637970 610067520 609867744 609464569 609257889 609240303 609072914
2718.6 609072914 608961334 608591347 608641510 608457260 608041954 607572212 607084427 606997948 606706009 606465797
2728.2 606465797 606157722 606020432 605774879 605151405 604916725 604952164 604824181 604463310 604408073 604148865
2737.9 604148865 603578796 603073044 603157845 603614845 603318520 603299866 603236427 602681465 602382545 602281036
2747.5 602281036 602533073 602678490 601949463 600910835 600817070 600718689 600353394 600241585 600186272 600377693
2757.2 600377693 599995918 599322586 599009819 599234390 599125786 598489647 598535347 598251152 597759132 597838173
2766.8 597838173 597792587 597204475 596693344 596467857 595912704 595493469 595458832 595529747 595238075 595030289
2776.4 595030289 594802322 594191093 593855591 593235817 592863159 592920761 592462692 591689720 591391640 591104126
2786.1E91104126n39856K30980j32027l12347j11122o29616n33142n61371n19638n52788
2795.7E87443199l03268k89192o26641o25343l98407j05324o98280n68352l37791l58620
2805.4E83131981l22495o42509m26750n49126k06833l60985q47740o81343r01947p46956
2815E77445297n43823n14374o14662l02467k86331k87095k41088j042481p24640m77409
2824.7E72410927o01158m75579n17501q86689j149711l43781k47192m74014p76825
2833.3E66938477q80089j058350j403999n23110n24826p12127q30155j292381j452522
2842E58260918j493149j156960j310272j270065j455918j390457j399879j865540j377334
2850.7E45541344j253434j115226p38869j82838k31514l38784j9798l87726J50910
$$ plain form
2786.1 591104126 590564270 590795250 590663223 590350876 590239754 589610138 589076996 588515625 587995987 587443199
2795.7 587443199 587139931 586850739 586224098 585598755 585200348 585095024 584396744 583828392 583490601 583131981
2805.4 583131981 582809486 582166977 581740227 581191101 580984268 580623283 579775543 579094200 578192253 577445297
2815 577445297 576901474 576387100 575772438 575469971 575183640 574896545 574655457 573612976 572888336 572410927
2824.7 572410927 571809769 571334190 570816689 569930000 568780289 568436508 568189316 567715302 566938477
2833.3 566938477 566058388 565000038 563596039 563072929 562548103 561835976 561005821 559713440 558260918
2842 558260918 556767769 555610809 554300537 553030472 551574554 550184097 548784218 546918678 545541344
2850.7 545541344 544287910 543172684 542433815 542250977 542019463 541680679 541660881 541273155 541424065
2859.4E41424065P4195q7471L8338o14929m74434n76477p52754m64668o4850k30217
2869E38270798p57332q03299o14319k18811j68800j75515o08940p01294k17323m06189
2878.7E33598976p26929q76464m33083r5596k09427n83191o08368k50702r66797j407890
2888.3E27440529p32994m56009r90982o04630p934m29535o95763j096649r37233n41801
2897.9E20946999p27578q03108n68542l66936m50974l03344n05944n21278n87578j001854
2907.6E15109863p29599p14836j144371j195183l87458k23465p46956r41429j220170
2916.3E07806396j346282j671181j299706q75244r92775q52318o36367j25885k45591
2925D99761047l16772k5063J71891J96685k37121k5940L67050L73344L23067K47955
$$ plain form
2859.4 541424065 541498260 541410789 541449127 540834198 540359764 539783287 539030533 538565865 538501015 538270798
2869 538270798 537513466 536710167 536095848 535877037 535708237 535532722 534923782 534222488 534005165 533598976
2878.7 533598976 532872047 531995583 531562500 531466904 531257477 530674286 530065918 529815216 528848419 527440529
2888.3 527440529 526707535 526251526 525260544 524655914 524647980 524218445 523522682 522426033 521488800 520946999
2897.9 520946999 520219421 519416313 518847771 518480835 518029861 517726517 517220573 516699295 516111717 515109863
2907.6 515109863 514380264 513665428 512521057 511325874 510938416 510714951 509967995 509026566 507806396
2916.3 507806396 506460114 504788933 503489227 502613983 501621208 500768890 500132523 500006638 499761047
2925 499761047 499444275 499419212 499591103 499787788 499550667 499524727 499891777 500265121 500588188 500836143
2934.6E00836143K13547N45044R35707P86858N43976N75256N50766J31226M10652O40526
2944.2E06169701O32248J209259O51588l4332J93977N57671O75621L87764k3156m6577
2953.9E10373764L32794j793j53389K74353P05300O57043P6447J72882L53279J45302
2963.5E12935982l7041L78571M15191K40250Q08029N83687L42483O19812P88079M49333
2973.2E17524376J56021J70517o8474P20215R70612Q6784n531L09906J10321m4823
2982.8E19929924J54724K2888R2888j43318K4414M86336L3111O8665K14272J2092l34396
2993.4E20561600j30272J87454j29585l63198m73213l29933l17383O5079k93312p14493
3003.1E18062744k16331p81250m61998P8659k58980l4447k04658o47011l26882j13067
$$ plain form
2934.6 500836143 501049690 501594734 502530441 503317299 503861275 504436531 504987297 505118523 505529175 506169701
2944.2 506169701 506801949 508011208 508662796 508628464 508822441 509380112 510055733 510443497 510420341 510373764
2953.9 510373764 510706558 510704765 510551376 510825729 511531029 512188072 512264519 512437401 512790680 512935982
2963.5 512935982 512898941 513277512 513692703 513932953 514740982 515324669 515667152 516286964 517075043 517524376
2973.2 517524376 517680397 517850914 517782440 518502655 519473267 519560051 519554520 519864426 519974747 519929924
2982.8 519929924 520084648 520107536 520200424 520057106 520081520 520567856 520600967 520669632 520883904 520895996 520561600
2993.4 520561600 520431328 520618782 520489197 520125999 519652786 519322853 519005470 519070549 518777237 518062744
3003.1 518062744 517846413 517065163 516603165 516681824 516422844 516388397 516183739 515536728 515209846 515096779
3012.7E15096779p38106p48558k19192O6528n14450j040116o13746m44451k35824n23224
3022.4E10085640o27976k00538j16387m70352q25309m35830r13276n98107J25542l23029
3032E05700378p9574k35901n35851q80546j106491q07266l86582J16272k42042o59485
3041.6E00882912n79377m21257q06007r19418n03578n16396m84810o08978m63448k12440
3051.3D95367203l51105r59892j003189l12310m54788n16739n03044p10602p86857
3060D89768677l10440l45764p44553P2746k62146o34460l92914o09741p58515j081276
3069.6D84701614n38597m51965k82364J12228k11830l25470m47464j52015m82331r26017
3079.2D80995789j005555q69140n799m9324n23681l60527m5624l53546n58548m46816
$$ plain form
3012.7 515096779 514358673 513610115 513390923 513457451 512943001 511902885 511289139 510844688 510608864 510085640
3022.4 510085640 509457664 509257126 509140739 508670387 507845078 507409248 506495972 505897865 506023407 505700378
3032 505700378 505620804 505384903 504849052 503968506 502862015 502054749 501668167 501784439 501542397 500882912
3041.6 500882912 500303535 499882278 499076271 498156853 497653275 497136879 496652069 496043091 495579643 495367203
3051.3 495367203 495016098 494056206 493053017 492740707 492285919 491769180 491266136 490555534 489768677
3060 489768677 489458237 489112473 488367920 488440666 488178520 487544060 487151146 486541405 485782890 484701614
3069.6 484701614 484163017 483711052 483428688 483540916 483329086 483003616 482556152 482404137 481921806 480995789
3079.2 480995789 479990234 479121094 479115295 479065971 478542290 478181763 478136139 477782593 477224045 476777229
3088.9D76777229o05430n18761o15387o63109o26182m33388k56195m65508k86979J09787
3098.5D72416077q7281o70166q20198r87205n66178k21099m23241m8409j24206l11432
3108.2D68156662p34291r01337l73726l26271m25491m16107l31803p98950n73616p9498
3117.8D63195572l99742p05300r05342k26898l82652r61228p01408l98331m4021p15485
3127.5D57755165q25539m66346p44438n96085j60637r3994o09551p97538p44553m14314
3137.1D52302170l80326p72705l96728n17502j195106p71294m883n13039j071281m73099
3146.8D46206207r4337l51448l69835o20270j068191n18761j12534m06608o78330p71599
3156.4D41214294r46464r92775k43149l39012o12602k85492o25191j136246j097107
$$ plain form
3088.9 476777229 476171799 475653038 475037651 474374542 473748360 473314972 473058777 472593269 472306290 472416077
3098.5 472416077 472328796 471658630 470838432 469851227 469285049 469063950 468640709 468592300 468468094 468156662
3108.2 468156662 467422371 466521034 466147308 465821037 465395546 464979439 464647636 463848686 463275070 463195572
3117.8 463195572 462795830 462090530 461185188 460958290 460575638 459614410 458913002 458514671 458470650 457755165
3127.5 457755165 456929626 456463280 455718842 455122757 454962120 454868126 454258575 453461037 452716484 452302170
3137.1 452302170 451921844 451149139 450752411 450234909 449039803 448268509 448263626 447750587 446679306 446206207
3146.8 446206207 446111870 445760422 445390587 444770317 443702126 443183365 443070831 442664223 441985893 441214294
3156.4 441214294 440267830 439275055 439031906 438692894 438080292 437794800 437169609 436033363 434936256
3165.1D34936256q8348q011r05800r75342o23931o45714q58536n64957m13894j36948
3174.7D29714775k56157n58433m94118r66416o03675j83106k76871n12428q66394r20067
3184.4D24077110p79190k73323o09016n82466q0452o41213j004486m71725l2425p18537
3194D18884277q13636n27039p20901o90957r05342n09376J73111J27678p18766r87968
3203.6D13311081m66499m54140o61926q74176l06626j93825n17692k50931m98466k38114
3213.3D08848686k25944n71137m09622o38313m93164l77198p91893p91168m82406n44625
3222.9D03523216l42064J86310j91269n23529n30128q55294o75468m55780l65677j52168
3232.6C99618149l59268n66826n86891m49448j93405k05498m99420n88036m05121m04357
$$ plain form
3165.1 434936256 434847908 434839897 433934097 432958755 432334824 431689110 430830574 430265617 429851723 429714775
3174.7 429714775 429458618 428900185 428406067 427439651 426835976 426652870 426375999 425863571 424997177 424077110
3184.4 424077110 423297920 423024597 422415581 421833115 421752663 421111450 420106964 419635239 419602814 418884277
3194 418884277 418070641 417543602 416822701 416131744 415226402 414717026 414890137 415017815 414299049 413311081
3203.6 413311081 412844582 412390442 411728516 410854340 410547714 410353889 409836197 409585266 409086800 408848686
3213.3 408848686 408622742 408051605 407641983 407003670 406510506 406133308 405341415 404550247 404067841 403523216
3222.9 403523216 403181152 403367462 403176193 402652664 402122536 401267242 400591774 400135994 399770317 399618149
3232.6 399618149 399258881 398692055 398105164 397655716 397462311 397256813 396757393 396169357 395764236 395359879
3242.2C95359879k3346j13869n58090k68669n12429p03621m37469k67143m59862n09262
3251.9C91506119j44577l89214k66762l43437q71773p56149m10309k86293m58145j22299
3261.5C87457161j74484k96822k48451l89404J09939j76849m31175l18222n23568n95855
3271.2C84412270o69518m25758l98560j21956l1776m03023l83911q5335O4812m85993
3280.8C81471252o02912n79186m83932k9030j48964m10462m60052J10817J33514m18052
3290.4C78582993m78936o37169n44700l01895l0747n8327l13186n1384r2011o02188
3300.1C75472450r32846p74460N570K05993l60755l39776k78587m46510k31056J15470
3309.7C72435493l59268p17315k76642j079636j030807N72k49291m54368m21753j07384
$$ plain form
3242.2 395359879 395336533 395222664 394664574 394395905 393883476 393179855 392742386 392475243 392015381 391506119
3251.9 391506119 391361542 390972328 390705566 390362129 389490356 388734207 388323898 388037605 387579460 387457161
3261.5 387457161 387282677 386985855 386737404 386348000 386457939 386281090 385849915 385531693 385008125 384412270
3271.2 384412270 383742752 383316994 382918434 382796478 382764702 382361679 381977768 381892433 381957245 381471252
3280.8 381471252 380868340 380289154 379805222 379776192 379627228 379216766 378756714 378867531 379001045 378582993
3290.4 378582993 378104057 377466888 376922188 376620293 376589546 376531219 376218033 376166649 376074638 375472450
3300.1 375472450 374539604 373765144 373770714 373976707 373615952 373276176 372997589 372551079 372320023 372435493
3309.7 372435493 372076225 371358910 371082268 370002632 368971825 368972397 368723106 368268738 367846985 367739601
3319.4C67739601k83394k18887k19002o67763l61671r71527o02303j51062q44345q69369
3329C62550278j115456n74837n07431o24122k37389p76443m96788L3645n39779r73053
3338.7C56738625m56238k41966m13476o30187r81713p97844o33774m76493o84014m78172
3348.3C50944748j14060o07299n22843k90184q7242m10232r94873r83277n70373n1194
3357.9C46313171k62909j96151o40183j073150n01824j18217K42157o46668j121368
3366.6C41994858l24059j79634m14963o08253p9918j07307r62067o35605M3106k69279
3376.3C38456879o50292o48041k64625M3182m70123l48244r7465m47235j87302k08244
3385.9C35178490o88019m85039m0741l07922k19040K65198j14899p96547o36253Q735
$$ plain form
3319.4 367739601 367456207 367237320 367018318 366350555 365988884 365017357 364415054 364263992 363419647 362550278
3329 362550278 361434822 360859985 360352554 359728432 359491043 358714600 358217812 358251457 357711678 356738625
3338.7 356738625 356282387 356040421 355626945 354996758 354015045 353217201 352583427 352106934 351422920 350944748
3348.3 350944748 350830688 350223389 349700546 349410362 349323120 348912888 347918015 346934738 346364365 346313171
3357.9 346313171 346050262 345854111 345213928 344140778 343638954 343520737 343762894 343116226 341994858
3366.6 341994858 341670799 341491165 341076202 340467949 340388031 340280724 339318657 338683052 338726158 338456879
3376.3 338456879 337806587 337158546 336893921 336937103 336466980 336118736 336021271 335574036 335386734 335178490
3385.9 335178490 334490471 334005432 333964691 333656769 333437729 333702927 333588028 332791481 332155228 332163963
3395.6C32163963k43072r1324M01230k46163k96554k65427n65223l67661k48261j30615
3405.2C30110893k35748m61807j36223m9820K4109N27992k1896n65987l8910L08380
3414.8C29460983m8904m95567o0654K28004K62413L54500o1111j09330L5401K0294
3424.5C29586029P6599K66190j92833n97840K99569N19104p8545M2343L80402N33828
3434.1C30834846M18740J40419M3373j89934J63460K55012m37240K18735O48346N71441
3443.8C32667198P98378O73752O28738j93824K74276O51856k00768P3281N66024O90499
3453.4C36629410L84750M45290O36635M29267L98293J65596K12860O21643J011696
3462.1C40935440J41983k79961P15905J049461Q50754M45289O44227P19947O21910
$$ plain form
3395.6 332163963 331920891 331829567 332230797 331984634 331688080 331422653 330857430 330489769 330241508 330110893
3405.2 330110893 329875145 329413338 329277115 329227295 329251404 329779396 329757500 329191513 329152603 329460983
3414.8 329460983 329412079 328916512 328855858 329083862 329346275 329700775 329639664 329530334 329565735 329586029
3424.5 329586029 329662628 329928818 329735985 329138145 329437714 329956818 329878273 329920616 330301018 330834846
3434.1 330834846 331253586 331394005 331437378 331247444 331410904 331665916 331228676 331447411 332095757 332667198
3443.8 332667198 333465576 334139328 334768066 334574242 334848518 335500374 335299606 335372887 335938911 336629410
3453.4 336629410 337014160 337459450 338096085 338525352 338923645 339089241 339302101 339923744 340935440
3462.1 340935440 341077423 340797462 341513367 342562828 343413582 343858871 344503098 345223045 345844955
3470.8C45844955M55971L63732J135902O86150J92451O97479R65691R36966N37758
3479.5C51817055M06837O32096M60777q8310R93385J656608P37954K61154J58920P16515
3489.1C57752991O95305O22673J023445J083832R85260P32116Q87490N07392O26679
3497.8C64917183J176910P25212K99454P59735J449127O08216L80935J107254O55098
3506.5C72079124M19693J069870R51157O94046J237679R68093R91211N61600J86768
3515.1C79159241P31086O32401P82165P07932J087532J498299J319809R39598J77841
3523.8C87035904P97157J272965J124077P99598J171684J248704P35054J005744J154328
3532.5C96345215J060905Q05703J384887L86009K95296J960602R29298Q40683J073685
$$ plain form
3470.8 345844955 346300926 346664658 347800560 348486710 348679161 349376640 350342331 351279297 351817055
3479.5 351817055 352223892 352855988 353316765 353228455 354221840 355878448 356616402 356877556 357036476 357752991
3489.1 357752991 358448296 359070969 360094414 361178246 362163506 362895622 363783112 364290504 364917183
3497.8 364917183 366094093 366819305 367118759 367878494 369327621 369935837 370316772 371424026 372079124
3506.5 372079124 372498817 373568687 374519844 375213890 376451569 377419662 378410873 378972473 379159241
3515.1 379159241 379890327 380522728 381304893 382012825 383100357 384598656 385918465 386858063 387035904
3523.8 387035904 387833061 389106026 390230103 391029701 392201385 393450089 394185143 395190887 396345215
3532.5 396345215 397406120 398211823 399596710 399982719 400278015 402238617 403167915 404008598 405082283
3541.2D05082283J786804J586495L78036J020203J119346J981392P77665J066703J791039
3549.9D16589966J355552J641350O2561J845284J667442R49021J899452J184501J764679
3558.5D28959808J193428J044236J203003J787681J025620M55131L242836O21109L20091
3567.2D39852943J284790O44188K899285K165184J994018J504631J723404J389046
3574.9D53457489J458130K069054M12330J960144K177124J410561J648445J609001
3582.6D66202278J559830J487808L982811K283363l28941J424179j449K310829K534485
3591.3D81455193K685775J939354J532135K666054j47629K637139L527908P50809J622848
3600D98669586O99539J659089L138008K334480K005539K437973K683182N90400K826310
$$ plain form
3541.2 405082283 406869087 408455582 408833618 409853821 410973167 412954559 413732224 414798927 416589966
3549.9 416589966 417945518 419586868 419649429 421494713 423162155 424111176 426010628 427195129 428959808
3558.5 428959808 430153236 431197472 432400475 434188156 435213776 435668907 438911743 439532852 439852943
3567.2 439852943 441137733 441781921 444681206 446846390 448840408 450345039 452068443 453457489
3574.9 453457489 454915619 456984673 457397003 459357147 461534271 462944832 464593277 466202278
3582.6 466202278 467762108 469249916 473232727 475516090 475187149 476611328 476609879 478920708 481455193
3591.3 481455193 484140968 486080322 487612457 490278511 490130882 492768021 496295929 497046738 498669586
3600 498669586 499369125 501028214 504166222 506500702 508506241 510944214 513627396 514217796 517044106
3608.7E17044106J499900l06816M751168K486343J72005M005546J200028K890129L464470
3617.4E37206879N49621J667938N80330J670380L556328K857437K128830K653885K717705
3626E55589333K449226N168419K796631o013222L240738M488525M332810K136497N73387
3634.7E74762344L222847L473473K789192J485138J851502K392692K253571J922912
3642.4E94153671J454392L251228L707504M338990J148109j581535M938011J159820
3650.1F12570190j800689J076507N287667M664230L573379M556122l911895K356834
3657.9F28372345M981194J622047K205467J507225K459717J831055J853561J917191
3665.6F46749802J015167M249802K851867j21994P30210l061524K446823N670395N465775
$$ plain form
3608.7 517044106 518544006 518237190 522988358 525474701 525646706 529652252 530852280 533742409 537206879
3617.4 537206879 537756500 539424438 540004768 541675148 545231476 548088913 550217743 552871628 555589333
3626 555589333 558038559 563206978 566003609 559990387 563231125 567719650 572052460 574188957 574762344
3634.7 574762344 577985191 581458664 584247856 585732994 587584496 589977188 592230759 594153671
3642.4 594153671 595608063 598859291 602566795 606905785 608053894 606472359 611410370 612570190
3650.1 612570190 610769501 611846008 617133675 621797905 625371284 629927406 626015511 628372345
3657.9 628372345 633353539 634975586 637181053 638688278 641147995 642979050 644832611 646749802
3665.6 646749802 647764969 652014771 654866638 654744644 655474854 652413330 654860153 660530548 665996323
3674.3F65996323k230149j2235031N158692Q023529L859100j667786Q34198L030854
3682F70769730K233963J323776P97195M23279L114090M942169p574463k350006P251969
3690.6F80931702k588959k93503M428635J612396J608429J29547o53458J320572M94767
3699.3F86990128K082214K563324l928299p49512L827744R94491J72501J82571J664353
3708F93799515L033371n694733K666321L840790r538727M109878L764649O76346R34829
3716.7F97592239J707230J269989l116379M89273N014420j297150l759994K655792
3724.4G00555420N28183n03388j825790K96249L109589R19495M077072k613754o721802
3733.1F97821274O361465M58145o402511M31518L100891Q38013J123200K570495k877960
$$ plain form
3674.3 665996323 663766174 651531143 656689835 664713364 668572464 666904678 667738876 670769730
3682 670769730 673003693 674327469 675124664 675547943 678662033 683604202 676029739 673679733 680931702
3690.6 680931702 678342743 678049240 682477875 684090271 685698700 685828247 685174789 686495361 686990128
3699.3 686990128 689072342 691635666 687707367 686957855 690785599 691780090 691952591 692135162 693799515
3708 693799515 696832886 691138153 693804474 697645264 688106537 692216415 695981064 696657410 697592239
3716.7 697592239 699299469 700569458 697453079 697942352 702956772 701659622 697899628 700555420
3724.4 700555420 701083603 700580215 698754425 699050674 702160263 703079758 707156830 704543076 697821274
3733.1 697821274 704182739 704640884 698238373 698669891 701770782 702608795 703731995 706302490 703424530
3741.8G03424530J557770P625503q230133j0272827P908402M062957L467865m53643
3749.5G09090424p198258O424332l870163m403763M774475K991181K707519l431854
3757.2G07083893J157455M414292n293961j300735L223648R36813l96652K001648k292023
3765.9G09534378k912826L327865M070740M70123p245788J405181K622529l3951Q35724
3774.5G12073975J24740Q43811n81054J292953P11136n013046K131805J761627J77918
3783.2G13523865Q00705j464234k05764J55944J32828N18036L29971J85242l04947
3791.9G13671646N2948n69839R11483K337189k727814k265319J658706K761307M365921
3800.6G20196228n897598r364472M182434L804093L566437L069458p711335k545471
$$ plain form
3741.8 703424530 704982300 712607803 704377670 694104843 702013245 706076202 709544067 709090424
3749.5 709090424 701892166 708316498 704446335 700042572 704817047 707808228 710515747 707083893
3757.2 707083893 708241348 712655640 707361679 706060944 709284592 710221405 709824753 711826401 709534378
3765.9 709534378 706621552 709949417 714020157 714490280 707244492 708649673 711272202 711238251 712073975
3774.5 712073975 712198715 713042526 712461472 713754425 714465561 709452515 711584320 713345947 713523865
3783.2 713523865 714324570 712860336 712654572 712810516 712943344 713461380 713791351 713976593 713671646
3791.9 713671646 713724594 713154755 714066238 716403427 713675613 711410294 713069000 715830307 720196228
3800.6 720196228 714298630 704934158 709116592 712920685 716487122 719556580 711845245 709299774
3808.3G09299774M066544J637192K57263N40085L39431N00183K947388r75494r353485
3817G09258881L431625L782043K528763J641617j1872177M42657L512268J662293K006073
3825.7G16394043p5989l047943R7580K317734K866897K96173o504669K073212N162048
3834.3G19579086m738235n60074O385803n881805m238053N264664l307953N04761N361252
3843G18369446j798859k697372K183227J104965n32150O40183l37296J881867M279022
3851.7G23093033l646774Q55789j3606491J654892Q649444m60205j626358Q58765J510544
3860.4G17282639J346893m049301P35168M355622m392014l064194L771668L217010
3868.1G19203491K692795o921539o832962L917999M628372J986542o315918J260986
$$ plain form
3808.3 709299774 713366318 715003510 715260773 715800858 716140289 716640472 719587860 718612366 709258881
3817 709258881 712690506 716472549 719001312 720642929 708770752 709213409 712725677 714387970 716394043
3825.7 716394043 716318054 713270111 713367691 715685425 718552322 718848495 712343826 714417038 719579086
3834.3 719579086 714840851 714280777 720666580 714784775 710546722 715811386 712503433 713008194 718369446
3843 718369446 716570587 713873215 716056442 717161407 716629257 717269440 716932144 718814011 723093033
3851.7 723093033 719446259 720302048 706695557 708350449 716999893 716539688 714913330 715772095 717282639
3860.4 717282639 718629532 714580231 715315399 719671021 715279007 712214813 715986481 719203491
3868.1 719203491 721896286 714974747 708141785 712059784 716688156 718674698 712358780 713619766
3875.8G13619766L098755J1673J597824K448044l527603n126267L531495P55996J066513
3884.5G17476196M125443r061661M37698K617188O34613L113327j855087n971756J747207
3893.2G13263168L386612n13000L41415M8447O58645O46592p041931M474945K532043
3901.8G17796936m243698K397385k537690k38037L80402J12228J803665Q96988O10657
3910.5G16978836q19397n60913J00250p2937N62287R80606k226563j432266L606644
3919.2G17116547o55213k986221J601944J013870M98505j891403k149582K190857J733551
3927.9G16472855J82266o43845p74994J088486j474914j992646J139221M42429O53305
3936.6G15092163P24945m53720l4027k82593R02176P58286l365479n13840J368637
$$ plain form
3875.8 713619766 716718521 716730194 718328018 720776062 717248459 712122192 715653687 716409683 717476196
3884.5 717476196 721601639 712539978 712977676 715594864 716229477 719342804 717487717 711515961 713263168
3893.2 713263168 716649780 716136780 716478195 716526642 717185287 717831879 710789948 715264893 717796936
3901.8 717796936 713553238 715950623 713412933 713174896 713555298 713667526 715471191 716368179 716978836
3910.5 716978836 716159439 715598526 715698776 715625839 716188126 717168732 714942169 713509903 717116547
3919.2 717116547 716461334 713475113 715077057 716090927 716589432 714698029 712548447 714739304 716472855
3927.9 716472855 716655121 716011276 715236282 716324768 714849854 712857208 713996429 714438858 715092163
3936.6 715092163 715817108 715363388 715329361 715046768 715948944 716707230 713341751 712827911 714196548
3945.2G14196548N77088Q75931j315003L04184O0806j540756J689911K57645n88684
3953.9G14517670J4190q41369k40479L61634J069030J23062K1668m52957j380768N03311
3963.6G13694992N39017J38702L83377J22223K58789J62506k39486k96860o71463j55716
3973.2G13936081J66855r27582j34354l5476l3875Q05435K45133J43738n6839o38733
3982.8G13470383p22809Q39767N91202o05392K89230K44904O04629m45709m57230P37763
3992.5G14546738K02102N94635n84716q43659J97067O08368J80054p28836
4000.2G14171753
$$ plain form
3945.2 714196548 714773636 715649567 714334564 714638748 714699554 713158798 714848709 715106354 714517670
3953.9 714517670 714531860 713690491 713450012 713811646 714880676 715003738 715025406 714572449 713191681 713694992
3963.6 713694992 714234009 714372711 714756088 714878311 715137100 715299606 715060120 714763260 714091797 713936081
3973.2 713936081 714102936 713175354 713041000 713005524 712971649 713777084 714022217 714165955 714109116 713470383
3982.8 713470383 712747574 713587341 714178543 713573151 713862381 714107285 714711914 714266205 713808975 714546738
3992.5 714546738 714748840 715343475 714758759 713915100 714112167 714720535 714900589 714171753
4000.2 714171753
##END=$$ End of the data block
