##TITLE=$$ Begin of the data block
##JCAMP-DX=5.00 $$ ACD/SpecManager v 10.08
##SPECTROMETER/DATA SYSTEM=Varian
##DATE=15 Jan 2013 15:17:40
##DATA TYPE=INFRARED SPECTRUM
##DATA CLASS=XYDATA
##ORIGIN=
##OWNER=
##NPOINTS=3735
##FIRSTX=399.26403809
##LASTX=4000.35498047
##MAXX=4000.35498047
##MINX=399.26403809
##MAXY=74.78668976
##MINY=32.99749374
##XFACTOR=1.0000000000
##YFACTOR=0.000000100000000
##FIRSTY=51.88230896
##DELTAX=0.96440572
##XUNITS=1/CM
##YUNITS=TRANSMITTANCE
##XYDATA=(X++(Y..Y))
$$ plain form
399.3 518823090 528115883 514989510 513655624 510845070 520480537 530086555 527553596 519108429
407 519108429 511845474 517745094 517371063 513302956 516270294 514025040 509750061 512861214 513613777
415.7 513613777 509571838 513617859 526563034 524828339 514108887 506929398 501612968 504346237
423.4 504346237 510477409 507386436 506019058 510488052 509382553 510730629 514729691 510713692
431.1 510713692 507557259 507516365 507827492 508700981 509755898 513605080 511086769 510594368 516297722
439.8 516297722 514895782 508175201 503790588 509294624 518269958 519034920 513724518 510296249 513260536
448.4 513260536 513841019 508928719 505923119 507354431 505527687 505107498 509199448 509517479 508679962
457.1 508679962 510525742 510926361 506661377 501734314 505991249 507930603 503978233 504183083 506683235
$$ packed form
399.3E18823090R292793j3126373j333886k810554R635467R606018k532959q445167
407E19108429p262955N899620l74031m068107K967338k245254m274979L111153P52563
415.7E13613777m041939M046021J2945175j734695j0719452p179489n316430K733269
423.4E04346237O131172l090973j367378M468994j105499J348076L999062m015999
431.1E10713692l156433m0894L11127Q73489J054917L849182k518311m92401N703354
439.8E16297722j401940o720581m384613N504036Q975334P64962n310402l428269K964287
448.4E13260536N80483m912300l005600J431312j826744m20189M091950L18031q37517
457.1E08679962J845780M00619m264984m927063M256935J939354l952370K04850K500152
$$ plain form
465.8 506683235 507615585 509595451 509302139 502756958 500029678 504087753 498905296 493310776 497738228
474.5 497738228 500733566 506746025 508521156 506087914 504496727 498016815 495077286 493328209
482.2 493328209 491777649 492078285 494094200 498458023 500342331 504075661 502625885 495763626 492185440
490.9 492185440 491384468 493164444 492602577 494565926 498122978 501481628 503042679 500695496 499711189
499.6 499711189 497528954 495308266 492764015 490683899 490013237 492836342 498882790 498584595 496786499
508.2 496786499 498692741 498171539 492418022 489123268 489759712 487946014 489391747 491432304 491569290
516.9 491569290 494166107 494561577 491254234 488322754 486956406 484984474 486294441 487861671 487445755
525.6 487445755 490147018 490700607 489391098 488995934 489165039 488724747 485305443 481003304 479884262
$$ packed form
465.8E06683235R32350J979866k93312o545181k727280M058075n182457n594520M427452
474.5D97738228K995338O012459J775131k433242j591187o479912k939529j749077
482.2D93328209j550560L00636K015915M363823J884308L733330j449776o862259l578186
490.9D92185440q00972J779976n61867J963349L557052L358650J561051k347183r84307
499.6D99711189k182235k220688k544251k080116o70662K823105O046448k98195j798096
508.2D96786499J906242n21202n753517l294754O36444j813698J445733K040557J36986
516.9D91569290K596817L95470l307343k931480j366348j971932J309967J567230m15916
525.6D87445755K701263N53589j309509l95164J69105m40292l419304m302139j119042
$$ plain form
534.3 479884262 482924805 486653328 488988838 491589775 490915680 487610283 486801262 486364899 484635506
543 484635506 482736588 482326164 483056221 482863312 484053535 484983101 485223083 485838318 484780464 482006035
552.6 482006035 478777122 477827339 478364944 479316711 480020828 480577888 481020699 479503899 478237076
561.3 478237076 477553406 477540741 477959290 477285538 477177353 478848534 480905495 482789078 484995117
570 484995117 483530235 479691124 476723137 474282379 473484116 472070351 473155479 476391411 478062515
578.6 478062515 478735924 478166771 477591438 476599922 474819450 473821220 474720268 475447006 476236610 478925858
588.3 478925858 481595383 483709297 483689346 481832504 479967461 477831039 476707191 476880989 478507538
597 478507538 480410271 480623817 480976868 483605614 483692551 481850090 480661354 477056503 475542374
$$ packed form
534.3D79884262L040543L728523K335510K600937o74095l305397q09021m36363j729393
543D84635506j898918m10424P30057j92909J190223R29566K39982O15235j057854k774429
552.6D82006035l228913r49783N37605R51767P04117N57060M42811j516800j266823
561.3D78237076o83670j2665M18549o73752j08185J671181K056961J883583K206039
570D84995117j464882l839111k967987k440758p98263j413765J085128L235932J671104
578.6D78062515O73409n69153n75333r91516j780472r98230Q99048P26738P89604K689248
588.3D78925858K669525K113914j9951j856842j865043k136422j123848J73798J626549
597D78507538J902733K13546L53051K628746Q6937j842461j188736l604851j514129
$$ plain form
605.6 475542374 476439247 477886925 479636116 479926949 481487885 481851311 480903206 478805695 475336418
614.3 475336418 474058189 473921585 474780884 476505585 479233780 480600204 479742203 479747505 479899864
623 479899864 480114861 479769173 479634018 480538864 481060333 482666245 485349464 487146568 487880974 487993851
632.7 487993851 487770119 487419319 486911621 488356514 490804138 492116165 494422798 497153931 498839912
641.3 498839912 499032555 498012772 497613297 497542877 497719307 497356873 497917252 500633049 503293724
650 503293724 505426483 506390152 506151390 505427055 504177666 501989479 500372353 501078491 502384796
658.7 502384796 503681412 504614449 506196213 506978340 505227165 503615494 502377701 502308426 501342773
667.4 501342773 498273506 502020264 503983994 506407166 508589363 509454079 509249954 508071632 506659088
$$ packed form
605.6D75542374Q96873J447678J749191K90833J560936L63426r48105k097511l469277
614.3D75336418j278229j36604Q59299J724701K728195J366424q58001N302J52359
623D79899864K14997l45688j35155R04846N21469J605912K683219J797104P34406J12877
632.7D87993851k23732l50800n07698J444893K447624J312027K306633K731133J685981
641.3D98839912J92643j019783l99475p0420J76430l62434N60379K715797K660675
650E03293724K132759R63669k38762p24335j249389k188187j617126P06138J306305
658.7E02384796J296616R33037J581764P82127j751175j611671j237793o9275r65653
667.4E01342773l069267L746758J963730K423172K182197Q64716k04125j178322j412544
$$ plain form
676.1 506659088 505009270 505432968 507696075 509513130 512262840 515596428 517508621 517953262 517315941
684.7 517315941 515996742 514620361 514010124 514907074 515565910 516142349 518382530 520941849 522861443
693.4 522861443 523770218 523092804 521325226 519945030 518954773 518315620 519316521 521107712 522875519
702.1 522875519 524772987 526331902 526829720 526305313 525736542 524988976 524383698 524703026 525656853
710.8 525656853 526799393 529426804 532846947 533746910 532961235 532392731 531988831 531035919 530208015
719.5 530208015 531352959 533641739 535430222 536827126 538065910 538168716 537294426 536682243 535992584
728.1 535992584 535022049 535127487 536911964 538697472 540485001 542739410 544581871 545007095 543865700
736.8 543865700 542343216 539995804 538592758 539734344 541695251 543448219 545228882 547510681
$$ packed form
676.1E06659088j649818M23698K263107J817055K749710L333588J912193M44641o37321
684.7E17315941j319199j376381o10237Q96950O58836N76439K240181K559319J919594
693.4E22861443R08775o77414j767578j380196r90257o39153J000901J791191J767807
702.1E22875519J897468J558915M97818n24407n68771p47566o05278L19328R53827
710.8E25656853J142540K627411L420143Q99963p85675n68504m03900r52912q27904
719.5E30208015J144944K288780J788483J396904J238784J02806q74290o12183o89659
728.1E35992584r70535J05438J784477J785508J787529K254409J842461M25224j141395
736.8E43865700j522484k347412j403046J141586J960907J752968J780663K281799
$$ plain form
744.5 547510681 548717957 547845497 546166687 545084305 544938126 545451546 545403175 545541954 548340530
753.2 548340530 550888405 552234421 553336945 552580795 551210136 550390701 549905853 549341698 550369148
761.9 550369148 553066750 555815125 558679962 560153732 560074615 559607811 559045067 557606125 556340485
770.6 556340485 555921059 555487404 555907707 556638832 558255272 560243454 561414490 561368179 558901253
779.2 558901253 556677780 556238060 556329994 556503448 556766891 557613144 560184784 562773018 563777084
787.9 563777084 563919563 562298508 560658035 559345894 558169212 557896004 558333359 560295982 561789513
796.6 561789513 562389946 561961098 560528030 558721657 557013512 556406326 554412537 551695328 550485611
805.3 550485611 551179199 551738815 550907860 549139557 546557884 544863052 542486992 540543938 539584351
$$ packed form
744.5E47510681J207276q72460j678810j082382j46179N13420m8371J38779K798576
753.2E48340530K547875J346016J102524p56150j370659q19435m84848n64155J027450
761.9E50369148K697602K748375K864837J473770p9117m66804n62744j438942j265640
770.6E56340485m19426m33655M20303P31125J616440J988182J171036m6311k466926
779.2E58901253k223473m39720R1934J73454K63443Q46253K571640K588234J004066
787.9E63777084J42479j621055j640473j312141j176682k73208M37355J962623J493531
796.6E61789513O00433m28848j433068j806373j708145o07186j993789k717209j209717
805.3E50485611O93588N59616q30955j768303k581673j694832k376060j943054r59587
$$ plain form
814 539584351 538836594 539439583 539980850 540604591 540158234 539154282 538279800 537424965 537568703 537814255
823.6 537814255 539311905 541327667 543772659 546579018 548877907 550818825 551106186 552122345 553547249
832.3 553547249 554638176 556896133 559475250 562505951 566554794 570347633 571815872 572566757 573508339
841 573508339 574861259 575806084 575864258 577131729 579170036 582511940 585538368 587217216 588699570
849.6 588699570 589668045 589853134 589275627 589233017 589768600 591666794 593530464 595082588 597476997
858.3 597476997 600053253 601849556 602082825 602821045 601867065 600964584 601681671 601857414 602633705
867 602633705 602979622 604237785 604939842 604775429 603615990 601113167 599589233 597854080 597528381
875.7 597528381 597323761 597238503 597572594 597390747 598377151 598272438 597097054 595318108 593511505
$$ packed form
814E39584351p47757O02989N41267O23741m46357j003952q74482q54835J43738K45552
823.6E37814255J497650K015762K444992K806359K298889J940918K87361J016159J424904
832.3E53547249J090927K257957K579117L030701M048843L792839J468239P50885R41582
841E73508339J352920R44825N8174J267471K038307L341904L026428J678848J482354
849.6E88699570R68475J85089n77507m2610N35583J898194J863670J552124K394409
858.3E97476997K576256J796303K33269P38220r53980r02481P17087J75743P76291
867F02633705L45917J258163P02057j64413j159439k502823j523934j735153l25699
875.7E97528381k04620q5258L34091j81847R86404j04713j175384j778946j806603
$$ plain form
884.4 593511505 592060738 591435432 591597939 591495056 592480774 593355598 593849220 593696747 592736282 591130524
894 591130524 589736595 589964676 589563751 589251060 589735794 590593491 591270180 591022034 590030861 588641052
903.7 588641052 588659477 589384422 590454292 592008591 593912735 595477638 596813393 597878113 596924515
912.3 596924515 596365967 594837990 592244759 591009789 589801140 588379822 586999893 585950470 583833771
921 583833771 581928558 580482903 578588791 576628304 573536263 570512047 568098259 566619263 564927864
929.7 564927864 563689423 563792000 562490845 560172539 558224525 557047615 556042328 555731773 555568008
938.4 555568008 555052223 554859352 554167557 554159126 553389931 551629753 550014305 548538437 548122063 547296333
948 547296333 546263809 545439720 544910431 544407997 544106064 544296036 543129082 541723328 540475197
$$ packed form
884.4E93511505j450767o25306J62507j02883R85718Q74824M93622j52473r60465j605758
894E91130524j393929K28081m00925l12691M84734Q57697O76689k48146r91173j389809
903.7E88641052J8425P24945J069870J554299J904144J564903J335755J064720r53598
912.3E96924515n58548j527977k593231j234970j208649j421318j379929j049423k116699
921E83833771j905213j445655j894112j960487l092041l024216k413788j478996j691399
929.7E64927864j238441J02577j301155k318306j948014j176910j005287l10555j63765
938.4E55568008n15785j92871o91795q431p69195j760178j615448j475868m16374q25730
948E47296333j032524q24089n29289n02434l01933J89972j166954j405754j248131
$$ plain form
956.7 540475197 538601227 536305656 534506912 533399239 531782303 530635376 529750137 528238754 526763725
965.4 526763725 525086823 522697639 520786514 519506073 517847099 516388931 514833641 513162270
973.1 513162270 511429710 509369965 507421188 504842224 501504478 498591957 496125526 492930908
980.8 492930908 489007301 485117569 481596107 477921181 474133148 470851936 468089523 465187492
988.5 465187492 461667595 458186073 454558105 450823059 447236977 444062881 441044350 437962265
996.2 437962265 435379143 433145256 430816422 427601814 425494385 423857002 421488075 420100136
1004 420100136 419021072 418286324 416658630 414556046 413642273 413549347 413716774 413000603 411017990
1012.6 411017990 408419037 406724739 405213737 403389893 401089058 398720627 396845207 394653168
$$ packed form
956.7E40475197j873970k295571j798744j107673j616936j146927q85239j511383j475029
965.4E26763725j676902k389184j911125j280441j658974j458168j555290j671371
973.1E13162270j732560k059745j948777k578964l337746k912521k466431l194618
980.8D92930908l923607l889732l521462l674926l788033l281212k762413k902031
988.5D65187492l519897l481522l627968l735046l586082l174096l018531l082085
996.2D37962265k583122k233887k328834l214608k107429j637383k368927j387939
1004D20100136j079064p34748j627694k102584r13773r2926J67427p16171j982613
1012.6D11017990k598953j694298j511002j823844k300835k368431j875420k192039
$$ plain form
1020.3 394653168 393121300 391255150 390368195 390029030 388541031 386903114 384452591 382391281 380585022
1029 380585022 379475288 378358078 377337685 377116585 376789360 377227249 376754723 376173668 376222878 377664223
1038.7 377664223 379547653 380393677 381348114 381586342 383046112 384443130 384553490 384286804 383456726
1047.4 383456726 382666931 382244110 382202339 381170464 381060333 380978203 380795250 381274834 381142883 381192474
1057 381192474 380494537 380879860 380878258 381543961 384168739 385771713 387399292 389443970 392501259
1065.7 392501259 394151802 395163040 396813660 398726807 400820274 401261177 402175865 402833023 404006348
1074.4 404006348 405606537 406758575 408532677 408733253 408525658 408672066 409124336 409183998 410014153
1083 410014153 412129631 413340683 414267769 414836121 416478806 417593575 417631187 418315849 419232407
$$ packed form
1020.3C94653168j531868j866150q86955l39165j487999j637917k450523k061310j806259
1029C80585022j109734j117210j020393k21100l27225M37889m72526n81055M9210J441345
1038.7C77664223J883430Q46024R54437K38228J459770J397018J10360k66686q30078
1047.4C83456726p89795m22821m1771j031875j10131q2130j82953M79584j31951M9591
1057C81192474o97937L85323j602O65703K624778J602974J627579K044678L057289
1065.7C92501259J650543J011238J650620J913147K093467M40903R14688O57158J173325
1074.4D04006348J600189J152038J774102K00576k07595J46408M52270N9662Q30155
1083D10014153K115478J211052R27086N68352J642685J114769L7612O84662R16558
$$ plain form
1091.7 419232407 420417061 421166115 423070297 424518089 425361481 427124214 427834702 428117180 428631821
1100.4 428631821 429179535 429951630 431832771 433532600 434338799 435352592 436046944 436766510 437297363
1109.1 437297363 437702599 437955971 438264885 438963242 439787598 440830307 440977554 441303329 442672958
1117.7 442672958 443704529 443714600 443259125 443096733 443216362 443099136 442453461 442943954 444300919
1126.4 444300919 445301056 446214485 447432137 448994904 449909363 450867538 451975746 452655296 453615875
1135.1 453615875 455588188 457366180 458366585 460647278 462995911 464227104 465381775 466410789
1142.8 466410789 466453438 465593796 465542564 466101227 466857452 467658005 467821655 468089333 468552780 468889122
1152.5 468889122 468480797 467876053 467715111 466855316 465986557 465647163 465146980 464587784 464099045 463288002
$$ packed form
1091.7D19232407J184654P49054J904182J447792Q43392J762733P10488K82478N14641
1100.4D28631821N47714P72095J881141J699829Q06199J013793O94352P19566N30853
1109.1D37297363M05236K53372L08914O98357Q24356J042709J47247L25775J369629
1117.7D42672958J031571J0071m55475j62392J19629j17226o45675M90493J356965
1126.4D44300919J000137R13429J217652J562767R14459R58175J108208O79550R60579
1135.1D53615875J972313J777992J000405K280693K348633J231193J154671J029014
1142.8D66410789M2649q59642n1232N58663P56225Q00553J63650K67678M63447L36342
1152.5D68889122m08325o04744j60942q59795q68759l39394n00183n59196m88739q11043
$$ plain form
1162.1 463288002 462649307 462472229 462357178 463082657 464449005 465623589 466812744 468805351 471473389
1170.8 471473389 474084015 475851974 476845436 478369675 480840225 483705673 486110687 487983513
1178.5 487983513 490165215 492500992 494817505 496867561 497774277 498582535 499577446 500128288 500695686
1187.2 500695686 502033043 503778343 504518204 504776230 504500465 503923721 503693199 503218269 502200546
1195.9 502200546 501087227 500506020 499339294 498646965 498745537 497884789 496674347 495818748 494899521
1204.5 494899521 493325119 491925354 490918846 490656967 491202164 491108665 490741425 490566368 490479469
1213.2 490479469 490662994 490962105 490518532 489448013 489189987 489477348 489605751 489756203 490433426
1221.9 490433426 491050415 491064568 490907326 490210648 489505653 489154510 488790398 488287201 487852669 487681847
$$ packed form
1162.1D63288002o38695j77078j15051P25479J366348J174584J189155J992607K668038
1170.8D71473389K610626J767959R93462J524239K470550K865448K405014J872826
1178.5D87983513K181702K335777K316513K050056R06716Q08258R94911N50842N67398
1187.2E00695686J337357J745300P39861K58026k75765n76744k30522m74930j017723
1195.9E02200546j113319n81207j166726o92329R8572q60748j210442q55599r19227
1204.5D94899521j574402j399765j006508k61879N45197r3499l67240j75057q6899
1213.2D90479469J83525K99111m43573j070519k58026K87361J28403J50452O77223
1221.9D90433426O16989J4153j57242o96678p04995l51143l64112n03197m34532j70822
$$ plain form
1231.5 487681847 487554550 487316933 486496048 485602951 485419579 485470810 485038490 484323654 483798523 483618965
1241.2 483618965 483712921 483296013 482647934 482220421 481747208 481233940 480602226 480088882 479600067 479385643
1250.8 479385643 479564857 479535332 479497223 479408188 479020348 478630867 478270836 478073883 478129654 478091621
1260.5 478091621 478036499 478112259 478475380 479238777 479740639 479814148 480163765 480714455 481188316 481870880
1270.1 481870880 482592621 483097000 483825989 484660912 485407219 486269150 486926613 487645645 488367310 489036026
1279.8 489036026 489828911 490466919 491380463 492629585 494082298 495184212 496067810 497260628 498375244
1288.4 498375244 499263763 499650459 500284348 501030540 501754494 502868690 503911018 504634438 504859009
1297.1 504859009 505196648 505500984 505868568 506160965 506081734 506175232 506538239 507033119 507261353 507477303
$$ packed form
1231.5D87681847j27297k37617q20885q93097j83372N1231m32320p14836n25131j79558
1241.2D83618965R3956m16908o48079m27513m73213n13268o31714n13344m88815k14424
1250.8D79385643J79214k9525l8109q9035l87840l89481l60031j96953N5771l8033
1260.5D78091621n5122P5760L63121P63397N01862P3509L49617N50690M73861O82564
1270.1D81870880P21741N04379P28989Q34923P46307Q61931O57463P19032P21665O68716
1279.8D89036026P92885O38008R13544J249122J452713J101914Q83598J192818J114616
1288.4D98375244Q88519L86696O33889P46192P23954J114196J042328P23420K24571
1297.1E04859009L37639L04336L67584K92397p9231R3498L63007M94880K28234K15950
$$ plain form
1306.8 507477303 507193718 506742554 506564674 506340828 506238213 505816422 505209999 504569664 504724655 504868469
1316.4 504868469 504603767 504791985 504921989 505501442 506202202 507012329 507356339 507772064 508699989 508848991
1326 508848991 508972397 508707657 508835449 509196701 508647346 507774963 507214546 507358971 506985893 506336517
1335.7 506336517 505647659 505311966 505013580 504183578 504389038 505183334 506130943 506586380 506778450 506926994
1345.3 506926994 507227859 507503166 506962738 507047653 506804657 506576805 506293831 505507545 505405617 505308800
1355 505308800 505450134 505107651 504561234 504177551 504090309 503851318 502779732 502244148 501675491 502140083
1364.6 502140083 502322655 501826782 501465988 501088295 500940895 500129890 499664536 498953514 498173103 497861748
1374.3 497861748 497869568 498806114 498649559 498299828 498051033 497887764 497142868 495635414 494539146 493172417
$$ packed form
1306.8E07477303k83585m51164j77880k23846j02615m21791o06423o40335J54991J43814
1316.4E04868469k64702J88218J30004N79453P00760Q10127L44010M15725R27925J49002
1326E08848991J23406k64740J27792L61252n49355q72383n60417J44425l73078o49376
1335.7E06336517o88858l35693k98386q30002K05460P94296R47609M55437J92070J48544
1345.3E06926994L00865K75307n40428Q4915k42996k27852k82974p86286j01928r6817
1355E05308800J41334l42483n46417l83683q7242k38991j071586n35584n68657M64592
1364.6E02140083J82572m95873l60794l77693j47400q11005m65354p11022p80411l11355
1374.3D97861748P820R36546j56555l49731k48795j63269p44896j507454j096268j366729
$$ plain form
1383.9 493172417 492384758 491564903 490286789 488975449 488579483 488128853 486721992 485792122 484228706
1392.6 484228706 482312469 480003967 477855988 477214165 476057701 474790192 472648125 471042862
1400.3 471042862 470290031 469212914 468036041 466763992 465283165 463877716 463084755 462197189 461150322
1409 461150322 460349197 459292183 458476562 457988091 457795792 457352333 456370163 455894737 455598068 455170212
1418.6 455170212 453334084 453680153 455035019 455410461 455368004 455114250 455893898 456943779 457507629
1427.3 457507629 458029137 458296165 458699493 459142609 460011864 460832596 461717262 462746849 463418427
1436 463418427 464166031 465155830 467019348 468278008 469330978 469938202 469788361 470802078 471399956
1444.7 471399956 471674500 472248306 473153610 474441223 475955238 476999855 477045975 477719116 478087006
$$ packed form
1383.9D93172417p87659q19855j278114j311340l95966m50630j406861r29870j563416
1392.6D84228706j916237k308502k147979o41823j156464j267509k142067j605263
1400.3D71042862p52831j077117j176873j272049j480827j405449p92961q87566j046867
1409D61150322q01125j057014q15621m88471j92299m43459r82170m75426k96669m27856
1418.6D55170212j836128L46069J354866L75442m2457k53754P79648J049881N63850
1427.3D57507629N21508K67028M03328M43116Q69255Q20732Q84666J029587O71578
1436D63418427P47604R89799J863518J258660J052970O07224j49841J013717N97878
1444.7D71399956K74544N73806R05304J287613J514015J044617M6120O73141L67890
$$ plain form
1453.3 478087006 478619118 478784142 479058876 480051231 479685974 482955322 484727898 486606216 488100319
1462 488100319 488869743 489861946 489887123 491544876 493041763 495151787 497359543 499247322 500811844
1470.7 500811844 501739655 503966866 506103477 509717026 512196770 513805351 515988922 518081017
1478.4 518081017 519911537 521418800 523336067 524983444 526324730 527581520 528876648 530124474
1486.1 530124474 530505829 530417213 530366936 529207039 530100365 531381073 531763268 531090851 529887314
1494.8 529887314 528787422 525716400 526012726 525132523 523148613 522990150 521889381 521220779 520726585
1503.5 520726585 520632362 518863449 510615921 510263405 513071213 515257225 516142197 517187653 517026253
1512.2 517026253 516394196 515966415 514532585 513870430 512261848 512049828 513105621 513721085 512956924
$$ packed form
1453.3D78087006N32112J65024K74734R92355l65257L269348J772576J878318J494103
1462D88100319P69424R92203K5177J657753J496887K110024K207756J887779J564522
1470.7E00811844R27811K227211K136611L613549K479744J608581K183571K092095
1478.4E18081017J830520J507263J917267J647377J341286J256790J295128J247826
1486.1E30124474L81355q8616n0277j159897Q93326J280708L82195o72417j203537
1494.8E29887314j099892l071022K96326q80203j983910j58463j100769o68602m94194
1503.5E20726585r4223j768913q247528l52516K807808K186012Q84972J045456j61400
1512.2E17026253o32057m27781j433830o62155j608582k12020J055793O15464p64161
$$ plain form
1520.8 512956924 512246056 513548279 514090424 515074501 514543686 514637985 515556183 516844940 518420753
1529.5 518420753 519156036 519748535 520325813 520750961 519560394 519982262 520487213 520878181 520962029 515827942
1539.2 515827942 515223427 517625504 520395966 521393280 521901741 522793541 522344818 523321342 523092957
1547.9 523092957 522806168 522015839 522136421 523228760 523117828 523030472 519805374 520161133 520870819
1556.5 520870819 519590836 513282661 505317574 511744919 512253876 512982750 511559410 509695587 506668968
1565.2 506668968 504312325 503149567 500221863 498090744 490657196 489587212 488413506 485926170
1572.9 485926170 483696976 480432358 478039856 467315750 467177238 465378532 462106285 458632507
1580.6 458632507 454064827 451535835 447492447 445200195 441716766 438840370 435385399 431129417
$$ packed form
1520.8E12956924p10868J302223N42145R84077n30815R4299R18198J288757J575813
1529.5E18420753P35283N92499N77278M25148j190567M21868N04951L90968Q3848n134087
1539.2E15827942o04515K402077K770462R97314N08461Q91800m48723R76524k28385
1547.9E23092957k86789p90329J20582J092339j10932q7356l225098L55759P09686
1556.5E20870819j279983o308175p965087O427345N08957P28874j423340j863823l026619
1565.2E06668968k356643j162758k927704k131119p433548j069984j173706k487336
1572.9D85926170k229194l264618k392502j0724106j38512j798706l272247l473778
1580.6D58632507m567680k528992m043388k292252l483429k876396l454971m255982
$$ plain form
1588.4 431129417 428405876 423470268 421211586 417696800 415711670 412873268 409812508 408423500
1596.1 408423500 404592056 403031845 399389267 397315369 394392967 392173691 391184044 388158302
1603.8 388158302 387712212 385428810 384702187 382301331 381133461 380124474 377908707 377837334 375237732
1612.5 375237732 375188332 373907852 374365501 374107246 370150871 371797600 370293350 370748444 369551010
1621.1 369551010 370599442 370047493 368751564 371135635 371317940 373123970 371736641 372835083 373119049
1629.8 373119049 373414383 374256325 374392319 377116280 377474709 379362068 379868355 383886032 386601906
1638.5 386601906 388105507 390214272 390262794 392110939 392121086 393789330 395011826 394831276 397639160
1647.2 397639160 397714081 401755524 403164444 405705719 406877480 402220421 402312202 406096115 410527115
$$ packed form
1588.4D31129417k723541m935608k258682l514786j985130k838402l060760j389008
1596.1D08423500l831444j560211l642578k073898k922402k219276r89647l025742
1603.8C88158302m46090k283402p26623k400856j167870j008987k215767p1373k599602
1612.5C75237732m9400j280480M57649k58255l956375J646729j504250M55094j197434
1621.1C69551010J048432n51949j295929K384071J82305J806030j387329J098442K83966
1629.8C73119049K95334Q41942J35994K723961L58429J887359N06287M017677K715874
1638.5C86601906J503601K108765M8522J848145J0147J668244J222496j80550K807884
1647.2C97639160P4921M041443J408920K541275J171761m657059R1781L783913M431000
$$ plain form
1655.9 410527115 411935768 414848671 416446877 418317413 419961205 420885544 422918053 423908424 427346344
1664.5 427346344 429048004 431532288 433861313 436024399 439336319 440788307 445194778 447450600
1672.3 447450600 450588455 452805901 454347916 458056450 461435890 465578232 468350525 472041130
1680 472041130 474369736 477975883 481500893 480925484 485812988 489105682 494304581 498107834 501968346
1688.6 501968346 505891609 509914703 514477234 518016930 521780510 524776573 527130775 528479805
1696.4 528479805 533583031 538611717 543073883 546517868 547943192 554143982 558411903 561200485
1704.1 561200485 563372917 566279869 568857231 572070541 575863304 578695450 581422691 583629951
1711.8 583629951 585674896 587352219 587780609 589403152 592383194 593728790 591698761 596165237
$$ packed form
1655.9D10527115J408653K912903J598206J870536J643792R24339K032509R90371L437920
1664.5D27346344J701660K484284K329025K163086L311920J451988M406471K255822
1672.3D47450600L137855K217446J542015L708534L379440M142342K772293L690605
1680D72041130K328606L606147L525010n75409M887504L292694N198899L803253L860512
1688.6E01968346L923263M023094M562531L539696L763580K996063K354202J349030
1696.4E28479805N103226N028686M462166L443985J425324O200790M267921K788582
1704.1E61200485K172432K906952K577362L213310L792763K832146K727241K207260
1711.8E83629951K044945J677323M28390J622543K980042J345596k030029M466476
$$ plain form
1719.5 596165237 599915161 602447472 604213486 605208321 606066055 607085114 608426323 609635124 610950699
1728.2 610950699 612168312 612951775 615403595 618681831 620906715 618254471 617335815 621571350 624447479
1736.9 624447479 625509338 627271423 628306046 629187584 633157310 635793533 637260056 639226341
1744.6 639226341 641444016 642959518 643691483 645440140 647707367 651737976 654701691 657204361
1752.3 657204361 661014328 663741379 666136246 667686081 667621918 669291763 671768951 673955460 676081161
1761 676081161 676445770 678748627 682164917 683682709 684913483 685976715 686650467 685494766 687193680
1769.7 687193680 689876404 689407959 689500427 691270065 695245285 696931381 696538467 698174820 698238983
1778.3 698238983 698549652 698560791 699110336 700974960 703066101 704924698 705111771 705762939 706427917
$$ packed form
1719.5E96165237L749924K532311J766014R94835Q57734J019059J341209J208801J315575
1728.2F10950699J217613P83463K451820L278236K224884k652244r18656M235535K876129
1736.9F24447479J061859J762085J034623Q81538L969726K636223J466523J966285
1744.6F39226341K217675J515502P31965J748657K267227M030609K963715K502670
1752.3F57204361L809967K727051K394867J549835o4163J669845K477188K186509K125701
1761F76081161L64609K302857L416290J517792J230774J063232O73752j155701J698914
1769.7F87193680K682724m68445R2468J769638L975220J686096l92914J636353O4163
1778.3F98238983L10669J1139N49545J864624K091141J858597J87073O51168O64978
$$ plain form
1787 706427917 706799469 706633835 706844406 706721344 707174759 707702255 708053589 711314850 712552948 712756348
1796.7 712756348 713756866 714170074 713471069 711941452 713407211 714017715 715534286 717419357 718426208
1805.3 718426208 719904022 720391006 720361481 719789581 719115067 717639999 718437042 720123367 721024628
1814 721024628 723077774 724452286 725543594 725399475 725297928 725143967 724110794 724263306 723907242
1822.7 723907242 724912491 725911179 725777054 727249222 729190216 730284958 728622894 726018143 726659546
1831.4 726659546 728253479 728384933 728763733 730059662 731173325 732285461 732566910 733186111 732635040
1840.1 732635040 732358551 731851044 731677017 731526794 728725510 731891785 734088364 734737778 735472717
1848.7 735472717 735732346 735707855 734836273 734792099 734398346 734874954 735576782 736291046 737388992 737499695
$$ packed form
1787G06427917L71552j65634K10571j23062M53415N27496L51334L261261J238098K03400
1796.7G12756348J000518M13208o99005j529617J465759O10504J516571J885071J006851
1805.3G18426208J477814M86984k9525n71900o74514j475068P97043J686325R01261
1814G21024628K053146J374512J091308j44119j01547j53961j033173J52512l56064
1822.7G23907242J005249R98688j34125J472168J940994J094742j662064k604751O41403
1831.4G26659546J593933J31454L78800J295929J113663J112136K81449O19201n51071
1840.1G32635040k76489n07507j74027j50223k801284L166275K196579O49414P34939
1848.7G35472717K59629k4491q71582m4174l93753M76608P01828P14264J097946J10703
$$ plain form
1858.4 737499695 738219528 738496780 738744812 737898026 736958008 736828842 737013702 738274307 738286591 738717346
1868 738717346 738238754 737906494 738968430 739630051 740195236 739332047 739082108 739420547 740227890 741093140
1877.7 741093140 741720886 742319412 742177734 742282333 741583252 741297455 740739594 740423965 740982590 741247864
1887.3 741247864 742652206 742936325 742693100 743164291 743268585 742737122 742248611 742155228 741571960 742635727
1896.9 742635727 743602448 744052734 744508286 744741898 745036240 744419937 744015579 743410568 743332062 743485870
1906.6 743485870 743732834 744710541 745265350 745608215 745683365 746109390 745481186 744852219 744632721 744423065
1916.2 744423065 744791336 743593216 744215851 745805054 746939468 747526932 746413498 745571060 745614319
1924.9 745614319 745474701 744829407 745198746 745958786 746746826 747414856 747623596 747866898 747310562 747077942
$$ packed form
1858.4G37499695P19833K77252K48032q46786r40018j29166J84860J260605J2284M30755
1868G38717346m78592l32260J061936O61621N65185q63189k49939L38439Q07343Q65250
1877.7G41093140O27746N98526j41678J04599o99081k85797n57861l15629N58625K65274
1887.3G41247864J404342K84119k43225M71191J04294n31463m88511r3383n83268J063767
1896.9G42635727R66721M50286M55552K33612K94342o16303m04358o05011p8506J53808
1906.6G43485870K46964R77707N54809L42865P5150M26025o28204o28967k19498k09656
1916.2G44423065L68271j198120O22635J589203J134414N87464j113434q42438M3259
1924.9G45614319j39618o45294L69339P60040P88040O68030K08740K43302n56336k32620
$$ plain form
1934.6 747077942 746123123 745424652 745341873 745158691 746004944 746542282 747637787 747598724 746712646 747282715
1944.2 747282715 746979141 745935364 745086670 745090485 745064545 745461731 745913544 746489792 747366638 747308426
1953.8 747308426 747099457 746528320 746212234 745470886 745159912 745582962 745414963 745928497 746374283 746804276
1963.5 746804276 746873016 746860352 746506500 745321655 744770432 744483337 744849014 745277557 746080399 746591644
1973.1 746591644 746648712 746901932 746247940 745625458 745122681 744972763 744679108 744702377 745035248 745104065
1982.8 745104065 746004105 746532211 746644135 746088409 745380325 744538116 743930511 744248352 743863220 743753281
1992.4 743753281 744278717 745477524 745870209 745355835 745187225 744408264 744028702 743544998 743534241 743478394
2002.1 743478394 743379974 744144440 744438019 744661407 744289856 743878937 743273315 742758331 742644119 742213669
$$ packed form
1934.6G47077942r54819o98471q2779j83182Q46253N37338J095505l9063q86078N70069
1944.2G47282715l03574j043777q48694L815k5940L97186M51813N76248Q76846n8212
1953.8G47308426k08969n71137l16086p41348l10974M23050j67999N13534M45786M29993
1963.5G46804276O8740j2664l53852j184845n51223k87095L65677M28543Q02842N11245
1973.1G46591644N7068K53220o53992o22482n02777j49918k93655K3269L32871O8817
1982.8G45104065R00040N28106J11924n55726p08084q42209o07605L17841l85132j09939
1992.4G43753281N25436J198807L92685n14374j68610p78961l79562m83704j0757n5847
2002.1G43478394r8420P64466K93579K23388l71551m10919o05622n14984j14212m30450
$$ plain form
2011.7 742213669 742371521 742673569 743168869 743375778 743439560 742951736 742309647 742226257 741800079 741619034
2021.3 741619034 741061859 741114426 741460342 741704712 742138367 741787872 741658020 741125412 740689316 740477982
2031 740477982 740439911 740490952 740338058 740773849 740942535 741074371 740613937 740399246 740271530 739478531
2040.6 739478531 739055481 738565750 738634109 738713303 739232941 739640198 739564667 739425354 738843994 739172134
2050.3 739172134 738907547 738651581 738673935 738270035 738264542 738361130 738947449 739125443 739352646 739255371
2059.9 739255371 738575745 737829514 736958237 736728592 736752930 737484818 737997665 738313675 738524933 738274841
2069.6 738274841 738045044 737565765 737354965 736915665 736929626 737103958 737419815 738051910 738148270 738422394
2079.2 738422394 738049164 737505188 736800766 736111221 735757751 735787125 736255875 735960693 736467133 736875916
$$ packed form
2011.7G42213669J57852L02048M95300K06909O3782m87824o42089q3390m26178j81045
2021.3G41619034n57175N2567L45916K44370M33655l50495j29852n32608m36096k11334
2031G40477982l8071N1041j52894M35791J68686J31836m60434k14691j27716p92999
2040.6G39478531m23050m89731O8359P9194N19638M07257p5531j39313n81360L28140
2050.3G39172134k64587k55966K2354m03900n493R6588N86319J77994K27203r7275
2059.9G39255371o79626p46231q71277k29645K4338P31888N12847L16010K11258k50092
2069.6G38274841k29797m79279k10800m39300J3961J74332L15857O32095R6360K74124
2079.2G38422394l73230n43976p04422o89545l53470K9374M68750k95182N06440M08783
$$ plain form
2088.9 736875916 736869202 737090912 736503067 735919266 735524826 735365143 735024796 735197067 735398865 735513153
2098.5 735513153 735979309 735918274 736020508 735687027 735202866 734559250 733948822 733593216 733457413 734074707
2108.1 734074707 734270706 734713974 734844894 734643021 734300461 733469849 733201828 732979202 733073425 732969208
2117.8 732969208 732960510 733338242 733858948 734036865 733440094 733232040 732768250 732686386 732506561 732274017
2127.4 732274017 732518463 732482681 732836990 732664032 732704391 732844696 732666168 732086334 731355286 731886978
2137.1 731886978 732393341 732612839 732449341 732745972 733047791 732837296 733022308 732565918 732145233 731937714
2146.7 731937714 732303696 732298126 732228775 732819443 732602921 732789307 732696609 732635498 732586670 731936569 731666107
2157.3 731666107 731582108 731965637 732323761 733009720 733424683 733533707 733364716 732716751 732471771 731759949
$$ packed form
2088.9G36875916o714K21710n87845n83801l94440j59683l40347J72271K01798J14288
2098.5G35513153M66156o1035J02234l33481m84161o43616o10428l55606j35803O17294
2108.1G34074707J95999M43268J30920k01873l42560q30612k68021k22626R4223j04217
2117.8G32969208q698L77732N20706J77917n96771k08054m63790q1864j79825k32544
2127.4G32274017K44446l5782L54309j72958M0359J40305j78528n79834p31048N31692
2137.1G31886978N06363K19498j63498K96631L01819k10495J85012m56390m20685k07519
2146.7G31937714L65982n570o9351N90668k16522J86386r2698o1111m8828o50101k70462
2157.3G31666107q3999L83529L58124O85959M14963J09024j68991o47965k44980p11822
$$ plain form
2167 731759949 731594925 731853790 732232590 732746201 733039246 733688354 733831635 733592224 732920227 732469711
2176.6 732469711 732453613 732494583 732558517 732556152 733045654 733454437 733935242 733953781 733778763 733573303 733025055
2187.2 733025055 732714081 732307892 732370605 732599258 733529434 734262238 734164200 734327698 734153671 734233856
2196.9 734233856 733900299 733286209 732893295 732837830 733134155 733617020 734585800 734861374 735145493 734944687
2206.5 734944687 734277878 733878326 733620377 733671875 733383331 733936920 734250259 734604645 735291901 735309448
2216.1 735309448 735330429 734589005 734287872 734052811 733802948 733879089 733813400 734236679 734468384 734893799
2225.8 734893799 735111389 735090332 734921188 734619675 734286880 734118652 734639587 734671860 734791870 734639893
2235.4 734639893 734520264 734753647 734781723 735027084 734524689 734149780 733941727 734269333 734731064 734685745
$$ packed form
2167G31759949j65024K58865L78800N13611K93045O49108J43281k39411o71997m50516
2176.6G32469711j6098M0970O3934k365M89502M08783M80805J8539j75018k05460n48248
2187.2G33025055l10974m06189O2713K28653R30176P32804r8038J63498j74027Q0185
2196.9G34233856l33557o14090l92914n5465K96325M82865R68780K75574K84119k00806
2206.5G34944687o66809l99552k57949N1498k88544N53589L13339L54386O87256J7547
2216.1G35309448K0981p41424l01133k35061k49863P6141o5689M23279K31705M25415
2225.8G34893799K17590k1057j69144l01513l32795j68228N20935L2273J20010j51977
2235.4G34639893j19629K33383K8076K45361n02395l74909k08053L27606M61731m5319
$$ plain form
2245.1 734685745 735096893 735170212 735215912 734835587 734449158 734215622 734191437 734404373 734094238 734271774
2254.7 734271774 734251022 734444504 734534454 734465256 734536972 733994751 733873672 733534012 733677979 734242096
2264.4 734242096 734475327 734675827 734877548 735125351 734789886 734561844 734028473 733636398 733469391 733413391
2274 733413391 733602905 733640289 734269333 734441605 734557343 734041824 733221130 733124237 732910385 733070450
2283.7 733070450 732969284 733523483 733859863 733730240 734112625 734049301 733743439 732906647 732630920 732421112
2293.3 732421112 732361755 732490082 732574615 733289413 733559341 734077225 733862228 733664017 733390198 732076340
2302.9 732076340 731492691 731274338 731658173 731541672 731986160 732727737 732813034 733266373 732976761 732869110
2312.6 732869110 732175903 731642532 731174316 730498505 730894775 731414413 732569656 732427368 731971893
$$ packed form
2245.1G34685745M11148P3319M5700l80325l86429k33536k4185K12936l10135J77536
2254.7G34271774k0752J93482Q9950o9198P1716n42221j21079l39660J43967N64117
2264.4G34242096K33231K00500K01721K47803l35465k28042n33371l92075j67007n6000
2274G33413391J89514L7384O29044J72272J15738n15519q20694r6893k13852J60065
2283.7G33070450j01166N54199L36380j29623L82385o3324l05862q36792k75727k09808
2293.3G32421112n9357J28327Q4533P14798K69928N17884k14997j98211k73819j313858
2302.9G32076340n83649k18353L83835j16501M44488P41577Q5297M53339k89612j07651
2312.6G32869110o93207n33371m68216o75811L96270N19638J155243j42288m55475
$$ plain form
2321.3 731971893 731979065 731884537 731982574 731376038 731079178 730594330 730678253 730687943 731072998 731772003 731723175
2331.9 731723175 731792831 731584091 731203995 729841843 729722748 729601974 729337006 730534286 730629120 730064774
2341.5 730064774 729434967 729951630 729652863 728765640 728012848 727492828 727800980 727771912 728043365 727637329
2351.2 727637329 727937927 728496780 728542328 729231491 727862473 727223358 727216492 729339142 729840088 728334808
2360.8 728334808 728345261 728113327 729310684 727511520 726488647 726474380 726291504 727152786 726152802
2369.5 726152802 725375748 724979630 725155411 724623489 724382324 724400482 723966141 724112930 723526917 723151627
2379.1 723151627 722538147 722292252 722499542 722159805 721944504 721630859 721513519 721210709 720863190 720320129
2388.8 720320129 720082703 720231476 719985886 719900818 719494019 719547653 719279175 718701172 718691711 718251419
$$ packed form
2321.3G31971893P172r4528R8037o06536k96860m84848Q3923R690L85055O99005m8828
2331.9G31723175O9656k08740l80096j362152j19095j20774k64968J197280R4834n64346
2341.5G30064774o29807N16663k98767q87223p52792n20020L08152k9068K71453m06036
2351.2G27637329L00598N58853M5548O89163j369018o39115o866K122650N00946j505280
2360.8G28334808J0453k31934J197357j799164j022873j4267j82876Q61282r99984
2369.5G26152802p77054l96118J75781n31922k41165J8158m34341J46789n86013l75290
2379.1G23151627o13480k45895K07290l39737k15301l13645j17340l02810l47519n43061
2388.8G20320129k37426J48773k45590q5068m06799N3634k68478n78003r461m40292
$$ plain form
2398.4 718251419 718019485 717902908 717848434 717783432 718004913 718078766 717678986 717164078 716316681 716068802
2408.1 716068802 715585175 715371170 715638733 715579910 715573425 715457764 715752258 715540009 714766235 713846512
2417.7 713846512 713308640 713377304 713130417 712964020 713030319 713429413 713234787 712685089 712493668 712408218
2427.3 712408218 711997528 710863647 710391846 710341263 710210037 709809875 709593048 709666672 709568481 709976120
2437 709976120 709791794 709347458 708622055 707794113 707395477 707034302 707266693 707080688 707104263 707214584
2446.6 707214584 706992569 706801071 706253281 705911484 705303726 704859314 704612885 704422073 704315186 704099121
2456.3 704099121 703718567 703273087 703159714 702412033 702171021 702146301 701791687 701846237 701495056 701090317
2465.9 701090317 700479050 700285187 699973679 699678268 699682236 698697357 698290176 698345337 698204422 697906647
$$ packed form
2398.4G18251419k31934j16577n4474o5002K21481P3853l99780n14908q47397k47879
2408.1G16068802m83627k14005K67563n8823o485j15661K94494k12249p73774r19723
2417.7G13846512n37872O8664k46887j66397O6299L99094j94626n49698j91421q5450
2427.3G12408218m10690j133881m71801n0583j31226m00162k16827P3624r8191M07639
2437G09976120j84326m44336p25403q27942l98636l61175K32391j86005K3575J10321
2446.6G07214584k22015j91498n47790l41797o07758m44412k46429j90812j06887k16065
2456.3G04099121l80554m45480j13373p47681k41012k4720l54614N4550l51181m04739
2465.9G01090317o11267j93863l11508k95411L968r84879m07181N5161j40915k97775
$$ plain form
2475.6 697906647 697523804 697148361 696553345 696175766 695776978 695222549 694359818 694226532 694580383 694752045
2485.2 694752045 694689407 694029236 693587723 692796402 692219849 691810379 691192932 690904236 690861893 690965576
2494.8 690965576 690215912 689883041 689859924 689679108 689472046 688566284 688054810 687464752 686704483 686289902
2504.5 686289902 686454391 686491852 686047592 685839005 685461502 685270081 684735641 684065475 683376617 682856216
2514.1 682856216 682736740 682165527 682006607 681749573 681513367 681509323 681223984 680591125 679925766 679884720
2523.8 679884720 679103928 678403931 678452835 678501358 678234329 677793884 677878265 677622070 677303848 676681519
2533.4 676681519 675852127 675542450 675405807 675273972 674901657 674600449 674174728 674105759 673820114 673363953
2543.1 673363953 673136292 672283554 671898804 671686096 671418991 671165009 671141663 671058502 670144119 669673691
$$ packed form
2475.6F97906647l82843l75443n95016l77579l98788n54429q62731j33286L53851J71662
2485.2F94752045o2638o60171m41513p91321n76553m09470o17447k88696m2343J03683
2494.8F90965576p49664l32871k3117j80816k07062r05762n11474n90058p60269m14581
2504.5F86289902J64489L7461m44260k08587l77503j91421n34440o70166o88858n20401
2514.1F82856216j19476n71213j58920k57034k36206m044k85339o32859o65359m1046
2523.8F79884720p80792o99997M8904M8523k67029m40445Q4381k56195l18222o22329
2533.4F76681519q29392l09677j36643j31835l72315l01208m25721o8969k85645m56161
2543.1F73363953k27661q52738l84750k12708k67105k53982k3346q3161r14383m70428
$$ plain form
2552.7 669673691 669349518 669323120 669305878 668855286 668558197 668131485 667922516 667686768 667426224 667108002
2562.4 667108002 666889114 666502686 665898209 665596008 665021362 664812851 664812241 664465332 663826981 663493042
2572 663493042 663631516 663159103 662470703 661893768 661730042 661788712 661411896 660925598 660921631 660954819 660353622
2582.6 660353622 659952545 659710999 659561996 659393845 659075394 658456650 657669754 657763824 657779922 657563019
2592.2 657563019 657093353 656494827 656134644 655400391 655113220 654943695 654672394 654376450 653991547 653831635
2601.9 653831635 653667450 653479996 653034134 652424316 651651306 651292343 650883026 650462646 650625687 650234909
2611.5 650234909 649962311 649835434 649375839 648752518 648258286 647994385 647518539 647195511 646591415 646084442
2621.2 646084442 645835266 645645599 645351334 644682617 644421234 644010162 643427505 643147430 643146515 642612076
$$ packed form
2552.7F69673691l24173k6398j7242m50592k97089m26712k08969k35748k60544l18222
2562.4F67108002k18888l86428o04477l02201n74646k08511o10l46909o38351l33939
2572F63493042J38474m72413o88400n76935j63726N8670l76816m86298l967L3188o01197
2582.6F60353622m01077k41546j49003j68151l18451o18744p86896R4070J6098k16903
2592.2F57563019m69666n98526l60183p34253k87171j69525k71301k95944l84903j59912
2601.9F53831635j64185j87454m45862o09818p73010l58963m09317m20380J63041l90778
2611.5F50234909k72598j26877m59595o23321m94232k63901m75846l23028o04096n06973
2621.2F46084442k49176j89667k94265o68717k61383m11072n82657k80075r15n34439
$$ plain form
2630.8 642612076 641756516 641730728 641722794 641351700 640373611 639996376 640195084 639361153 638451347 638066025
2640.5 638066025 637866554 637487373 637389908 636972733 636349602 636369514 635946922 635342712 634822159 634503860
2650.1 634503860 634021950 633147392 632691078 632560463 632487373 632286377 632239571 631763382 630882034 630282784
2659.8 630282784 629940109 629814262 629448318 629113197 628936157 628881721 628643913 628225822 627797508 627124672
2669.4 627124672 626483154 626037903 626269112 626552887 626335258 625561409 624837685 624702034 624324646 624165993
2679 624165993 623923874 623483734 623011208 622811432 622933311 622450943 622319298 621980515 621531639 621291428
2688.7 621291428 620568390 620116463 619629097 619261932 619006996 618708153 618394699 618381462 618644600 618296509
2698.3 618296509 617984123 617602043 616776047 615813103 615369263 615500031 615179710 614358101 614143219 614728508
$$ packed form
2630.8F42612076q55560k5788p934l71094r78089l77235J98708q33931r09806l85322
2640.5F38066025j99471l79181r7465m17175o23131J9912m22592o04210n20553l18299
2650.1F34503860m81910q74558m56314j30615p3090k00996m6806m76189q81348n99250
2659.8F30282784l42675j25847l65944l35121j77040n4436k37808m18091m28314o72836
2669.4F27124672o41518m45251K31209K83775k17629p73849p23724j35651l77388j58653
2679F24165993k42119m40140m72526j99776J21879m82368j31645l38783m48876k40211
2688.7F21291428p23038m51927m87366l67165k54936k98843l13454j3237K63138l48091
2698.3F18296509l12386l82080q25996r62944m43840J30768l20321q21609k14882N85289
$$ plain form
2708 614728508 614530220 614017410 613598671 613099098 612918777 612746620 612562943 611690445 611287956 611554108
2717.6 611554108 611486359 611328926 611206398 611394348 610879898 610241699 609952316 609620552 609275093 608887939
2727.3 608887939 608824806 608429565 608297653 608099937 607533684 607167664 606913795 607110252 607138939 607028809
2736.9 607028809 606516037 605928574 605666695 605558167 605612793 605436707 605512657 605295486 605326157 605310364
2746.5 605310364 604803848 604699898 604043388 603656502 603736191 603647804 603584480 603368340 602976646 602574539
2756.2 602574539 602502708 602239113 601802483 601246567 601063309 600939484 600518265 600664635 600480156 600114174
2765.8 600114174 599931450 599715195 599393272 598888283 598542061 598265572 597996216 597647858 597802849 597695656
2775.5 597695656 597262230 596971016 596395187 596220436 595900612 595630913 595093842 594253311 594098969 593920059
$$ packed form
2708F14728508j98288n12810m18739m99573j80321j72157j83677q72498m02489K66152
2717.6F11554108o7749j57433j22528J87950n14450o38199k89383l31764l45459l87154
2727.3F08887939o3133l95241j31912j97716n66253l66020k53869J96457K8687j10130
2736.9F07028809n12772n87463k61879j08528N4626j76086P5950k17171L0671j5793
2746.5F05310364n06516j03950o56510l86886P9689q8387o3324k16140l91694m02107
2756.2F02574539p1831k63595m36630n55916j83258j23825m21219J46370j84479l65982
2765.8F00114174j82724k16255l21923n04989l46222k76489k69356l48358J54991j07193
2775.5E97695656m33426k91214n75829j74751l19824k69699n37071q40531j54342j78910
$$ plain form
2785.1 593920059 593663712 593474159 593414574 593009796 592648621 592467651 591858673 591098557 590296211 590122986
2794.8 590122986 589949265 589740219 589540062 589025764 588290215 587186852 586821213 586268692 585610924
2803.4 585610924 585426292 585098000 584875183 584117126 583349915 583014984 583121490 582950325 582040215 581358986
2813.1 581358986 580797691 580172119 579444618 578959579 578304176 577570801 577297478 576785774 576132050 575514450
2822.7 575514450 575215111 575088425 574643898 573809357 572859688 571891937 570897255 570296135 569904251 569533348
2832.4 569533348 568657799 567792015 567048912 566104889 565791359 565245285 564291229 563176956 561941833
2841.1 561941833 560577202 559210472 558369370 557177849 555717125 553838348 551933975 550592995
2848.8 550592995 549098244 547750244 546584930 545609970 545028534 544836502 543958054 543102837 543562775
$$ packed form
2785.1E93920059k56347j89553n9585m04778l61175j80970o08978p60116q02346j73225
2794.8E90122986j73721k09046k00157n14298p35549j103363l65639n52521o57768
2803.4E85610924j84632l28292k22817p58057p67211l34931J06506j71165r10110o81229
2813.1E81358986n61295o25572p27501m85039o55403p33375k73323n11704o53724o17600
2822.7E75514450k99339j26686m44527q34541r49669r67751r94682o01120l91884l70903
2832.4E69533348q75549q65784p43103r44023l13530n46074r54056j114273j235123
2841.1E61941833j364631j366730q41102j191521j460724j878777j904373j340980
2848.8E50592995j494751j348000j165314r74960n81436j92032q78448q55217M59938
$$ plain form
2857.4 543562775 543749962 543820381 543948898 543588600 543065491 542558403 542312813 542207222 541836128 540937653
2867.1 540937653 540170212 539629517 539227791 538967285 538741188 538376427 537485085 536793976 536332474 535982246
2876.7 535982246 535799484 535647697 535194702 534534416 534328918 533904533 533508873 532895546 532073936 531626244
2886.4 531626244 530744019 529784470 528928909 528198357 527315674 526674423 526587639 526068726 525350838 524485893
2896 524485893 523838768 523146400 522080154 521467514 521389618 521130180 520275955 519646111 518953018 518416824
2905.7 518416824 518231773 517288094 516133423 515403214 514870949 514108047 513234863 512325745 511383476
2914.3 511383476 510484085 509578323 508515053 507033310 505740433 504576836 503885193 503539238 503171196
2923 503171196 502779579 501721230 501525040 502000923 502064552 501950264 501644249 501501465 501682472 502565765
$$ packed form
2857.4E43562775J87187P0419J28517l60298n23109n07088k45590j05591l71094q98475
2867.1E40937653p67441n40695m01726k60506k26097l64761q91342o91109m61502l50228
2876.7E35982246j82762j51787m52995o60286k05498m24385l95660o13327q21610m47692
2886.4E31626244q82225r59549q55561p30552q82683o41251q6784n18913p17888q64945
2896E24485893o47125o92368j066246o12640p7896k59438q54225o29844o93093n36194
2905.7E18416824j85051r43679j154671p30209n32265p62902q73184r09118r42269
2914.3E11383476q99391r05762j063270j481743j292877j163597o91643l45955l68042
2923E03171196l91617j058349j96190M75883O3629j14288l06015j42784J81007Q83293
$$ plain form
2932.7 502565765 502936783 502792320 503262825 503834915 504520836 505538673 506243401 506294746 506898460 507461319
2942.3 507461319 507858925 508846931 509354019 509947739 510681915 510982704 511143608 511418304 511758270 512058601
2952 512058601 512293816 512165375 512376251 512717972 513101158 513599396 513826714 514323921 514860878 515259895
2961.6 515259895 515390091 515793190 516396637 516244392 516015129 516213760 516716919 517589035 518643112
2970.3 518643112 519388466 519937325 519973564 520063629 520802155 520966492 521129265 521487160 521625366 521803703
2979.9 521803703 522220993 522652016 522568932 522773666 522911987 522908478 522894745 522674370 522695541 522617722 522930489
2990.5 522930489 523173637 523096313 523006363 522658691 522703629 523038673 523037796 522280388 521754189 522065659 522236977
3001.1 522236977 521547165 520533485 520306244 520084953 519582787 519207306 519084206 519237328 518861694
$$ packed form
2932.7E02565765L71018j44463M70505N72090O85921J017837P04728N1345O03714N62859
2942.3E07461319L97606R88006N07088N93720P34176L00789J60904K74696L39966L00331
2952E12058601K35215j28441K10876L41721L83186M98238K27318M97207N36957L99017
2961.6E15259895J30196M03099O03447j52245k29263J98631N03159Q72116J054077
2970.3E18643112P45354N48859L6239R0065P38526J64337J62773L57895J38206J78337
2979.9E21803703M17290M31023q3084K04734J38321l509j3733k20375K1171p7819L12767
2990.5E22930489K43148p7324q9950l47672M4938L35044q77p57408n26199L11470J71318
3001.1E22236977o89812j013680k27241k21291n02166l75481j23100J53122l75634
$$ plain form
3009.8 518861694 518305664 518041267 517770844 517412949 516893654 516233177 515776672 515422096 515076599 514860535
3019.5 514860535 514110069 513086700 512528419 512334442 512210693 512133789 511840820 511192398 510604477 509907799
3029.1 509907799 509554253 509349632 508716469 508083153 507341385 506789513 506407890 505892754 505255280 504903297
3038.7 504903297 504652519 503926239 503644295 503616524 503110199 502399940 501625175 500745506 499876823 499189186
3048.4 499189186 498723869 498586006 498401146 497853851 497061768 496649323 496184921 495178261 494347191
3057.1 494347191 493545837 493007050 492529297 492327423 492438164 491944885 491188622 490448341 490311928 489837723
3066.7 489837723 488988609 488543968 488004074 487846451 487066650 486349106 486170464 485535660 485421028 485468521
3076.4 485468521 485293236 484951668 484400024 483812637 483302650 482777824 482183495 482049179 481806908 481224976
$$ packed form
3009.8E18861694n56030k64397k70423l57895n19295o60477m56505l54576l45497k16064
3019.5E14860535p50466j023369n58281j93977j23749p6904k92969o48422n87921o96678
3029.1E09907799l53546k04621o33163o33316p41768n51872l81623n15136o37474l51983
3038.7E04903297k50778p26280k81944k7771n06325p10259p74765q79669q68683o87637
3048.4D99189186m65317j37863j84860n47295p92083m12445m64402j006660q31070
3057.1D94347191q01354n38787m77753k01874J10741m93279p56263p40281j36413m74205
3066.7D89837723q49114m44641n39894j57623p79801p17544j78642o34804j14632M7493
3076.4D85468521j75285l41568n51644n87387n09987n24826n94329j34316k42271n81932
$$ plain form
3086 481224976 480566139 479913292 479336624 478838425 478439407 477929459 477494240 476806183 476428642 476451645
3095.6 476451645 475841560 475273819 475247726 475275574 474628525 473695755 473102036 472666855 472170219 471525841
3105.3 471525841 471367798 471289635 470556068 469917068 469621506 469075394 468749657 468486671 467638474 466814423
3114.9 466814423 466136818 465990448 465954704 465543175 465177307 464732132 464312820 463390732 462441521 461892128
3124.6 461892128 461453705 461096153 460279732 459946480 460013351 459372253 458376236 457753181 457435722 457051697
3134.2 457051697 456638222 455691605 454706154 454112015 453557777 453319550 452904854 452011032 451415863 451286011
3143.9 451286011 450806198 449986267 449497375 449447517 449205818 448538780 447940941 447186623 446217270 445349846
3153.5 445349846 444889717 444563942 443886604 442872505 442096596 442202682 441714973 440591125 440118713
$$ packed form
3086D81224976o58837o52847n76668m98199l99018n09948m35219o88057l77541K3003
3095.6D76451645o10085n67741k6093K7848o47049r32770n93719m35181m96636o44378
3105.3D71525841j58043p8163p33567o39000k95562n46112l25737k62986q48197q24051
3114.9D66814423o77605j46370l5744m11529l65868m45175m19312r22088r49211n49393
3124.6D61892128m38423l57552q16421l33252O6871o41098r96017o23055l17459l84025
3134.2D57051697m13475r46617r85451n94139n54238k38227m14696q93822n95169j29852
3143.9D51286011m79813q19931m88892m9858k41699o67038n97839p54318r69353q67424
3153.5D45349846m60129l25775o77338j014099p75909J06086m87709j123848m72412
$$ plain form
3162.2 440118713 439737816 439094429 438393784 437961540 437395897 436900063 436446609 435703850 435300255 434823685
3171.8 434823685 434191818 433443146 432817497 432266998 431560593 431044655 430239105 429648209 429210472 428899841
3181.5 428899841 428725128 428027840 427650261 426926765 425767670 425420609 425364113 425047684 424115028 422959404
3191.1 422959404 422363853 421808128 421075974 420719070 420472603 419819412 418809395 418278084 418338852 418275146
3200.8 418275146 418031120 417298393 416540642 416036491 415520821 415157356 414474335 413880997 413175735 412365417
3210.4 412365417 412241631 411861115 411432724 411172180 410482750 410084724 409848289 409263153 408759956 408356400
3220 408356400 407665787 407068329 407017708 406617088 405761604 405400848 404804955 403976021 403682060 403320274
3229.7 403320274 403189468 403304520 402566452 401516762 401117592 400872879 400577202 400219498 399641800
$$ packed form
3162.2D40118713l80897o43387p00645m32244n65643m95834m53454p42759m03595m76570
3171.8D34823685o31867p48672o25649n50499p06405n15938q05550n90896m37737l10631
3181.5D28899841j74713o97288l77579p23496j159095l47061n6496l16429r32656j155624
3191.1D22959404n95551n55725p32154l56904k46467o53191j010017n31311O0768o3706
3200.8D18275146k44026p32727p57751n04151n15670l63465o83021n93338p05262q10318
3210.4D12365417j23786l80516m28391k60544o89430l98026k36435n85136n03197m03556
3220D08356400o90613n97458n0621m00620q55484l60756n95893q28934k93961l61786
3229.7D03320274j30806J15052p38068j049690l99170k44713k95677l57704n77698
$$ plain form
3238.4 399641800 399054260 398843536 398974991 398285217 397472458 397411499 397056084 396548920 396010170 395596962
3248 395596962 395512314 395221558 394414330 393427086 393109703 393283234 393385239 392930069 392266846 391817894
3257.7 391817894 391251831 390588684 390051079 389971542 389327621 388657875 388758316 388357430 388179359 388207893
3267.3 388207893 387986221 387799454 387385941 386882095 386362953 386273079 386239624 386038628 385868378 385340652
3276.9 385340652 384701996 384227028 384046478 383886223 383512115 382762375 381813812 381142540 380723419 380886536
3286.6 380886536 381143799 380923157 380481110 379926567 379537659 379279404 379145546 379244881 379167099 379023590
3296.2 379023590 379007530 378549347 377797470 377154083 376812172 377084236 377230911 376563873 375714149 375325890
3305.9 375325890 375131416 374950218 374905891 374771309 374046364 373076782 372816772 372450142 371740341 371317291
$$ packed form
3238.4C99641800n87540k10724J31455o89774q12759o0959l55415n07164n38750m13208
3248C95596962q4648k90756q07228r87244l17383J73531J02005m55170o63223m48952
3257.7C91817894n66063o63147n37605p9537o43921o69746J00441m00886j78071K8534
3267.3C88207893k21672j86767m13513n03846n19142q9874l3455k00996j70250n27726
3276.9C85340652o38656m74968j80550j60255l74108p49740r48563o71272m19121J63117
3286.6C80886536K57263k20642m42047n54543l88908k58255j33858R9335p7782j43509
3296.2C79023590j6060m58183p51877o43387l41911K72064J46675o67038q49724l88259
3305.9C75325890j94474j81198m4327j34582p24945r69582k60010l66630p09801m23050
$$ plain form
3315.5 371317291 370656624 370154495 370268860 370338249 369539642 368540955 368004341 367683830 367808990 367495422
3325.2 367495422 366889877 366460609 365635490 364904900 364301720 363806000 363117180 362233238 361742287 361140251
3334.8 361140251 360491486 360119438 359843674 359402237 358537445 357666931 357275543 356821785 355943413 355221481
3344.4 355221481 354549599 353782196 353282356 352791328 352175598 351870537 351552048 350688553 349969749 349555740
3354.1 349555740 349209824 349036903 348625832 348097458 347790680 347341270 346330070 345387840 345005989
3362.8 345005989 344657059 344384155 344174843 343900528 343648949 343246384 342817688 342298279 341516075 340960693
3372.4 340960693 340788078 340439491 340101318 339754982 338809357 338202286 338234062 337994614 337496605 336771812
3382.1 336771812 336537361 336788750 336427803 336101761 335871048 335640564 335745239 335326843 334715881 334531631
$$ packed form
3315.5C71317291o60667n02129J14365O9389p98607r98687n36614l20511J25160l13568
3325.2C67495422o05545m29268q25119p30590o03180m95720o88820q83942m90951o02036
3334.8C61140251o48765l72048k75764m41437q64792q70514l91388m53758q78372p21932
3344.4C55221481o71882p67403m99840m91028o15730l05061l18489q63495p18804m14009
3354.1C49555740l45916j72921m11071n28374l06778m49410j011200r42230l81851
3362.8C45005989l48930k72904k09312k74315k51579m02565m28696n19409p82204n55382
3372.4C40960693j72615l48587l38173l46336r45625o07071L1776k39448m98009p24793
3382.1C36771812k34451K51389l60947l26042k30713k30484J04675m18396o10962j84250
$$ plain form
3391.7 334531631 334297943 333995056 333840103 333480949 333381538 333743706 333375320 332738190 332420616 332229614
3401.3 332229614 331776123 331181374 331286392 331417732 331417580 331159782 330614243 330454559 330471191 330764122
3411 330764122 330863571 330705910 330440445 330250664 330299225 330167313 330224915 329978523 329974937 330398788 330265198
3421.6 330265198 330208321 330326538 330837708 331228943 331024094 330595856 330626297 331272392 331312027 331108475
3431.2 331108475 331133995 331380424 331844788 332289391 332747231 332701874 332499123 332651253 332793236 332758598
3440.9 332758598 333138466 333419266 333501472 334259529 335070763 335889969 335896111 335764732 336180191 336184082
3450.5 336184082 336727409 337166138 337260170 337784805 338672180 339249420 339325638 340335464 340965195 340917702
3460.2 340917702 341655121 342487297 342793579 342722473 343307304 344339523 344972076 345473366 346004066 346531296
$$ packed form
3391.7C34531631k33688l02887j54953l59154r9411L62168l68386o37130l17574j91002
3401.3C32229614m53491n94749J05018J31340j52k57798n45539j59684J6632K92931
3411C30764122R9449j57661k65465j89781M8561j31912N7602k46392l586M23851j33590
3421.6C30265198n6877J18217N11170L91235k04849m28238L0441O46095L9635k03552
3431.2C31108475K5520K46429M64364M44603M57840m5357k02751J52130J41983l4638
3440.9C32758598L79868K80800Q2206P58057Q11234Q19206O142j31379M15459L891
3450.5C36184082N43327M38729R4032N24635Q87375N77240P6218J009826O29731m7493
3460.2C40917702P37419Q32176L06282p1106N84831J032219O32553N01290N30700N27230
$$ plain form
3469.8 346531296 346955070 347081070 347604942 348844376 349359016 349592438 350369797 351127892 351974602
3478.5 351974602 352402344 352685509 353436470 353769341 354162331 355734596 357144661 357857971 358502846
3487.2 358502846 358704376 359144974 359849548 360680962 361593666 362351112 363406601 364063721 364298706
3495.8 364298706 364637184 365570679 367326927 368785820 369308243 369880829 371017647 371498833 371527367
3504.5 371527367 371925468 372826309 374051285 374936295 375473137 376170197 377500496 378923454 379761848
3513.2 379761848 380064697 380880432 382085571 382759590 383470497 384221230 385212860 386098747 387231636
3521.9 387231636 388703346 388824806 389257431 390748711 392121048 392786446 393593597 394619827 395527458
3530.6 395527458 396704941 397777786 399375267 400829239 401985435 402459869 402602577 404127655 405534325
$$ packed form
3469.8C46531296M23774J26000N23872J239434N14640K33422P77359P58095Q46710
3478.5C51974602M27742K83165P50961L32871L92990J572265J410065P13310O44875
3487.2C58502846K01530M40598P04574Q31414R12704P57446J055489O57120K34985
3495.8C64298706L38478R33495J756248J458893N22423N72586J136818M81186K8534
3504.5C71527367L98101R00841J224976Q85010N36842O97060J330299J422958Q38394
3513.2C79761848L02849Q15735J205139O74019P10907P50733R91630Q85887J132889
3521.9C87231636J471710J21460M32625J491280J372337O65398Q07151J026230R07631
3530.6C95527458J177483J072845J597481J453972J156196M74434J42708J525078J406670
$$ plain form
3539.2 405534325 407068024 408324966 409101257 409824257 410699196 411988258 412757797 414501724 415873566
3547.9 415873566 417348213 418843575 420063667 421880150 422285500 423899765 425459480 426603928
3555.6 426603928 427962952 428679123 430751266 432469101 433783989 434655876 436343956 437757072 437984734
3564.3 437984734 440842590 442396202 444092751 445480652 445621719 448166351 449616089 451167030
3572 451167030 452820091 454400749 455780029 457348175 459670525 460760498 462524147 464328537 466058197
3580.7 466058197 467774544 469192276 470792465 472607536 476659889 478384933 477367821 479889946
3588.4 479889946 481596336 483739853 485762329 488052444 489497986 491105499 494153900 494542923
3596.1 494542923 497119064 499705658 499946022 502430153 503998566 505074615 507142830 509647865
$$ packed form
3539.2D05534325J533699J256942P76291P23000Q74939J289062P69539J743927J371842
3547.9D15873566J474647J495362J220092J816483M05350J614265J559715J144448
3555.6D26603928J359024P16171K072143J717835J314888Q71887J688080J413116K27662
3564.3D37984734K857856J553612J696549J387901J41067K544632J449738J550941
3572D51167030J653061J580658J379280J568146K322350J089973J763649J804390J729660
3580.7D66058197J716347J417732J600189J815071M052353J725044j017112K522125
3588.4D79889946J706390K143517K022476K290115J445542J607513L048401L89023
3596.1D94542923K576141K586594K40364K484131J568413J076049K068215K505035
$$ plain form
3603.9 509647865 512685051 515109024 517258759 518212891 520858002 521710739 522479477 528050652 529640923
3612.5 529640923 528895378 532191238 533278542 536997795 540227966 540765038 543457794 545401993 546588821
3621.2 546588821 549014282 552269478 554781303 557578316 560443573 562805214 567713318 568835564
3628.9 568835564 563341484 567270355 572255898 577302284 579817696 580017395 582256546 584820023
3636.6 584820023 587519875 589680634 591696320 594600868 597378693 599578781 601738358 604243393
3644.4 604243393 607146835 611433220 612124672 610192833 614075203 615558624 615416794 617371216 622474098
3653 622474098 627015686 630735321 634831009 631149063 633555450 638507118 640303268 642381592 643844986
3661.7 643844986 645842590 647143784 649060669 651784897 653318100 656988678 658981934 657882462
$$ packed form
3603.9E09647865L037186K423973K149735R54132K645111Q52737P68738N571175J590271
3612.5E29640923p45545L295860J087304L719253L230171N37072K692756J944199J186828
3621.2E46588821K425461L255196K511825K797013K865257K361641M908104J122246
3628.9E68835564n494080L928871M985543N046386K515412J99699K239151K563477
3636.6E84820023K699852K160759K015686K904548K777825K200088K159577K505035
3644.4F04243393K903442M286385O91452j931839L882370J483421j41830J954422N102882
3653F22474098M541588L719635M095688l681946K406387M951668J796150K078324J463394
3661.7F43844986J997604J301194J916885K724228J533203L670578J993256j099472
$$ plain form
3669.4 657882462 657834854 655237122 658476791 664814377 671373596 671242294 659143219 662250595 669204941
3678.1 669204941 673301010 672235641 672892532 675099487 676896362 678678436 680115891 680997696 683651657
3686.8 683651657 688901825 683767166 679955597 685180588 682166824 683106384 688062592 689456100
3694.5 689456100 690722961 691018295 690598755 691617584 692120056 694011917 695759735 691715851 691699524
3703.2 691699524 695859528 696905212 696971054 696866837 698559494 701858444 696607971 699426117 702876358
3711.9 702876358 692937546 696920395 700947266 701515579 701805954 703437729 704676361 701916733 703402328
3720.5 703402328 708217468 705806808 702376633 705290604 705936356 705679932 704132538 704271240 706737595
3729.2 706737595 707473755 711269150 708786697 703430099 709844971 709740982 703035812 703873062 707000809
$$ packed form
3669.4F57882462m7608k597732L239669O337586O559219j31302j2099075L107376O954346
3678.1F69204941M096069j065369O56891K206955J796875J782074J437455Q81805K653961
3686.8F83651657N250168n134659l811569N224991l013764R39560M956208J393508
3694.5F89456100J266861K95334m19540J018829N02472J891861J747818m043884j6327
3703.2F91699524M160004J045684O5842j04217J692657L298950n250473K818146L450241
3711.9G02876358r938812L982849M026871N68313K90375J631775J238632k759628J485595
3720.5G03402328M815140k410660l430175K913971O45752k56424j547394J38702K466355
3729.2G06737595P36160L795395k482453n356598O414872j03989o705170Q37250L127747
$$ plain form
3737.9 707000809 708106461 709586411 711887207 708822098 710377350 716834183 705944443 698965759
3745.6 698965759 706935043 710446243 713790665 711566849 704603806 711772842 709200058 706065445
3753.3 706065445 710657654 713647766 716145096 712630157 713753128 717176437 711580276 711416473
3761 711416473 714923401 716035309 715388336 716744385 714891281 712139587 715186386 718057098 717101059
3769.7 717101059 711643295 713667526 716625748 716854019 717605667 717782135 718435974 718609161 719735565
3778.4 719735565 719238892 714455948 716954803 718968811 718949051 719936676 718527374 717872314 718116379
3787.1 718116379 718480911 719256134 719073105 718944397 719042816 719715958 719936371 720668182 722333908 718659286
3796.7 718659286 715796661 717583160 720428162 725688400 722200470 712267151 714825821 718072891
$$ packed form
3737.9G07000809J105652J479950K300796l065109J555252O456833j0889740o978684
3745.6F98965759P969284L511200L344422k223816o963043P169036k572784l134613
3753.3G06065445M592209K990112K497330l514939J122971L423309n596161j63803
3761G11416473L506928J111908o46973J356049j853104k751694L046799K870712r56039
3769.7G17101059n457764K024231K958222K28271P51648J76468O53839J73187J126404
3778.4G19735565m96673m782944K498855K014008j9760R87625j409302o55060K44065
3787.1G18116379L64532P75223j83029j28708R8419O73142K20413P31811J665726l674622
3796.7G18659286k862625J786499K845002N260238l487930r933319K558670L247070
$$ plain form
3804.4 718072891 721754532 724852295 717013321 713913345 717645798 719772720 721094513 721837463
3812.2 721837463 721057892 721356049 725298843 724091873 713636398 717555618 722091675 724635010
3819.9 724635010 724491653 712827072 715317001 718973160 719646530 721324844 721634140 718786240 719112930
3828.6 719112930 721017303 723084030 723538666 717807007 719864197 724729614 719792328 719780807 726511612
3837.2 726511612 720374298 715727844 720804062 718157349 718695984 723796616 722197647 719519043
3844.9 719519043 721631699 722564697 721863632 722563629 722242203 723707962 727271118 722792282 725018768
3853.6 725018768 714485168 714257431 722181854 721764832 720071716 721275940 723077469 724831161
3861.3 724831161 720132980 720028534 724431229 720208893 717719498 721382294 724412689 726736832
$$ packed form
3804.4G18072891L681641L097763p838974l099976L732453K126922J321793P42950
3812.2G21837463p79571K98157L942794j206970j0455475L919220M536057K543335
3819.9G24635010j43357j1664581K489929L656159O73370J678314L09296k847900L26690
3828.6G19112930J904373K066727M54636n731659K057190M865417m937286j1521O730805
3837.2G26511612o137314m646454N076218k646713N38635N100632j598969k678604
3844.9G19519043K112656R32998p01065O99997l21426J465759L563156m478836K226486
3853.6G25018768j0533600k27737P924423m17022j693116J204224J801529J753692
3861.3G24831161m698181j04446M402695m222336k489395L662796L030395K324143
$$ plain form
3869.1 726736832 720850372 715040588 717489090 722019272 724487610 717639160 719143524 722579498
3876.8 722579498 722435760 723733902 725635681 720034332 715632172 720943985 722326965 723720551
3884.5 723720551 727735748 717746506 718561859 721472473 721624680 724972610 723878708 716824417 717789307
3893.2 717789307 721037521 721127167 722097931 722511368 723542862 724665375 717382431 720493317 722389221
3901.8 722389221 718097992 721411362 721159821 720007858 719129791 719183884 721186066 722083511 722420959
3910.5 722420959 721756744 721786880 722202377 720887070 720379486 721906738 720294495 719057693 722635803
3919.2 722635803 722131424 719412766 720962524 721668930 721523514 720014648 718917389 720663605 721524200
3927.9 721524200 721786270 721727676 721455154 722118301 720385437 719404068 720342484 720130997 720540314 721324158
$$ packed form
3869.1G26736832n886460n809784K448502M530182K468338o848450J504364L435974
3876.8G22579498j43738J298142J901779n601349m402160N311813J382980J393586
3884.5G23720551M015197r989242Q15353K910614J52207L347930j093902p054291R64890
3893.2G17789307L248214Q9646R70764M13437J031494J122513p282944L110886J895904
3901.8G22389221m291229L313370k51541j151963q78067N4093K002182Q97445L37448
3910.5G22420959o64215L0136M15497j315307n07584J527252j612243j236802L578110
3919.2G22635803n04379k718658J549758P06406j45416j508866j097259J746216Q60595
3927.9G21524200K62070n8594k72522O63147j732864r81369R38416k11487M09317P83844
$$ plain form
3937.5 721324158 721136780 720802917 720376358 721206512 722073059 718859787 718326950 719891663 720027618
3946.2 720027618 720638199 719376984 719789658 720585632 719512711 721022568 720846558 719878006 719926376
3954.9 719926376 719845200 719700928 719675751 720868149 720375519 720049591 719948502 719274063 719749985 719531784
3964.5 719531784 720216599 720642471 720276489 720395508 719745255 719799652 720584030 720021744 719314041 719595261
3974.2 719595261 719301300 719220734 719188766 719118195 719428558 719540710 719793854 719498215 719058685 718119507
3983.8 718119507 718367767 719459381 719294968 719596252 719347687 719623642 719856415 719552612 720209351
3992.5 720209351 720230026 720422897 719749451 719036255 719573517 720011597 720246811 719961395
4000.2 719961395
$$ packed form
3937.5G21324158j87378l33863m26559Q30154Q66547l213272n32837J564713J35955
3946.2G20027618O10581j261215M12674P95974j072921J509857j76010r68552M8370
3954.9G19926376q1176j44272k5177J192398m92630l25928j01089o74439M75922k18201
3964.5G19531784O84815M25872l65982J19019o50253N4397P84378n62286p07703K81220
3974.2G19595261k93961q0566l1968p0571L10363J12152K53144k95639m39530r39178
3983.8G18119507K48260J091614j64413L01284k48565K75955K32773l03803O56739
3992.5G20209351K0675J92871o73446p13196N37262M38080K35214k85416
4000.2G19961395
##END=$$ End of the data block
