##TITLE=$$ Begin of the data block
##JCAMP-DX=5.00 $$ ACD/SpecManager v 10.08
##SPECTROMETER/DATA SYSTEM=Varian
##DATE=15 Jan 2013 15:07:26
##DATA TYPE=INFRARED SPECTRUM
##DATA CLASS=XYDATA
##ORIGIN=
##OWNER=
##NPOINTS=3735
##FIRSTX=399.26403809
##LASTX=4000.35498047
##MAXX=4000.35498047
##MINX=399.26403809
##MAXY=76.26197815
##MINY=37.93500519
##XFACTOR=1.0000000000
##YFACTOR=0.000000100000000
##FIRSTY=59.65465546
##DELTAX=0.96440572
##XUNITS=1/CM
##YUNITS=TRANSMITTANCE
##XYDATA=(X++(Y..Y))
399.3E96546555j5202904j2652931R59816l240319L925705Q055229q630371r949073
$$ 596546555 581343651 568690720 569650536 566410217 570335922 578391151 569760780 559811707
407E59811707N653991R449997l815269n040589J789856n767364n210533L891868J329880
$$ 559811707 565465698 574915695 571100426 566059837 567849693 562082329 556871796 560763664 562093544
415.7E62093544j931953k679406M30298J260720K386474L674774l490905k211342M289550
$$ 562093544 560161591 557482185 557912483 559173203 561559677 565234451 561743546 559532204 563821754
424.3E63821754K575951l193893o350251m8256J922722N437508N893784m732705l052635
$$ 563821754 566397705 563203812 556853561 556805305 558728027 564165535 570059319 565326614 562273979
433E62273979N32150M727402O377449p074547n783615M331513l02506m026603J309394
$$ 562273979 562806129 567533531 573910980 566836433 561052818 565384331 565081825 561055222 562364616
441.7E62364616L150902J591110k68173N66941n74227o307831k702827P41234K455139
$$ 562364616 565515518 567106628 566838455 567405396 566831169 560523338 557820511 558561745 561016884
450.4E61016884K873077o81343l264732Q47206M589729j02882m285050m499511o48117
$$ 561016884 563889961 563208618 559943886 560791092 565380821 565277939 560992889 556493378 555845261
459.1E55845261L145752K629280k457047k170486K621078M194184J642303m194527
$$ 555845261 558991013 561620293 559163246 556992760 559613838 563808022 565450325 561255798
466.8E61255798p026825m607849n84488M917565N310173j76506n539131J24626J986046
$$ 561255798 554228973 549621124 549036636 553954201 559264374 559087868 553548737 553673363 555659409
475.5E55659409l427887j878548Q34885K71530L65677J80931k172432k403603K874069
$$ 555659409 552231522 550352974 551187859 551459389 551825066 552005997 549833565 547429962 550304031
484.1E50304031K729836l128J48887j000785k328873J712189M152336j415215k146148
$$ 550304031 553033867 553030739 553179626 552178841 549849968 551562157 555714493 554299278 552153130
492.8E52153130j805382k735672O63299L568154K766037l049279m746208k237701J108971
$$ 552153130 550347748 547612076 548275375 551843529 554609566 551560287 546814079 544576378 545685349
501.5E45685349M051818j496963j689491J984787J794776k02865l299675k062988j72120
$$ 545685349 549737167 548240204 546550713 548535500 550330276 550127411 546827736 544764748 544592628
510.2E44592628j057167p3700J935044K489662j518402k572746K209701J180420j084595
$$ 544592628 543535461 543461761 545396805 547886467 546368065 543795319 546005020 547185440 546100845
518.9E46100845k663307k188415J15471j592865J419487M229125J349373n49507j850700
$$ 546100845 543437538 541249123 541364594 539771729 541191216 545420341 546769714 546220207 544369507
527.5E44369507j030159J197815m1275j052323r53560j745185K28271P75719k012215
$$ 544369507 543339348 544537163 544495888 543443565 542490005 540744820 540973091 541748810 539736595
536.2E39736595j125603K245980J639099j495857p88346K30713o96373j054649o97746
$$ 539736595 538610992 540856972 542496071 541000214 540211868 540442581 539746208 538691559 537993813
544.9E37993813m2801j422806o84662J097603J636047K065659n3330k149582k569122
$$ 537993813 537951012 536528206 535843544 536941147 538577194 540642853 540589523 538439941 535870819
553.6E35870819k336388j784439O42624K908097J439628r79233L27759O17981k350769
$$ 535870819 533534431 531749992 532392616 535300713 536740341 535761108 536088867 536706848 534356079
562.3E34356079j03760J276932j290131j013031N72205J129875o18896R5024k78320
$$ 534356079 534252319 535529251 534239120 533226089 533798294 534928169 534309273 534404297 534125977
570.9E34125977j255837N0201o40296p0458l59001Q30688P5684j973724O09665N40618
$$ 534125977 532870140 532920341 532280045 532209587 531850586 532681274 532756958 530783234 531392899 531933517
580.6E31933517J351700J205788p00989p2594n64231l18718j37444K89040N47371J84097
$$ 531933517 533285217 534491005 533790016 533717422 533153191 532834473 532697029 532986069 533533440 533717537
590.2E33717537N63278K35329N35850J212731R47685m57954j39847K57950j078453
$$ 533717537 534280815 534516144 535051994 536264725 537212410 536754456 536614609 536872559 535794106
598.9E35794106n82161L67164J186028J825371J009750j081391k103118r29337q55598
$$ 535794106 535211945 535579109 536765137 538590508 539600258 538518867 536415749 535486412 534630814
607.6E34630814m65393k823j87645J482887J859741o83784k131920n32189J611634
$$ 534630814 534165421 534162598 533974953 535457840 537317581 536633797 534501877 533969688 535581322
616.3E35581322L29170j663895j010017k57759J456032J324768o50902K00348J032715
$$ 535581322 535910492 534246597 533236580 532978821 534434853 535759621 535108719 535309067 536341782
624.9E36341782J496048P94372j90124N66253K85607O45790J464271Q60825N69725
$$ 536341782 537837830 538632202 538442078 539008331 539293938 539939728 541403999 542264824 542834549
633.6E42834549K098656K140884Q5793J443061J513024J17187N98259l94172K17475
$$ 542834549 544933205 547074089 547159882 548602943 550115967 550233154 550831413 550437241 550654716
642.3E50654716J816063J726838N47714K40516J743889J366730k80380l40004J10626
$$ 550654716 552470779 554197617 554745331 554985847 556729736 558096466 557816086 557476082 557586708
651E57586708n04417P73277J658821J5411N48516J083717L31421l22952l29933K20565
$$ 557586708 557082291 557855568 559514389 559529800 560078316 561162033 561493454 561170502 560840569 561061134
660.6E61061134j91612j085014j640129j75171J861191K492675K371903j645470n43823
$$ 561061134 560869522 559784508 558144379 557969208 559830399 562323074 564694977 563049507 562505684
669.3E62505684J226425m52118j193275N12237J055222Q77304J171379Q13789N30739
$$ 562505684 563732109 563279991 562086716 562598953 563654175 564531479 565702858 566516647 567047386
678E67047386M41475P69882Q46024R20296J24588m60206Q05283J425819Q61969j63230
$$ 567047386 567488861 568258743 569104767 570025063 570149651 569689445 570494728 571920547 572782516 572619286
687.6E72619286L46756J910743K415581M62990j048012j5945l45917j4000R155J97487
$$ 572619286 572966042 574876785 577292366 577755356 576707344 576691399 576345482 576331482 576340637 576538124
697.3E76538124J367416P71904R00307R41544J174164K67105n50766K02217o49P14913
$$ 576538124 577905540 578677444 579577751 580519295 581693459 581960564 581409798 581612015 581611366 582326279
706.9E82326279Q69789P79800K08359L04298J432038Q01429M97323L8414k72332r97963
$$ 582326279 583196068 583975868 584184227 584488525 585920563 586721992 587219315 587257729 586985397 585987434
716.6E85987434p05757Q07762J261940J096535J39771J538047J833153L48396J23520
$$ 585987434 585281677 586089439 587351379 588447914 588587685 590125732 591958885 592307281 592430801
725.2E92430801K03095N15556J42212N49622k98882l65906J440506J863556J425934
$$ 592430801 592633896 593149452 593291664 593841286 593542404 593176498 594617004 596480560 597906494
733.9E97906494L22952J241761J102333r60083j170273o2637m07334j098785J173515
$$ 597906494 598229446 599471207 600573540 599613457 598443184 598380547 597973213 596874428 598047943
742.6E98047943J286163O71502K027549J492806J08795l99208J44768l60070p28721
$$ 598047943 599334106 600005608 602033157 603525963 603634758 603235550 603380318 603020248 602291527
751.3F02291527M30794R67636R47456J488190J173324K79236N13573Q08868J439209
$$ 602291527 602722321 603689957 604637413 606125603 607298927 607578163 608091736 608900604 610339813
760F10339813K82173l19023Q90351n28260o63032J248512J344299L01438O86226P85713
$$ 610339813 610621986 610302963 611193314 610665054 610002022 611250534 612594833 612896271 613582497 614368210
769.6F14368210K62031K51389r58405j054077q83941q049J124496N2643o561J122436
$$ 614368210 614630241 614881630 613923225 612869148 611985207 611977158 613101654 613154297 613147736 614270172
779.2F14270172J641693L38593o95572j18256J48087p4539M14543P55577l3074L54004
$$ 614270172 615911865 616250458 615554886 615436630 615584717 615510178 615924721 616680298 616647224 617001228
788.9F17001228P19529J025085K11601r24225K95639m0321j058502j402741r29756
$$ 617001228 617720757 618745842 618957443 618033218 618328857 618288536 617230034 615827293 614897537
797.6F14897537k47268J12495R0523o88935o13861j193199j421165j317978q10776
$$ 614897537 614650269 614762764 614853287 614164352 613550491 612357292 610936127 609618149 608807373
806.2F08807373o61240j486282p80525o49147o74820j129456r15680n33523j618080
$$ 608807373 608146133 606659851 605879326 605230179 604555359 603425903 602510223 601976700 600358620
814.9F00358620j151848j116486j437034j581917q50601P00416J117668R41506m120
$$ 600358620 599206772 598090286 596653252 595071335 594220734 594921150 596038818 596980324 596976204
823.6E96976204R61571J558494K26174O98623J641884K225418K503968K157096K100983
$$ 596976204 597937775 599496269 599722443 600421066 602062950 604288368 606792336 608949432 611050415
832.3F11050415K420120J735688J365890J394615J502495K308426J708908Q72879K57950
$$ 611050415 613470535 615206223 616572113 617966728 619469223 621777649 623486557 624359436 624617386
841F24617386J193848K339744J893196J175194P45583J392326P46155P25784k24304
$$ 624617386 625811234 628150978 630044174 631219368 631964951 633357277 634103432 634829216 634604912
849.6F34604912m10423J929702J381493J340332J905937J783753J514511J433944P05567
$$ 634604912 634194489 636124191 637505684 638846016 640751953 642535706 644050217 645484161 646189728
858.3F46189728P3700M39224l74374N93872J96075N97992J316376K33612J159668J89438
$$ 646189728 646263428 646702652 646328278 646922150 647118225 647716217 649032593 649266205 650425873 650615311
868F50615311n2262o86950j586838k162171k480468k42539K74964K93350j76621k01416
$$ 650615311 650563049 649876099 648289261 646127090 643646622 643404083 643679047 643972397 643795776 643594360
877.6F43594360k39105L70941Q47779r66568m37699r23767j428833j648750m99153
$$ 643594360 643355255 643726196 644573975 643607407 643169708 642245941 640817108 639168358 638669205
886.3F38669205J626968O37131O63681m83551o94275k60010j021309m68292n7144L16696
$$ 638669205 640296173 640933304 641596985 641113434 640419159 640159149 639137840 638669548 638612404 638929100
895.9F38929100k20184Q13408J517868J429367J209411o21719n96695K00577K78778
$$ 638929100 638708916 639522324 641040192 642469559 643678970 643057251 642460556 642661133 642939911
904.6F42939911r35669k75497J728668J884002J858521J257858M77829k20413k94571
$$ 642939911 642004242 641728745 643457413 645341415 647199936 648457794 648935623 648715210 648420639
913.3F48420639j154709j766052j960297k147064j186752j356888j292038o81076n25627
$$ 648420639 647265930 645499878 643539581 641392517 640205765 638848877 637556839 636875763 636350136
922F36350136j811371j703720j164093l554230m034538l202477k047882k183380k551269
$$ 636350136 634538765 632835045 631670952 628116722 624082184 620879707 618831825 616648445 614097176
930.7F14097176r19953j51100M90952P782o59676l79448m98466j168099j748238j115608
$$ 614097176 613177223 613026123 613517075 613524857 612865181 612485733 611987267 610819168 609070930 607955322
940.3F07955322o76002J7547O65284R29260N04455k84805j20811n79682j318359j514473
$$ 607955322 607279320 607296867 607962151 608891411 609395866 609111061 608990250 608410568 607092209 605577736
949.9F05577736j070061j058540m47312j05247o52771j46828j105499j524048j227264
$$ 605577736 604507675 603449135 603001823 602896576 602243805 602096977 600991478 599467430 598240166
958.6E98240166j613159j748124k296905k223778j780586r88960j098137j193314m25720
$$ 598240166 596627007 594878883 592581978 590358200 588577614 587588654 586490517 585297203 584871483
967.3E84871483o85768j195450j698494k224045k550087k340889k307052j574517j148262
$$ 584871483 584185715 582990265 581291771 579067726 576517639 574176750 571869698 570295181 569146919
976E69146919k087898j547737j618691k167778k292328l925590m295883k898445k967835
$$ 569146919 567059021 565511284 563892593 561724815 559432487 555506897 551211014 548312569 545344734
984.7E45344734l660660l028831k725868l195305l194351k693558k369385l250503
$$ 545344734 541684074 538655243 535929375 532734070 529539719 526846161 524476776 521226273
992.4E21226273m260102l723449l352356k849808k166023k782135k906914k292328
$$ 521226273 516966171 513242722 509890366 507040558 504874535 502092400 499185486 496893158
1000.1D96893158j599770j984748k190896j789741j352844p02591j468964j585693
$$ 496893158 495293388 493308640 491117744 489328003 487975159 487272568 485803604 484217911
1007.8D84217911j355782o25419j49956p87544o77109j140442j524277k214775j883163
$$ 484217911 482862129 482236710 482086754 481299210 480622101 479481659 477957382 475742607 473859444
1016.5D73859444j365471k016983k320061k674637j479568j231156j913986k154541
$$ 473859444 472493973 470476990 468156929 465482292 464002724 462771568 460857582 458703041
1024.2D58703041j872063j415100j633339j377983j441917o76994q64716m44527l87687
$$ 458703041 456830978 455415878 453782539 452404556 450962639 450285645 449420929 448976402 448588715
1032.9D48588715j418076L8033O27098R54208M79927O5804J60026N44701P23266L78457
$$ 448588715 447170639 447208672 447835770 448789978 449269905 449335709 449495735 450040436 450763702 451142159
1042.5D51142159J420402N03845J19629p04269o40869J11198r79195l21350j149292
$$ 451142159 452562561 453066406 453186035 452481766 451840897 451952095 450972900 450651550 449502258
1051.2D49502258m5929J29738j090164J12610L55377J91956n93605J018715N60493
$$ 449502258 449456329 449586067 448495903 448608513 448963890 449155846 448562241 449580956 450141449
1059.9D50141449k34642J134415J557731K460976K136612K626915J784744J430740
$$ 450141449 449906807 451041222 452598953 455059929 457196541 459823456 461608200 463038940
1067.6D63038940J494027J021499J156883L73688J153832K67296L2196P16934J399765
$$ 463038940 464532967 465554466 466711349 467085037 468238869 468506165 468538361 469255295 470655060
1076.3D70655060J302566o18209Q21571J056976P50046P41081J14060O59561J051292
$$ 470655060 471957626 471339417 472160988 473217964 473968010 474709091 474823151 475482712 476534004
1085D76534004J359062N46990J154823J945381K113533J416664Q32482J165008L31726
$$ 476534004 477893066 478440056 479594879 481540260 483653793 485070457 485902939 487067947 487399673
1093.6D87399673O91300L83415J061363K170754J608505J498795R71946J269837J359672
$$ 487399673 488090973 488474388 489535751 491706505 493315010 494813805 495785751 497055588 498415260
1102.3D98415260J451226J609497J088104J16920K12746J487465O26717N65986R34181
$$ 498415260 499866486 501475983 502564087 502681007 502893753 504381218 505007935 505573921 506508102
1111E06508102P15218J112289M95453m77028j208076J8463J026955p5569l54042N30090
$$ 506508102 507223320 508335609 508831062 508354034 507145958 507164421 508191376 508115807 507761765 508291855
1120.6E08291855R85794K26326o37322m65812K8190q3427Q94928R96590L32679J560212
$$ 508291855 509277649 509503975 508866653 508400841 508429031 508345604 509240532 510237122 510569801 512130013
1130.3E12130013J903572J879654J921424J743622J019898K51312M30145O48232J668663
$$ 512130013 514033585 515913239 517834663 519578285 520598183 520849495 521279640 521927872 523596535
1139E23596535J960907J154403Q14934J111374R92203N75218J014710Q19129L12539
$$ 523596535 525557442 526711845 527526779 528638153 529630356 530205574 531220284 532039413 532351952
1147.6E32351952l20206o04858J59950L43323J40609j92604L74794M74282n89219m15687
$$ 532351952 532031746 531426888 531586838 531930161 532070770 531878166 532252960 532727242 532138023 531722336
1157.3E31722336m70925p07283n33943m28314j56059l85628j02234R66034J423340
$$ 531722336 531251411 530544128 530010185 529581871 529425812 529040184 528937950 529903984 531327324
1166E31327324J341247J024628O62804O68335Q81881J710167J668511R33685J614609
$$ 531327324 532668571 533693199 534356003 535024338 535906219 537616386 539284897 540218582 541833191
1174.6E41833191K246857J882629J842728J901436J319427R86557N27954P00607J600380
$$ 541833191 544080048 545962677 547805405 549706841 551026268 552012825 552540779 553241386 554841766
1183.3E54841766J258355O51435P96624P06558L79028M72450J60065k65388L4370o5002
$$ 554841766 556100121 556751556 557548180 558254738 558633766 559106216 559266281 559000893 559035263 558970261
1193E58970261q29316o59942l29895j032791j164704n53665m56047p47223p11021r79347
$$ 558970261 558140945 557481003 557151108 556118317 554953613 554399948 553943901 553196678 552485657 551506310
1202.6E51506310j194649p45163n49622p69920q08067o61812m73519J03531k17247
$$ 551506310 550311661 549566498 549016876 548246956 547438889 546777077 546303558 546407089 546189842
1211.3E46189842n00641J11237j5564j45111l29361m1351L89366j3962K84424K64168
$$ 546189842 545689201 545800438 545784874 545639763 545310402 545269051 545658417 545644455 545928879 546193047
1220.9E46193047n532n226m43535p9918J38092n40733j043167r84001k50168J20125
$$ 546193047 546187515 546182289 545738754 545658836 545796928 545256195 544213028 543229027 542978859 543098984
1230.6E43098984m44222m92744n8556m42619q12798o72416o13022k57378k21863l67660
$$ 543098984 542654762 542162018 542103462 541660843 540848045 540175629 539562607 539305229 539083366 538715706
1240.2E38715706J4381k17628l04795l42063o54869l05291o30645q90007l26615j35002
$$ 538715706 538730087 538512459 538207664 537865601 537210732 536905441 536274796 535384789 535058174 534923172
1249.9E34923172k07214j93215j51634k73056j98479L40195L79524l78456m18014k05079
$$ 534923172 534715958 534522743 534371109 534098053 533899574 534239769 534619293 534240837 533822823 533617744
1259.5E33617744k03781m9019K6513N87425O24962K37961J29394L66707N92155N95398
$$ 533617744 533413963 533364944 533391457 533978882 534603844 534841805 534971199 535337906 535930061 536525459
1269.2E36525459N59235K58293P23839P96890P00951R67026P35893N71441N14946J251374
$$ 536525459 537084694 537342987 538066826 538863716 539564667 540531693 541267586 541839027 542353973 543605347
1278.8E43605347J231384M69208O90231J200333J367454J029740J002082J076241J101646
$$ 543605347 544836731 545305939 545996170 547196503 548563957 549593697 550595779 551672020 552773666
1287.5E52773666J235886J277466J081886P16133O01654N55153P53365R17091O54640
$$ 552773666 554009552 555287018 556368904 557085037 557686691 558241844 558995209 559912300 560566940
1296.2E60566940P23687R15374M26789L18336N44357K40174K97165L56483n9662M6845
$$ 560566940 561290627 562206001 562632790 562951126 563495483 563735657 564032822 564389305 564329643 564376488
1305.8E64376488j53l69835K6779P1793J4458j26114l15895j12152m84772O9694J11084
$$ 564376488 564376335 564006500 564033279 564105072 564119530 563993416 563677521 563565369 563080597 563150291 563261375
1316.4E63261375n05142L46832Q59566P56226P95212Q13713L62663J92947M10347K00997
$$ 563261375 562756233 563103065 563962631 564718857 565514069 566327782 566690445 566883392 567293739 567494736
1326E67494736K12593J25427N4932j49231k33498j0719K86064K60353j95427m3487
$$ 567494736 567707329 567832756 567887688 567738457 567504959 567494240 567780304 568040657 567845230 567801743
1335.7E67801743k53678l34930k3155j58272l33290K70042Q52966L76015K80571J92833
$$ 567801743 567548065 567213135 567189980 567031708 566698418 566968460 567821426 568197441 568478012 568670845
1345.3E68670845J48392K77672j19477J43204Q2626K7199j24206o7177J21078k86522
$$ 568670845 568819237 569096909 568977432 569120636 569203262 569230461 569106255 569039078 569160156 568873634
1355E68873634k92625L9406L29513o24962m73060k72827q15583q25958j447906O47163
$$ 568873634 568581009 568620415 568949928 568324966 567851906 567579079 566763496 565937538 564489632 565136795
1364.6E65136795N16701k38648M9095o07452l75900j27831l02276l30925p6981p64694
$$ 565136795 565653496 565414848 565463943 564856491 564480591 564352760 564050484 563719559 563642578 562877884
1374.3E62877884j211891R7732J93405r8228o7368K45057l77121p35245j091080j739006
$$ 562877884 561665993 561763725 561957130 561858902 561791534 562036591 561659470 560924225 559833145 558094139
1383.9E58094139j191063m28123j10321k126541r49059M00925n02434q96416q54416
$$ 558094139 556903076 556474953 556364632 554238091 553289032 553689957 553187523 552291107 551436691
1392.6E51436691l13568j755867k653465j260758j361923j232452k466240r23805J32064
$$ 551436691 551123123 549367256 546713791 545453033 544091110 542858658 540392418 539468613 539600677
1401.3E39600677n13877p56684j128502k069511j236382m27284j250725j367530j240120
$$ 539600677 539086800 538330116 537201614 535132103 533895721 533468437 532217712 530850182 529610062
1409.9E29610062j124611o30036l62892j80588l85971l49540p78046m91486N83840
$$ 529610062 528485451 527855415 527492523 527311935 526925964 526576424 525798378 525306892 525890732
1418.6E25890732k828407k24190J628799M66461j8501p3395J475296J343994J63956
$$ 525890732 523062325 522838135 524466934 524933395 524914894 524841499 526316795 527660789 527824745
1427.3E27824745K45438j1788l14598J64185J072731P60155M96177J470223J099319
$$ 527824745 528070183 528058395 527743797 527907982 528980713 529740868 530237045 531707268 532806587
1436E32806587o1950R10720J648980N50766J28822P62329M00505M92325L91312J120491
$$ 532806587 532744637 533655357 535304337 535855103 535983925 536746254 537146759 537639084 538030396 539150887
1445.6E39150887J134262P2898k93006R97200J325111Q2397O0082L58543Q85964Q88481
$$ 539150887 540285149 540358047 540065041 541062241 542387352 542469749 542529831 542888374 543774338 544662819
1455.3E44662819j50719n29976M01574K733230J345024J220818O70433Q24585J608352
$$ 544662819 544512100 543982124 544383698 547116928 548461952 549682770 550353203 551177788 552786140
1464E52786140m33464R22814J686401K064018J861687J702042K697525K108879P02896
$$ 552786140 552352676 553275490 554961891 557025909 558887596 560589638 563287163 565396042 566098938
1472.6E66098938K46582K816238L102341R25522P92732J779785J954537J863403J348572
$$ 566098938 566345520 569161758 572264099 573189621 573982353 575762138 577716675 579580078 580928650
1481.3E80928650J225471J485711J427307J025352Q00209k30446j32789J772957j36414
$$ 580928650 582154121 583639832 585067139 586092491 586892700 586662254 586529465 588302422 588166008
1490E88166008r88464R29069O69136m89616q45680j296845n521850J081275o50672
$$ 588166008 587177544 588106613 588775749 588286133 587440453 586143608 580621758 581703033 581052361
1498.7E81052361l085137P24144m86870j036453p44743Q56590P79800n378952m731750
$$ 581052361 577967224 578691368 578204498 577168045 576423302 577279892 578059692 572680740 567948990
1507.3E67948990O16379J491775m18968J371193m46053j181335R75647o87447k68326
$$ 567948990 568565369 570057144 569638176 571009369 570563316 569381981 570357628 569670181 569401855
1516E69401855k209587k616653K173805J542168j757202l539048R55697K224044K601471
$$ 569401855 567192268 564575615 566749420 568291588 566534386 562995338 563951035 566175079 568776550
1524.7E68776550j6746k67563J031570j03607N89485J110726J009025R17054l02620
$$ 568776550 568759804 568492241 569523811 569420204 570009689 571120415 572129440 573046494 572743874
1533.4E72743874j180344K094994J423149J314048K445298k433319m931412L494911
$$ 572743874 571563530 573658524 575081673 576395721 578841019 576407700 571476288 574971199
1541.1E74971199J256409o51474J878929P18536j189537K089806J183510J081657k59438
$$ 574971199 576227608 575576134 577455063 578173599 576984062 579073868 580257378 581339035 581079597
1549.8E81079597j215744J463318Q12302Q04520k567978M15840K841415K606201j007690
$$ 581079597 579863853 581327171 582139473 582943993 580376015 580791855 583633270 586239471 585231781
1558.5E85231781j0293579Q69064J662674J535950N836m46739k697258k500191k85606
$$ 585231781 574938202 575807266 577469940 579005890 579011726 578564987 575867729 573367538 573081932
1567.1E73081932n91469l2577o407242p67784n04685k211151j651306j866798q95615
$$ 573081932 572490463 572457886 566050644 565282860 564778175 562567024 560915718 559048920 558153305
1575.8E58153305r718361n28450j112556k346917k347297l540917k104873m133911
$$ 558153305 548434944 547906494 546793938 544447021 542099724 538558807 536453934 532320023
1583.5E32320023k955742l878899l248520l011856l756866k256890m192848k103538
$$ 532320023 529364281 525485382 522236862 519225006 515468140 513211250 509018402 506914864
1591.2E06914864l731347k613563l100586m037323k198372m278870k006721l605614
$$ 506914864 503183517 500569954 497469368 493432045 491233673 486954803 484948082 481342468
1599D81342468k260895k512321k241516j588974l557320j256141l075333j445847k645721
$$ 481342468 479081573 476569252 474327736 472738762 469181442 467925301 464849968 463404121 460758400
1607.6D60758400j496735j686897k773361Q2855k445717l45192j596412N01403J77956
$$ 460758400 459261665 457574768 454801407 454884262 452438545 452093353 450496941 450998344 451176300
1616.3D51176300o417046J408310j043892N67284j298218J214791M47387k418518J469574
$$ 451176300 444759254 446167564 445123672 445690956 444392738 445607529 446054916 443636398 445105972
1625D45105972j74102J781539j281585P01217Q34351Q95882J438713J8310K223473
$$ 445105972 444931870 446713409 445431824 446133041 446967392 447863274 449301987 449320297 451543770
1633.7D51543770L24898o92025N73082L063393J385879J084290K000542R7046J825866
$$ 451543770 451868668 451176643 451749725 454813118 456198997 457283287 459283829 459380875 461206741
1642.4D61206741J62430J656571J315994j597977J700478l39470L325729J295662K580872
$$ 461206741 461369171 463025742 464341736 462743759 464444237 464104767 467430496 468726158 471307030
1651D71307030K595978j981659o200715J314278M196091J292457J541367R15070J383895
$$ 471307030 473903008 471921349 465720634 467034912 471231003 472523460 474064827 474979897 476363792
1659.7D76363792J548844J399269J524391q19969K755661J729011K138520K042923
$$ 476363792 477912636 479311905 480836296 480016327 482771988 484500999 486639519 488682442
1667.4D88682442J568718J674614R95979M155350J607856L188439L599243K362137
$$ 488682442 490251160 491925774 492921753 497077103 498684959 501873398 505472641 507834778
1675.1E07834778O41632K393684L928757K552109L353119K205162M060135M510421
$$ 507834778 508476410 510870094 514798851 517350960 520704079 522909241 526969376 531479797
1682.9E31479797l90968J975784L264275N496254L565483L141556L671646K826157
$$ 531479797 531088829 533064613 536328888 541825142 545390625 548532181 552203827 555029984
1690.6E55029984M032516L610458L765564L966103L520012J4343M722862N405312N518188
$$ 555029984 559062500 562672958 566438522 570404625 573924637 573938980 578661842 584067154 589585342
1699.3E89585342L568459l407669O524315M446258K902527K277985L076362K629166
$$ 589585342 593153801 589746132 596270447 600716705 603619232 605897217 608973579 611602745
1707F11602745K338333L549004K396774J485291J596412K123337K831230N75600K14805
$$ 611602745 613941078 617490082 619886856 621372147 622968559 625091896 627923126 628498726 628713531
1715.6F28713531L243790J290856l537445M169731L481331J987342J514664P91397
$$ 628713531 631957321 633248177 629710732 633880463 637361794 639349136 640863800 641655197
1723.4F41655197N80063J279144J567154O32477J118469K434387K87476J71814L274384
$$ 641655197 642235260 643514404 645081558 645714035 646832504 649266891 649554367 649726181 653000565
1732F53000565L566742j529160m896851M026413L554764J506272K195663O49643r33228
$$ 653000565 656567307 655038147 650141296 654167709 657722473 659228745 661424408 662074051 661140823
1740.7F61140823L493271K534333j58997J084213K931214K457656J585312J318360
$$ 661140823 664634094 667168427 667009430 668093643 671024857 673482513 675067825 676386185
1748.4F76386185J573486L976746Q33511N05066M037247K695160K887954K463379p11059
$$ 676386185 677959671 681936417 682769928 683274994 687312241 690007401 692895355 695358734 694647675
1757.1F94647675J345520K470245J988983K842865l00293j53885L018723J757583R52835
$$ 694647675 695993195 698463440 700452423 703295288 702994995 702841110 705859833 707617416 708570251
1765.8G08570251J384583J202393j587372K230987L911057J91803k272721j046371
$$ 708570251 709954834 711157227 709569855 711800842 715711899 715903702 713630981 712584610
1773.5G12584610M169693K266922j186066J453095J084060J378022L74603n87845J055832
$$ 712584610 716754303 719021225 717835159 719288254 720372314 721750336 722124939 721537094 722592926
1782.2G22592926J822662J691971j103210m22211J529846R46732P24335J739959Q05435
$$ 722592926 724415588 726107559 725004349 724582138 726111984 727058716 727783051 729523010 730328445
1790.9G30328445K59476j493683q44726L210983J086578n29480J036148J416169r9182
$$ 730328445 730587921 729094238 728249512 731460495 732547073 732017593 733053741 734469910 734370728
1799.5G34370728j145630J861190J3199N15595J545944K39868Q74100M85229j55181
$$ 734370728 733225098 735086288 735099487 735615082 737161026 737400894 738274994 738760223 738605042
1808.2G38605042M07333J080093n96008M18472J309281M61578Q30994m1046O18286
$$ 738605042 739012375 740092468 739496460 739914932 741224213 741685791 742516785 742475739 743094025
1816.9G43094025K77328L59574L73306l38745P94983j96763J040879R95331k540436
$$ 743094025 743371353 743730927 744104233 743765488 744560471 744363708 745404587 746399918 743859482
1825.6G43859482M58298K372589K194824J90964l846054N36804K493515L73611O6452
$$ 743859482 744317780 746690369 748885193 749076157 745230103 745766907 748260422 748634033 748700485
1834.3G48700485K12555N97534M40140o37054J143951N58319l3722n2261J525268P85447
$$ 748700485 748913040 749510574 749950714 749313660 750457611 751015930 750982208 750929947 752455215 753240662
1843.9G53240662n537644K036133K584457N27573J61896L79410P84149j6022K78702
$$ 753240662 747703018 749739151 752323608 752851181 753013077 753392487 754176636 754160614 754439316
1852.6G54439316m03900m5090q7967r5215O30036N9127M96445P8507M88815L4408r1934
$$ 754439316 754035416 753990326 753902359 753807144 754437180 754496307 754992752 755071259 755560074 755594482 755502548
1863.2G55502548L80326K5711M68902k45514O38275q08029j169967J397781R62753
$$ 755502548 755882874 755908585 756377487 756131973 756770248 755962219 754792252 756190033 757152786
1871.9G57152786N47409L2883J8234k99988K00501R2926k37579O7215P8277O63605
$$ 757152786 757700195 757733078 757751312 757451324 757651825 757744751 757507172 757574387 757652664 758316269
1881.5G58316269m6463M59671J43967l89023L1433L4027J309814m55017j909027O05850
$$ 758316269 758269806 758729477 758873444 758484421 758515854 758549881 759859695 759404678 757495651 758101501
1891.2G58101501R86023L42484P30743K66190j122360K05230K32773J33820j80741
$$ 758101501 759087524 759430008 760160751 760426941 759304581 759509811 759742584 759876404 759695663
1899.8G59695663o17523p1563K43454Q47396L2120K19727K78930j26495J40305o5079
$$ 759695663 759078140 759006577 759250031 760097427 760129547 760349274 760628204 760501709 760642014 760576935
1909.5G60576935l93372l63540M72717k84729N41153N69916K12860J287841j870956
$$ 760576935 760183563 759820023 760292740 760008011 760549164 761119080 761331940 762619781 760748825
1918.2G60748825r95331O51093L77273O53763j320877q16040R76410R69696J37405
$$ 760748825 759753494 760404587 760781860 761435623 760114746 759298706 760275116 761244812 761382217
1926.8G61382217K02256j18866k75574j16196m21066j19095l45001N15747L70483O1798
$$ 761382217 761584473 761465607 761190033 761073837 760652771 760533676 760188675 760704422 761074905 761136703
1936.5G61136703J39313j60522L81851Q163O96564r03549k448044O49414Q82950J39999
$$ 761136703 761276016 761115494 761497345 761505508 762202072 761298523 758850479 759499893 760382843 760522842
1946.1G60522842O1951L06091j84936j32065n569j03531j78452k41699J09711n25055
$$ 760522842 760584793 760890884 760705948 760573883 760568314 760464783 760286331 760044632 760154343 759629288
1955.8G59629288J18866K56805K24533N06211k46735k06757n05905j70669m52958j13754
$$ 759629288 759748154 760004959 760229492 760735703 760488968 760282211 759776306 759605637 759152679 759038925
1965.4G59038925O64292n33371k99607L20816K80152p0420J61438L0442l51487n0048
$$ 759038925 759703217 759169846 758870239 759191055 759471207 759400787 759562225 759592667 759241180 759191132
1975.1G59191132j81580j37100l41034J05438J95541K92054M29382R7961K75116o84661
$$ 759191132 759009552 758872452 758531418 758636856 758832397 759124451 759553833 759651794 759926910 759242249
1984.7G59242249p21207j38779L4027l80249l74832Q07037K65732o55746k31934O68488
$$ 759242249 758521042 758382263 758416290 758036041 757661209 758468246 758733978 758078232 757846298 758514786
1994.3G58514786K04239l86582m81109q74024r2392q7967J03607J37101J95160N72204
$$ 758514786 758719025 758332443 757851334 756977310 756884918 756796951 756900558 757037659 757232819 757805023
2004G57805023j68381l00445n54810l10211k41623l63693r5673j33285R3307K43149
$$ 757805023 757636642 757336197 756781387 756471176 756229553 755865860 755770187 755636902 755730209 755973358
2013.6G55973358M72565M9362n6915l28903l60795k81295o03943j43585m18778Q3618
$$ 755973358 756445923 756495285 756438370 756109467 755748672 755467377 754863434 754719849 754301071 754384689
2023.3G54384689K96707L21274O27976J46637J01318o26526o81610p95593n09720j29089
$$ 754384689 754681396 755002670 755630646 755777283 755878601 755252075 754570465 753774872 753265152 753136063
2032.9G53136063l75901K83356L54614Q60596O40183j16272m00391n58243n93796o78177
$$ 753136063 752760162 753043518 753398132 754258728 754898911 754782639 754382248 753824005 753230209 752552032
2042.6G52552032j69982k41623L63998K95792J6403J08566j99890L47214L5934J14136
$$ 752552032 752382050 752140427 752504425 752800217 752816620 752925186 752725296 753072510 753108444 753222580
2052.2G53222580m54788p82013m05274l62854M74778L45535O72836M21143L6163l23791
$$ 753222580 752767792 751985779 751580505 751217651 751692429 752037964 752710800 753131943 753168106 752844315
2061.9G52844315n64652n8746j022110m77829Q9340k2583P1030L34701O34155m9438
$$ 752844315 752279663 752220917 751198807 750720978 750810318 750787735 750858765 751193466 751827621 751778183
2071.5G51778183J66626k88620k30789k61002o73904j80512j02997L83378J86309L95432
$$ 751778183 751944809 751656189 751425400 751164398 750490494 750309982 750206985 750590363 750776672 751172104
2081.1G51172104L11813O3935N1574k48413j96838j006012n89752l65906k30789L69110
$$ 751172104 751483917 751547852 751599426 751351013 751154175 750148163 749558411 749192505 748961716 749330826
2090.8G49330826M63104M08630j22146N08346R6970k89993m85001q06808k95487m80728
$$ 749330826 749793930 750202560 750080414 750588760 750685730 750395737 749910736 749103928 748808441 748327713
2100.4G48327713P4768J61362L46679J16730j08032L81470j55335j49460m61425n31464
$$ 748327713 748402481 748563843 748910522 749027252 748919220 749300690 749145355 748995895 748534470 748003006
2110.1G48003006p38144l73306N15518L88336K99301l41797J82114L25623l20282l28827
$$ 748003006 747264862 746891556 747407074 747795410 748094711 747752914 747935028 748260651 747940369 747611542
2119.7G47611542m87747o72150m78134M80880M04358L51639J90201j58691l2120Q087
$$ 747611542 747123795 746451645 745973511 746454391 746858749 747210388 747400589 747241898 747209778 747217865
2129.4G47217865l6774n77087J21994o8588k27127J12991l81775K4185J58692P56530
$$ 747217865 747181091 746604004 746725998 746657410 746430283 746543274 746161499 746185684 746344376 747100906
2139G47100906L30964j96915k62451n94178o2103m39911l38211l7994O07452O64368
$$ 747100906 747431870 747234955 746972504 746378326 746316223 745876312 745538101 745500107 746107559 746771927
2148.6G46771927o3477K137j52054K09427l61252n23072j77993n9586K09122r0332
$$ 746771927 746708450 746710587 746558533 746767960 746406708 745883636 745705643 745646057 745855179 745764847
2158.3G45764847K65655O256J46027M33807K85340j5183m15954Q087l48511l02963
$$ 745764847 746030502 746036758 746182785 746616592 746901932 746886749 746470795 746478882 746130371 745827408
2167.9G45827408j7166Q163m0207Q3847K41471j11008J45187j86386J61362L27759
$$ 745827408 745810242 745818405 745778198 745862045 746103516 745992508 746137695 745951309 746112671 746440430
2177.6G46440430o333K8076m64324J8386Q088j09940j02997P4692K84195q7891J69754
$$ 746440430 746434097 746462173 745997849 746016235 746024323 745914383 745811386 745886078 746170273 746082382 746252136
2188.2G46252136J46256J53808k78473k52761J2207L357k8763m77524K33154L02735
$$ 746252136 746398392 746552200 746273727 746020966 746033173 746036530 746007767 745530243 745763397 746066132
2197.8G46066132K78091k2736r6969M66461k80762j08947m0360n4016k19574l13263
$$ 746066132 746344223 746321487 746224518 746690979 746410217 746301270 746260910 746206894 745987320 745674057
2207.5G45674057J16730O2256M27627J6861M9210K18353R9106q9493l00522O7291j51748
$$ 745674057 745790787 745853043 746280670 746297531 746346741 746565094 746664200 746574707 746274185 746341476 746189728
2218.1G46189728R7503q4610j5716J49078K64283K92205o09131J27030J67694k59476
$$ 746189728 746287231 746202621 746186905 746335983 746600266 746892471 746283340 746410370 746578064 746318588
2227.7G46318588l05099k39945J68915K442K25524k77786J30615J99585k95791J67160
$$ 746318588 746013489 745773544 745942459 745944901 746170425 745892639 746023254 746222839 745927048 746094208
2237.4G46094208j4878j97830n92880k26593k47650K29187P84073j54953p8430J06582
$$ 746094208 746079330 745881500 745288620 745062027 744814377 745043564 745827637 745672684 745594254 745700836
2247G45700836K28958k45056j45874M4861l96652n9052j6250M33426P6217m7226M2267
$$ 745700836 745929794 745684738 745538864 745583725 745187073 745128021 745111771 745545197 745621414 745574188 745616455
2257.6G45616455l05633q3466k01874N5618j90734k56272j40381K36512L38287l5858
$$ 745616455 745310822 745227356 745025482 745081100 744890366 744634094 744493713 744730225 745068512 745032654
2267.3G45032654K25906l85818p4158q3237m47006J23062K95258K41318j37558P1029
$$ 745032654 745258560 744872742 744798584 744715347 744268341 744391403 744686661 744927979 744790421 744861450
2276.9G44861450j18866j58462l00064k23694n4856n10025J84708J8005J23673k8687
$$ 744861450 744742584 744584122 744284058 744060364 744005508 743495483 743680191 743698196 743821869 743793182
2286.5G43793182k21252L24478l12424j87606k7543M67988J44729l39203k89917n27878
$$ 743793182 743571930 743896408 743583984 743396378 743368835 743836823 743981552 743642349 743352432 742824554
2296.2G42824554L54844k34909j80817R1629k72141m0435j56174L59573O5613j95541
$$ 742824554 743179398 742944489 742763672 742855301 742583160 742542725 742386551 742746124 742811737 742616196
2305.8G42616196l36609O6528J10626l23944J2589n52521J25961j602L6011K73590
$$ 742616196 742279587 742346115 742456741 742132797 742145386 741592865 741718826 741717224 741753235 742026825
2315.5G42026825n62134O7978j01929p858K43530N16587j25809q13065l69644p90252
$$ 742026825 741464691 741532669 741430740 741422882 741666412 742182999 742057190 741244125 740874481 740084229
2325.1G40084229L66134Q23975O14166p0496l53012n95169j533584K28653K67028k86941
$$ 740084229 740450363 741274338 741888504 741818008 741464996 740869827 739336243 739564896 739831924 739544983
2334.8G39544983l09448l76511p3547l08533j9913M34571P29293k52914M88663L13720
$$ 739544983 739235535 738859024 738785477 738476944 738457031 738891602 739620895 739367981 739856644 740170364
2344.4G40170364j154022j555328j666870M61425J552430J171035M349m93545q23517
$$ 740170364 739016342 737461014 735794144 736255569 737807999 738979034 738983383 738489838 737666321
2353.1G37666321p34711P58743j27716L74222K05612k12097K49329l03345J03149j93862
$$ 737666321 736931610 737690353 737562637 737936859 738142471 737930374 738179703 737876358 737979507 737785645
2362.7G37785645R6435j039963k49710M89960r22318j224441n82810L50190m57993
$$ 737785645 737882080 736842117 736592407 737082367 736160049 734935608 734352798 734702988 734244995
2371.4G34244995M273l9216o26373k04010j02005L9673l66974M349Q1711l87192n48401
$$ 734244995 734249268 734210052 733583679 733379669 733277664 733317337 732950363 732954712 733036423 732649231 732100830
2382G32100830k35443J96991j86005k82974l30810k14768k78549k68555N1804j54267
$$ 732100830 731865387 732062378 731876373 731593399 731262589 731047821 730769272 730500717 730552521 730398254
2391.7G30398254j23596k87475j45111r2316l02658j73416j13144j10092j81733L434
$$ 730398254 730274658 729987183 729842072 729749756 729447098 729273682 729160538 729050446 728868713 728872147
2401.3G28872147l88260m25568r3918O7444J23139l67585m85000n94254k1744O3401
$$ 728872147 728483887 728058319 727964401 728031845 728154984 727787399 727302399 726708145 726686401 726749802
2410.9G26749802k84806j39618m13589p8354k71835l18604q1634l95279l77579j41373
$$ 726749802 726464996 726325378 725911789 725833435 725561600 725242996 725161362 724766083 724388504 724247131
2420.6G24247131N6000j20010k3880l19977j56632R3461n26429n79071l46908R9640
$$ 724247131 724303131 724183121 724159241 723839264 723682632 723776093 723249664 722670593 722323685 722423325
2430.2G22423325k34299m39911k29340k91214j52511p096L31269l29819m77829j55868
$$ 722423325 722189026 721749115 721519775 721228561 721076050 721068954 721400223 721070404 720592575 720436707
2439.9G20436707m28315m40750n13763j51673R2087j00479o14929j58310L34320k86331
$$ 720436707 720008392 719567642 719053879 718902206 718994293 718893814 718278885 718120575 718454895 718168564
2449.5G18168564l52936m92325m57535l74221l75061m54255l76815j1521R0485R4681
$$ 718168564 717815628 717323303 716865768 716491547 716116486 715662231 715285416 715273895 715364380 715459061
2459.2G15459061m57688p2403l79409q89588J00784l9215n80978p55386r4452M1961
$$ 715459061 715001373 714928970 714549561 713659973 713760757 713721542 713140564 712385178 712290726 712332687
2468.8G12332687l56063k94953l02200L92990j18561p10983m28391k78091l58124p04422
$$ 712332687 711976624 711681671 711379471 711772461 711653900 710942917 710514526 710236435 709878311 709173889
2478.5G09173889l92914k10800P4234l7231l97034m73633m84924q3771j73187k31857
$$ 709173889 708780975 708570175 708644409 708607178 708210144 707736511 707251587 707167816 706994629 706762772
2488.1G06762772k78702n47180o11267j25275k04010m21906q7204o73294j28708J07270
$$ 706762772 706484070 705936890 705325623 705200348 704996338 704574432 704487228 703813934 703685226 703792496
2497.7G03792496o53382p55996n85327K96630O9657l53546l67585j93405j84631o49185
$$ 703792496 703139114 702383118 701797791 702094421 702164078 701810532 701442947 701249542 701064911 700415726
2507.4G00415726j05744m89883q30536l93295k81983J99127K65580J4267k28730m90570
$$ 700415726 700309982 699820099 698989563 698596268 698314285 698513412 698778992 698793259 698564529 698073959
2517F98073959m53796m17633p10983m50287n18265l99933L50876k70157j43204m2801
$$ 698073959 697620163 697202530 696491547 696041260 695522995 695123062 695473938 695203781 695060577 695017776
2526.7F95017776o27212j28250l2044n52978o54450k70080l75061j16654o1493k69088
$$ 695017776 694390564 694262314 694230270 693677292 693022842 692752762 692377701 692261047 692199554 691930466
2536.3F91930466j00251n05981k44369k89841j50910M3106o25381m43115r8496r4146
$$ 691930466 691830215 691324234 691079865 690790024 690639114 690682220 690056839 689613724 689515228 689421082
2546F89421082n38712k88925K69241M1428l56980p59353n68009m09240m49448l71323
$$ 689421082 688882370 688593445 688862686 688904114 688547134 687787781 687219772 686810532 686361084 685989761
2555.6F85989761K44370n4474o57959M4708l32412n45044k52762k63672j26419j40686
$$ 685989761 686234131 686179657 685521698 685566406 685233994 684688950 684436188 684172516 684046097 683905411
2565.2F83905411P3089k19497m66156l52631j21841j63651l92456m08783l67813j49994
$$ 683905411 683978500 683759003 683292847 682940216 682818375 682654724 682262268 681853485 681485672 681335678
2574.9F81335678k41547m5013l70026n15213j7013k52533l33862m15879k06527j64414
$$ 681335678 681094131 681049118 680679092 680163879 680146866 679894333 679560471 679144592 678938065 678773651
2584.5F78773651k80762m30374m82635j7166l23868j43509q1329l77350k65427l05176
$$ 678773651 678492889 678062515 677579880 677562714 677238846 677095337 677014008 676636658 676371231 676066055
2594.2F76066055j16043m76532n82199l73001j36642J9149k21176j35345m9210j85242
$$ 676066055 675950012 675473480 674891281 674518280 674381638 674400787 674179611 674044266 673995056 673809814
2603.8F73809814n48858l90015o10580o23322K14310l34778o29730j79138m44184m16717
$$ 673809814 673260956 672870941 672260361 671637039 671851349 671516571 670886841 670707703 670263519 669846802
2613.5F69846802L81393J57318q52279n21775j88675n27725n21622k29415m6158j17493
$$ 669846802 670228195 670385513 669533234 669011459 668822784 668295059 667773437 667544022 667497864 667380371
2623.1F67380371m61807n30319k01340j4496J30539m07867o22712o08215o87561L9825
$$ 667380371 666918564 666388245 666186905 666172409 666302948 665895081 665272369 664664154 663976593 664016418
2632.8F64016418j53350m24271k70157k08893j71661p77435n52903p5225m75007m53872
$$ 664016418 663863068 663438797 663168640 662959747 662788086 662010651 661457748 661382523 660907516 660453644
2642.4F60453644j57395l82461j21613J3886k90375j16653k64588k52685m48685m95148
$$ 660453644 660296249 659913788 659792175 659806061 659515686 659399033 659134445 658881760 658433075 657937927
2652F57937927k02179m04358l33099m48608k47498j30463m4555K9144n13306k04391
$$ 657937927 657735748 657331390 656998291 656549683 656302185 656171722 656127167 656156311 655643005 655438614
2661.7F55438614J6403p4921l57437p75528n09338k13699j46561k9602M23279N3405
$$ 655438614 655455017 655380096 655022659 654247131 653737793 653524094 653377533 653347931 653771210 653824615
2671.3F53824615o78024m06036J06430m0894l25164k59095m90265j15127l967m50669
$$ 653824615 653146591 652740555 652846985 652806091 652480927 652221832 651731567 651616440 651612473 651161804
2681F51161804l87420k86408L4332k40326k86636m4556l23410l45153m11225m18167
$$ 651161804 650774384 650487976 650522308 650281982 649995346 649950790 649627380 649282227 648871002 648452835
2690.6F48452835l67355O5765K46506j55945j98212l90396n52444m06647k69928J39618
$$ 648452835 648085480 648151245 648397751 648241806 648043594 647653198 647100754 646694107 646424179 646563797
2700.3F46563797J93405o13251o70318j31912K85263K14691o00052K7618L84064n14145
$$ 646563797 646757202 646143951 645473633 645341721 645626984 645841675 645241623 645269241 645653305 645139160
2709.9F45139160n18570k31018j46332m35791l07846m6997j85165q4534k96860l42941
$$ 645139160 644620590 644389572 644243240 643807449 643499603 643452606 643267441 643182907 642886047 642543106
2719.5F42543106J8387m9057l86582j59454m5700l36075l07083k05307N8136K53525
$$ 642543106 642561493 642512436 642125854 641966400 641920700 641584625 641277542 641072235 641130371 641383896
2729.2F41383896J04675m20761p99789k67563K10647m19807n64804K43873L1891k41699
$$ 641383896 641488571 641067810 640268021 640000458 640211105 639791298 639226494 639470367 639502258 639260559
2738.8F39260559j22604k8305p2823n54161k4834K18354j81351j49841l04833k24991
$$ 639260559 639137955 639109650 639036827 638482666 638457832 638676186 638494835 638344994 638040161 637815170
2748.5F37815170j28517n1727J5411j83906r9259K5826l89862n49126l28331l06091
$$ 637815170 637686653 637634926 637650337 637466431 637367172 637392998 637003136 636454010 636125679 635819588
2758.1F35819588j57128n4779p63Q5640L31154j65405p60727m24309n99594k14729
$$ 635819588 635662460 635607681 635606918 635692558 636023712 635858307 635097580 634673271 634073677 633858948
2767.8F33858948J8158j40534J68419l07350l53851k0256K50435N6571m65278p50427
$$ 633858948 633877106 633736572 633904991 633597641 633243790 633223534 633473969 633530540 633065262 632314835
2777.4F32314835j064072n90363j71966Q7890j64794l85018K23503K03781M7226l14903
$$ 632314835 631250763 630660400 630488434 630576324 630411530 630026512 630250015 630453796 630501022 630186119
2787F30186119n15556m62952m92477l03574n82771l88680Q087m35409m58107J2817
$$ 630186119 629670563 629207611 628715134 628411560 627828789 627440109 627448196 627012787 626554680 626567497
2796.7F26567497k69317m54712n81360q00057j57890k60353p19528m90723k12479J46981
$$ 626567497 626298180 625843468 625262108 624462051 624304161 624043808 623324280 622833557 622621078 622768059
2806.3F22768059K28500k14195o08254o99768j225853q87222j64795l56178k98157
$$ 622768059 622996559 622782364 622174110 621474342 620248489 619361267 619196472 618840294 618542137
2815F18542137m89616m85497k89497l57475l18413l03650k84653p80487r70535n00984
$$ 618542137 618052521 617567024 617277527 616920052 616601639 616297989 616013336 615232849 614262314 613761330
2824.7F13761330k31896l82156m85649m76685n73082m70161m40102m46396n62477o71654
$$ 613761330 613529434 613147278 612661629 612184944 611611862 611141701 610701599 610255203 609692726 609021072
2834.3F09021072p96890o50749n57861j176835r07783m44069o44035j030312j367035
$$ 609021072 608224182 607573433 607015572 605838737 604930954 604486885 603842850 602812538 601445503
2843F01445503j093483q06389q90731j386872j829567j917381j186523q94967j058197
$$ 601445503 600352020 599545631 598654900 597268028 595438461 593521080 592334557 591439590 590381393
2851.7E90381393n48858j074677o85043j29166o67457j49460L37601L27262k93464
$$ 590381393 589832535 588757858 588072815 587943649 587276192 587126732 587464333 587791595 587498131
2860.3E87498131k19803Q9340m88510o97823k63252L26882n36995r12285l97949l91961
$$ 587498131 587278328 587367668 586879158 586181335 585918083 586244965 585707970 584795685 584397736 584005775
2870E84005775k96859o80123m52346j21003o24427j099015n84793k8801m74853m50745
$$ 584005775 583708916 583028793 582576447 582455444 581831017 580732002 580147209 580118408 579643555 579192810
2879.6E79192810m76875l17993j75934n72396n73082o74247n65720o79397p52755m79698
$$ 579192810 578715935 578397942 578222008 577649612 577076530 576402283 575836563 575157166 574404411 573924713
2889.3E73924713o94046n00717k51617o95305o64292l35388o78253o41899o48194q51631
$$ 573924713 573230667 572729950 572478333 571783028 571118736 570783348 570105095 569463196 568815002 567963371
2898.9E67963371k16293r2659n79414j010552j096344l78113r9220p46803o73027k92588
$$ 567963371 567747078 567654419 567075005 566064453 564968109 564589996 564490776 563743973 563070946 562778358
2908.6E62778358r02252r98077o29540p92160j101989j032410o52237j032333j140709
$$ 562778358 561876106 560878029 560248489 559456329 558354340 557321930 556669693 555637360 554496651
2917.2E54496651q75817j410942j539039j123162q48922m92897Q9683L7041o60896
$$ 554496651 553620834 552209892 550670853 549547691 548698769 548205872 548295555 548332596 547671700
2925.9E47671700k78550J78719j94168j02883n02662n09072N79377O33354Q06808Q35686
$$ 547671700 547393150 547571869 547377701 547274818 546772156 546263084 546842461 547475815 548282623 549118309
2935.6E49118309J35422L69339M40216L18985O29120O77185M84695K10381J869L59650
$$ 549118309 549253731 549623070 550063286 550382271 551011391 551688576 552173271 552383652 552385521 552745171
2945.2E52745171J064987Q57963J85547K90451P81098O97174K05993q9798p934K64244
$$ 552745171 553810158 554668121 554853668 555144119 555925217 556622391 556828384 556738586 556730652 556994896
2954.8E56994896K9030n2681M24499N01786K15492N33714Q57315K37732l7155L42407
$$ 556994896 557023926 556971245 557395744 557897530 558113022 558646736 559504051 559741783 559704628 560047035
2964.5E60047035O25077N08575O60782Q37364K84195M82101N83115L13187N55496M00352
$$ 560047035 560672112 561180687 561841469 562678833 562963028 563445129 564028244 564341431 564896927 565297279
2974.1E65297279K00043n7259K47193R00192K94228o4354M04091K31056K46429J25733
$$ 565297279 565497322 565440063 565687256 566587448 566881676 566817322 567221413 567452469 567698898 567824631
2983.8E67824631m12255M1428K18277O3667P9384J63002L86086k4186R2240M52156
$$ 567824631 567412376 567453804 567672081 567735748 567815132 567978134 568364220 568340034 568432274 568884430
2993.4E68884430K28958k51312l13530o9733n01594k58255j67351q02765o02226P7285
$$ 568884430 569113388 568862076 568548546 568478813 567977219 567718964 567551613 566748848 566146622 566223907
3003.1E66223907L51754j49880m86450k72675J2246j34659n50385o92825l85094j30119
$$ 566223907 566575661 566425781 565939331 565666656 565678902 565544243 564993858 564301033 563915939 563785820
3012.7E63785820l29590k23389n41610p22695m40940j65635L32337l83454r88693n65262
$$ 563785820 563456230 563232841 562691231 561968536 561527596 561361961 561694298 561310844 560322151 559756889
3022.4E59756889j43623l81317r36890n87311l59420m61274m08706k92664n94330q00018
$$ 559756889 559613266 559231949 558295059 557707748 557348328 556887054 556478348 556185684 555591354 554791336
3032E54791336m80270o61011n17654o91987r36889l64266j95312k67220m72908p34482
$$ 554791336 554311066 553650055 553132401 552440414 551503525 551139259 550943947 550676727 550203819 549469337
3041.6E49469337o87103n19142o44531o49834m48913l70942l31497o76613p62596n92460
$$ 549469337 548782234 548263092 547618561 546968727 546519814 546148872 545817375 545140762 544378166 543785706
3051.3E43785706o03714p36885o21262l92418m10080l78075p66182q02421q49648r07974
$$ 543785706 543181992 542445107 541823845 541431427 541021347 540643272 539877090 539074669 538225021 537317047
3060.9E37317047l33328q0528q4839m54331j38931l73611j085549k68516m38614p57790
$$ 537317047 536983719 536903191 536818352 536364021 536225090 535851479 534765930 534497414 534058800 533301010
3070.6E33301010l11622n34707o86531k46124Q9264k89955n66406l83721l83034r05036
$$ 533301010 532989388 532454681 531768150 531522026 531611290 531321335 530754929 530371208 529988174 529083138
3080.2E29083138p18461k64625n25856m60739p39365q44345j16425L14332j6594o16303
$$ 529083138 528364677 528100052 527574196 527113457 526374092 525529747 525413322 525727654 525711060 525094757
3089.9E25094757q54111p89032l48281l76130p70759p41577n37796j26419N8860l96804
$$ 525094757 524240646 523451614 523103333 522727203 521956444 521214867 520677071 520550652 520609512 520212708
3099.5E20212708p42951m42276l99780p29675q99315q2016M58030m58450q00629p65380
$$ 520212708 519469757 519027481 518627701 517898026 516998711 516916695 517374725 516916275 516115646 515350266
3109.1E15350266m32511l95965r79081o18057l4714M2725p60956r56306n17845n78728
$$ 515350266 514917755 514521790 513542709 512924652 512889938 512932663 512171707 511215401 510697556 510118828
3118.8E10118828p80602r43336l57514m38575m43459j39465o38771p28379o58874l94592
$$ 510118828 509338226 508394890 508037376 507598801 507155342 507015877 506377106 505648727 504989853 504595261
3128.4E04595261l93792m75006m08249n79948p72324n40695p1640p23762q47626m77333
$$ 504595261 504201469 503726463 503318214 502738266 501965942 501425247 501353607 500629845 499782219 499304886
3138.1D99304886o88019q00018n99327j40648n55039p31697p45201p23877m73633n69114
$$ 499304886 498616867 497816849 497217522 497076874 496521835 495790138 495044937 494321060 493847427 493278313
3147.7D93278313k35291m24690k95754j58348o22749p36504q16269n41381o47774r44138
$$ 493278313 493043022 492618332 492322578 492164230 491541481 490804977 489988708 489447327 488799553 487855415
3157.4D87855415j085853o62003k13852n84411n29099o35643q78372p07436n07049
$$ 487855415 486769562 486107559 485893707 485309296 484780197 484144554 483266182 482558746 482051697
3166D82051697n60990n37605l43323l49922n22690p96432m44641o25115r16023n38101
$$ 482051697 481490707 480953102 480609779 480259857 479737167 478940735 478496094 477870979 476954956 476416855
3175.7D76416855k10915k36778j121063r31511p75147p50847l05328o36902l49846
$$ 476416855 476205940 475969162 474848099 473916588 473141441 472390594 472085266 471448364 471098518
3184.4D71098518l51486n62401p43637n95970k44064n49546m97436j008377r34982
$$ 471098518 470747032 470184631 469440994 468845024 468600960 468051414 467553978 466545601 465610619
3193D65610619m00505k22397l40920r15909m59633m03556m76761n89752p24183n4283
$$ 465610619 465210114 464987717 464646797 463730888 463271255 462867699 462390938 461801186 461077003 461022720
3202.7D61022720o6490n75676j031723m52843k79693q99162n13955l04946m91829n37453
$$ 461022720 460956230 460380554 459348831 458895988 458616295 457717133 457203178 456898232 456406403 455868950
3212.3D55868950j25961k7924k42348m28047r91783o18134l41186r59587r32732l93104
$$ 455868950 455742989 455715065 455472717 455044670 454052887 453434753 453093567 452133980 451201248 450808144
3222D50808144l09868l19290j76163l77922o23207n99556j47629K5597k12365l86314
$$ 450808144 450498276 450178986 450002823 449624901 449001694 448402138 448254509 448280106 448067741 447681427
3231.6D47681427p22084r54437o57082j65214l48626o07986n97992m30832L0708j10817
$$ 447681427 446959343 446004906 445347824 445182610 444833984 444225998 443628006 443197174 443227882 443117065
3241.3D43117065n20019m57420j98784m10195o69250p11518p23724l77045k99644l77121
$$ 443117065 442597046 442139626 441940842 441530647 440861397 440149879 439426155 439049110 438749466 438372345
3250.9D38372345n28107m84543m7264n722m72221q42133n71327k40898r7542m11873
$$ 438372345 437844238 437359695 437312431 437306709 436834488 435992355 435421028 435180130 435082588 434670715
3260.5D34670715q53500n78156j28784L624k51007p9384p3929n02014m63714k79694
$$ 434670715 433817215 433239059 433110275 433113899 432862892 432783508 432709579 432207565 431743851 431464157
3270.2D31464157m02870o60896m14315m20036k76298o0540l39241l67622n86701l06091
$$ 431464157 431061287 430400391 429986076 429566040 429289742 429229202 428889961 428522339 427935638 427629547
3279.8D27629547j22414k10647k4529j63879l44429o92062m99764j50413k7695k83280
$$ 427629547 427507133 427296486 427271957 427108078 426763649 426071587 425571823 425421410 425393715 425110435
3289.5D25110435n12199j78413m20037K08016N17120n39093o95648n10330o79436p52068
$$ 425110435 424598236 424419823 423999786 424207802 424724922 424185829 423490181 422979851 422300415 421548347
3299.1D21548347j64871J60179m45327n37186j02387l20129l07503M6311n38063o15311
$$ 421548347 421383476 421543655 421098328 420561142 420458755 420138626 419831123 419877434 419339371 418724060
3308.8D18724060n1804o6299m82941o79206o27976p54814k79923j55258j99623k2850
$$ 418724060 418672256 418605957 418123016 417443810 416815834 416061020 415781097 415625839 415426216 415403366
3318.4D15403366o23131q43010l20091n417n05523n56069m09241p53860p35893q25539
$$ 415403366 414780235 413937225 413617134 413611717 413106194 412550125 412140884 411387024 410651131 409825592
3328.1D09825592o80771o14014l54461k77443n89600r2888j48544n24788n98793o54793
$$ 409825592 409144821 408530807 408176346 407898903 407309303 407216415 407067871 406543083 405944290 405289497
3337.7D05289497n36995m99801o62651p88727l67775m61197p99217m83971k09617m07639
$$ 405289497 404752502 404252701 403590050 402801323 402433548 401972351 401173134 400689163 400479546 400071907
3347.3D00071907m87595n92994p87354j12686m61159r34868l38020m57420k31514M6196
$$ 400071907 399584312 398991318 398203964 398091278 397630119 396695251 396357231 395899811 395668297 395714493
3357C95714493j16577m27781q00628q13904n33905l43628m83704p4081k84805o74362
$$ 395714493 395597916 395170135 394369507 393555603 393021698 392678070 392194366 392120285 391835480 391161118
3366.6C91161118m87175n23987j42632n30548p08961q6899k77710n52902k88849m9782
$$ 391161118 390673943 390149956 390007324 389476776 388767815 388680916 388403206 387850304 387561455 387511673
3376.3C87511673l81546n18265l92418l63731k79160l73954l40424j30692J1101j88637
$$ 387511673 387130127 386611862 386219444 385855713 385576553 385202599 384862175 384731483 384742584 384553947
3385.9C84553947m15000k57416p3662j30119j74332R5940P8353o36863q04939j97907
$$ 384553947 384138947 383881531 383807869 383677750 383503418 383599358 383677711 383040848 382235909 382038002
3395.6C82038002K8420r2469l57971k71187J01586m62685n87845K64511M10080k33040
$$ 382038002 382066422 381973953 381615982 381344795 381446381 380983696 380395851 380660362 381070442 380837402
3405.2C80837402o52275l39126K88467K97356l32184l05290p8278j03989j39427j19285
$$ 380837402 380185127 379846001 380134468 380431824 380099640 379794350 379716072 379612083 379472656 379353371
3414.8C79353371M32357K48261P0991M90532M8027o06041o87446K7923O25840M11682
$$ 379353371 379785728 380033989 380104980 380595512 380643539 380037498 379350052 379377975 380003815 380415497
3424.5C80415497K21062P019m23584l85323K62184L47824j16615N7182K99149J71242
$$ 380415497 380636559 380643578 380219994 379834671 380096855 380444679 380328064 380385246 380684395 380855637
3434.1C80855637L01132N52215M89769k79121m56047L10860P07359Q61587J96305j56975
$$ 380855637 381156769 381708984 382198753 381919632 381463585 381774445 382481804 383343391 383539696 383382721
3443.8C83382721K72980Q15048R09767o32248k30484O24581N54389Q36716K95181K38419
$$ 383382721 383655701 384470749 385380516 384748268 384517784 385142365 385696754 386533470 386828651 387067070
3453.4C87067070K57874K18353L19443N32531P57714K30903O56815J034927Q51784
$$ 387067070 387324944 387543297 387862740 388395271 389152985 389383888 390040703 391075630 391927414
3462.1C91927414N6229l29438R01985J073914O37207L27644L71743Q33664O89087M06913
$$ 391927414 391983643 391654205 392556190 393630104 394267311 394594955 394966698 395800362 396489449 396896362
3471.7C96896362N70069Q43963M72107R0904M29688J052475O12488P65075J532937
$$ 396896362 397466431 398310394 398782501 398873405 399303093 400355568 400968056 401733131 403266068
3480.4D03266068L59115J17302P05643J051941J044426O93969R54399K09389L34549
$$ 403266068 403625183 403742485 404448128 405500069 406544495 407238464 408192863 408402252 408736801
3489.1D08736801J089020R04426M19922J52893P44400R96285R30405O15158N58166
$$ 408736801 409825821 410730247 411150169 411303062 412047462 413043747 413974152 414589310 415147476
3497.8D15147476P12013J011506J412277R67941L83186q392Q28590J040879P92961
$$ 415147476 415859489 416870995 418283272 419251213 419634399 419626007 420454597 421495476 422288437
3506.5D22288437J308250J028862K38877J4496J142463J381951J090164Q84170n4931
$$ 422288437 423596687 424625549 424864426 424878922 426021385 427403336 428493500 429377670 429322739
3515.1D29322739N37986J565743J009445L42941R74961J369476J512108R07440n21431
$$ 429322739 429860725 431426468 432435913 432778854 433753815 435123291 436635399 437542839 437021408
3523.8D37021408N33714R21212Q59680J468468J382942J249199R62410N78956O14205
$$ 437021408 437555122 438476334 439336014 440804482 442187424 443436623 444399033 444977989 445592194
3532.5D45592194J481247J253852J087304M34494l63884J392974J479416J198044J626549
$$ 445592194 447073441 448327293 449414597 449849091 449485207 450878181 452357597 453555641 455182190
3541.2D55182190J403885Q72307J135177J041985L39012J360092L59573J225434J503219
$$ 455182190 456586075 457458382 458593559 459635544 459974556 461334648 461694221 462919655 464422874
3549.9D64422874R97277J883545o1303J030846J150551J184883K099381J112556J969452
$$ 464422874 465420151 467303696 467242393 468273239 469423790 470608673 472708054 473820610 475790062
3558.5D75790062J286316K46620J17340K227059J894073N33371L711205J45530m33960
$$ 475790062 477076378 477322998 477440338 479667397 481561470 482094841 485806046 485951576 485517616
3567.2D85517616Q18062K37656L599624J495476J057167J400109J637496J433030J238937
$$ 485517616 486335678 486573334 490172958 491668434 492725601 494125710 495763206 497196236 498435173
3575.9D98435173K010765L53356J846122J404000Q62732K308616J879921J373215Q59337
$$ 498435173 500445938 500799294 502645416 504049416 504912148 507220764 509100685 510473900 511333237
3584.6E11333237L307190J565437k81868J289444q31566K924156K527581K299537J753884
$$ 511333237 514640427 516205864 515923996 517213440 516381874 519306030 521833611 524133148 525887032
3593.2E25887032R94911K729683p69692J799507L025132J150055K897186J048126M06303
$$ 525887032 526881943 529611626 528841934 530641441 533666573 534816628 537713814 538761940 539168243
3601.9E39168243J659203J448174J631164L481712L504715j074257J218186k44370
$$ 539168243 540827446 542275620 543906784 547388496 550893211 549818954 551037140 550792770
3609.6E50792770J663475P546273R38644k721519L476257L56255L608589M266128L44239
$$ 550792770 552456245 560002518 560941162 558219643 561695900 562052155 565660744 569926872 570271111
3618.3E70271111L96766o57501J660614K686920K446022K167053K384186K560845K557106
$$ 570271111 570667877 570010376 571670990 574357910 576803932 578970985 581355171 583916016 586473122
3627E86473122N834999m29116q401718M030686M251747N132713K188187j034508J739121
$$ 586473122 592308121 591879005 583477287 587507973 591759720 596892433 599080620 598046112 599785233
3635.7E99785233K950935L006019R82399J122857K478065K370911R27238J037598L021660
$$ 599785233 602736168 605742187 606724586 607847443 610325508 612696419 613623657 614661255 617682915
3644.4F17682915M409752N911483j278724l291931N758285J294212l832206j229210
$$ 617682915 622092667 628004150 626725426 623433495 629191780 630485992 626653786 625424576
3652.1F25424576N266228M102439L917504N637092o632652N31387M962197J426162
$$ 625424576 630690804 634793243 638710747 644347839 637715187 638246574 643208771 644634933
3659.8F44634933J522904J190872K335968J235352R10949K184525J658401L646775
$$ 644634933 646157837 647348709 649684677 650920029 651830978 654015503 655673904 659320679
3667.5F59320679J825409m83780P62634o198883K609100Q427201Q361282k39258j7307968
$$ 659320679 661146088 660662308 661424942 655226059 657835159 666262360 674623642 674384384 657076416
3676.2F57076416K534943P929077M592056k346344o46667K282943K228775K139817
$$ 657076416 659611359 667540436 672132492 669786148 669139481 671422424 673651199 675791016
3683.9F75791016J93786k42157M002152N853348r688874l272934Q281861m317170J04447
$$ 675791016 675984802 675742645 679744797 685598145 675909271 672636337 680918198 676601028 676705475
3692.6F76705475N133819J177979J439209m52805p63702J021347K77557K634201L759461
$$ 676705475 681839294 683017273 684456482 684003677 683239975 684261322 684538879 687173080 690932541
3701.3F90932541m251175k977295M005814J417617l44085K85644L425446M998855o886291
$$ 690932541 686681366 683704071 687709885 689127502 688783417 689069061 692494507 697493362 690607071
3709.9F90607071K761917M177246j2557373M078217L615341p83005P41959L062744
$$ 690607071 693368988 697546234 684988861 689067078 692682419 691899414 692641373 695704117
3717.7F95704117J621933l836518P65992O038284k842331n778274L951263K223511
$$ 695704117 697326050 693489532 694255524 700293808 697451477 691673203 695624466 697847977
3725.4F97847977P97195l167190j107483L746719J213913N151672j851730p444611
$$ 697847977 698645172 695477982 694370499 698117218 699331131 704482803 702631073 695186462
3733.1F95186462Q459168M10156j0214615Q87528K375869M53721K246551L356629l110505
$$ 695186462 703645630 704055786 693841171 694728699 697104568 697558289 699804840 703161469 700050964
3741.8G00050964J941834J0439377r842987j5348053J0140533N986481O011963k382660
$$ 700050964 701992798 712432175 702589188 687241135 697381668 703368149 709380112 706997452
3749.5G06997452r505005J0272598p053833p899856N932846M357376L479767m769288
$$ 706997452 697492447 707765045 700711212 692811356 698744202 703101578 706581345 701812057
3757.2G01812057J558915N415497p317200k046204L802185J266403P10450M202575
$$ 701812057 703370972 708786469 701469269 699423065 703225250 704491653 705202103 709404678
3764.9G09404678k122802n728302L085174N301590J51901r184341J048508L149871
$$ 709404678 707281876 701553574 704638748 709940338 710092239 700907898 701956406 705106277
3772.6G05106277N77317N67703n77469R79157L24173K614135Q68683p751846J446762
$$ 705106277 705683594 706251297 705673828 706652985 706977158 709591293 710459976 702708130 704154892
3781.3G04154892K142715Q84324J659545l156967j426315J580811J710510L54843p55463
$$ 704154892 706297607 707181931 708841476 705684509 704258194 705839005 707549515 707904358 707148895
3790G07148895K25067J17493M43878o58798Q83331L412323l180923m227905J686019
$$ 707148895 707373962 707491455 707935333 707276535 708159866 711572189 708391266 704163361 705849380
3798.7G05849380N094452P680054o026153j1956711L487014L013001M087677M858093
$$ 705849380 710943832 718623886 712597733 700641022 704128036 707141037 711228714 716086807
3806.4G16086807q747940m579010M214630J625824r0942N13992J70136P83386M912033
$$ 716086807 707338867 702759857 706974487 708600311 708509369 709023361 709193497 709976883 714888916
3815.1G14888916q73718j3745041M320450O160965M444503J579895j6454620N05142
$$ 714888916 714015198 700270157 704590607 710751572 715196075 716775970 700321350 700826492
3822.8G00826492M945450K404480L167114K05460m091110J86462J593628L366089J840439
$$ 700826492 705771942 708176422 711343536 711548996 707457886 707644348 709237976 712604065 714444504
3831.4G14444504q715363K093735O627045n682526o44913Q153305n863571m867401
$$ 714444504 705729141 707822876 714449921 708767395 708122482 716275787 710412216 705544815
3839.2G05544815N570679n461426K52304O139374l205109l492508L118210J725464
$$ 705544815 711115494 705654068 705906372 712045746 708840637 705348129 708466339 710191803
3846.9G10191803K30713J594009j191482J803131N615463n311584J538162j6147385
$$ 710191803 710422516 712016525 710825043 712628174 718243637 712932053 714470215 698322830
3854.6F98322830L99170J0298767j150131j933136K122116K447815L139343m528351
$$ 698322830 698722000 709020767 707870636 705937500 708059616 710507431 713646774 709118423
3862.3G09118423j02081O425781n700149n804138L400573M697571O137696q607941
$$ 709118423 709016342 715442123 709741974 703937836 707338409 712035980 718173676 709565735
3870G09565735r973679M521790O446304M613190r165650q04901L727951L26081K138519
$$ 709565735 699592056 704113846 710560150 715173340 706007690 705202789 708930740 709256821 711395340
3878.7G11395340L412170o730499o686783O786270K462235J806335M491349j2945633
$$ 711395340 714807510 708077011 701390228 708176498 710638733 712445068 716936417 703990784
3886.4G03990784L11813L750229J539154M662552j598816q349762J109543L421936
$$ 703990784 704302597 708052826 709591980 714254532 712655716 704305954 705415497 708837433
3894.1G08837433q88062R44977J385193K590256J354446j0189743M694290K290879
$$ 708837433 707949371 708894348 710279541 712869797 714224243 704034500 708728790 711019669
3901.8G11019669n558854L656464l887711j273498J114807J096497K063064O2485N98450
$$ 711019669 705460815 709117279 705229568 703956070 705070877 706167374 708230438 708292923 708891373
3910.5G08891373l44467K18734R9106l71017J556701J559983l527680l187103M463119
$$ 708891373 708546906 708765640 708864746 708493729 710050430 711610413 708082733 704895630 709358749
3919.2G09358749L98026l818359J676178J646499J092301k670594k752838J991120
$$ 709358749 709756775 705938416 707614594 709261093 710353394 707682800 704929962 706921082
3926.9G06921082J561126R07974j035079J0070K119522k643890k063446J310425J068
$$ 706921082 708482208 709390182 708355103 708365173 710484695 707840805 705777359 707087784 707088852
3935.6G07088852K1667N28870l69720j41221p400J542129J066208l923416l65066J238708
$$ 707088852 707110519 707639389 707269669 707128448 707121048 708663177 709729385 705805969 705440903 706679611
3945.2G06679611M65775J032638k440414N41611J176757j694107J257401K9526r84574
$$ 706679611 707145386 708178024 705737610 706279221 707455978 705761871 707019272 707048798 706064224
3953.9G06064224K07215J071395J73722j357117M74472p3624j07116J34735p56531
$$ 706064224 706271439 707342834 707516556 706159439 706633911 706560287 706453171 706587906 705831375
3962.6G05831375P01294N40924m68140o60247K4261N07126j69601m59290J28708N94177
$$ 705831375 706532669 707073593 706605453 705945206 705969467 706476593 706306992 705847702 705976410 706570587
3972.2G06570587L25775k86789p10220n51758j08185R25217K07138j81656O09436k53830
$$ 706570587 706896362 706609573 705899353 705347595 705239410 706164627 706371765 706190109 706799545 706545715
3981.9G06545715J77307l57894m24118J38702m18701M13055j96991n04303k92587M71344
$$ 706545715 706723022 706365128 705941010 706079712 705661011 706074066 705877075 705372772 705080185 705551529
3991.5G05551529Q84170l4637K3956r28573N9509P43256j68305n8822m85077
$$ 705551529 706435699 706401062 706425018 705496445 705555954 706299210 706130905 706072083 705587006
4000.2G05587006
$$ 705587006
##END=$$ End of the data block
