##TITLE=$$ Begin of the data block
##JCAMP-DX=5.00 $$ ACD/SpecManager v 10.08
##SPECTROMETER/DATA SYSTEM=Varian
##DATE=15 Jan 2013 15:07:22
##DATA TYPE=INFRARED SPECTRUM
##DATA CLASS=XYDATA
##ORIGIN=
##OWNER=
##NPOINTS=3735
##FIRSTX=399.26403809
##LASTX=4000.35498047
##MAXX=4000.35498047
##MINX=399.26403809
##MAXY=76.38796997
##MINY=37.90572739
##XFACTOR=1.0000000000
##YFACTOR=0.000000100000000
##FIRSTY=58.52049255
##DELTAX=0.96440572
##XUNITS=1/CM
##YUNITS=TRANSMITTANCE
##XYDATA=(X++(Y..Y))
399.3 585204926 595662041 578503113 568212814 566884651 564727249 560226440 556150665 560250893
407 560250893 568281670 569236298 562028885 557248154 563456726 569777794 566376343 562619286 558367538
415.7 558367538 554096260 550948982 556358223 578684158 567481194 562444115 561904259 557998962
423.4 557998962 559373932 560662842 564212685 561403313 560172958 564123611 561839027 563319473
431.1 563319473 566123085 569796715 569064980 561422157 562417793 564441032 564484978 563102341 561726074
439.8 561726074 565288391 562689323 554672394 555557175 561699753 565040855 567048912 567566147 564276390
448.4 564276390 560938339 559991646 562447548 568832855 570571747 566683121 565909538 561939621 551300621
457.1 551300621 547850037 556847534 562494621 566007614 566692352 563745499 561533890 558726616 556235466
465.8 556235466 558740120 559655952 555288429 551706085 554878235 557534752 548779984 544964561 546386642
474.5 546386642 548769798 554331398 554298744 551820526 551082001 550993347 550334702 547817726 549684372
483.2 549684372 551801567 549982452 550692062 550704079 550112534 549113541 549481773 554395370 554452400 547874260
492.8 547874260 546928215 549776154 549134750 549023018 550815887 549673386 546570435 543754463 543990936
501.5 543990936 547720833 549787178 548787689 547242622 548633652 549158707 546234589 545065231 546605263
510.2 546605263 546707077 543484459 542488785 544970131 546386795 547387810 547521782 544657364 543032112
518.9 543032112 542091331 539478111 537748451 538512726 540001297 541318817 543193283 544423447 544209557
527.5 544209557 543213921 542551689 541625290 541266174 541840591 540368576 539733276 541092491 542095490
536.2 542095490 541769905 540396004 539747849 539298363 539132271 538723679 538052673 537479210 537323723 537953796
545.9 537953796 537974129 538990211 538724442 538752365 540868301 539810257 538355293 537618904 535624847
554.5 535624847 533287086 533035660 534693336 535086136 535430107 535365677 535260963 536114616 535309753 533429718
564.2 533429718 532342682 532357140 533292542 533957939 533741150 534346352 535132446 535040588 533997116 533002396
573.8 533002396 533326950 532759933 532775497 532983360 531978416 532668304 533082581 532429733 533661537 535475311
583.5 535475311 534717941 533123703 533086205 532977982 533024368 533740501 534814262 536170807 537974777
592.1 537974777 539026108 538391457 536580696 535480194 536484108 537445526 537375641 536988640 536628876
600.8 536628876 536752014 537108345 537675972 538008156 537944489 536633606 535281334 534440765 533920135 535758133
610.5 535758133 536357841 535158730 534973221 535121422 535611992 535734291 535096664 534297180 533996429 533309746
620.1 533309746 533331108 534534035 535506325 536980667 537167320 537373390 538590546 538850250 539504318
628.8 539504318 539779243 540003166 541590309 542962723 543576508 544670486 545920029 546750412 547669601
637.5 547669601 548541260 550409317 551999512 551854286 551338348 551695137 554144745 556150818 556628304
646.2 556628304 557692833 559634285 560489655 559753952 559013939 557278214 557037773 558515892 560068207
654.8 560068207 561412315 561166458 561729507 561111374 559104042 559264565 560550537 561224976 560266418
663.5 560266418 559716148 560618286 562597084 564650955 561947861 561463470 563328857 565048523 563967896
672.2 563967896 562329788 563355637 564501228 564724884 565992279 568595543 569895401 570225029 570577545
680.9 570577545 570763016 570668793 570634232 571575546 572242851 572561531 572819214 573884811 575917549 577586937
690.5 577586937 578528328 578183250 577817307 577244911 576443367 576673317 577561073 578339577 579172173 580164566
700.2 580164566 580984917 582209625 582269173 582431946 583464127 582982788 582915878 583232231 583390961 584038124
709.8 584038124 585468597 587293167 588280525 588861809 589000435 588834496 588153496 587724075 587774734 588445587
719.5 588445587 589237061 589159622 590847778 592946243 593526955 592821579 592287292 592719040 592519875 593414879
729.1 593414879 594640846 595214081 596039276 597551537 598670425 598324127 598892365 599458542 599943810
737.8 599943810 600238533 599623337 598899384 598628311 599957275 600818176 601787071 603161163 603754120
746.5 603754120 603866653 603678093 604858437 605693665 605269241 604209557 603904037 605188980 605992279
755.1 605992279 606877365 608612823 609760399 609937859 610681267 610611916 610327187 611175957 610809059 611155968
764.8 611155968 612595329 613314018 613367958 613853455 615027657 614948845 614183121 613671303 613563080 613811340
774.4 613811340 614382210 614757423 614540100 614439468 615138245 616297112 616170387 615923080 616069374 616070900
784.1 616070900 616104317 616373749 617090263 616710281 616546364 617081413 618363190 619628792 619223747 619163666
793.7 619163666 618575668 617238503 616684990 616993637 616916466 615857315 615026627 614483643 613959732 612863998
803.4 612863998 611940575 611257782 610403862 608602562 606393127 605283394 604125214 603788300 603010025
812 603010025 601617126 601292572 600925560 599778633 597604294 597311172 597866936 596959152 596540527 596671829
821.7 596671829 596988335 597194672 597764282 599006844 600741234 602246284 603329124 605227928 607029610
830.4 607029610 609037933 611758766 613761864 614706917 615745544 617383652 619495926 621165543 622457352
839 622457352 624577675 625584679 627104874 629380951 630330925 631146736 631996689 633706055 634348984
847.7 634348984 634513054 635051727 635254936 636749878 638556328 640383835 641453705 642201157 643557129
856.4 643557129 645549622 647164536 647481689 647332916 646788864 647710495 648402557 649212112 650631485
865.1 650631485 650940933 651071091 650276566 650117493 649456635 648042679 646360779 644575195 644580307 644772720
874.7 644772720 644232712 643170242 643718338 644128418 644189529 644661407 643601303 643247375 642225342
883.4 642225342 641354980 640596619 639685097 640241470 640491104 640826111 640553665 640928879 641121979 640160599
893 640160599 639668541 639259949 639242172 639136543 640021362 641168213 642458725 643512650 643214874 642716522
902.7 642716522 641792908 641751633 641696930 642169418 643627777 644487610 645903320 647843018 649406509
911.4 649406509 649559784 648859100 647270203 645534439 643853989 641789703 639911003 638051491 637421074
920 637421074 636866684 635935822 633952675 631822395 630795288 628463478 625324669 621566391 618454475
928.7 618454475 615897179 613804283 613204155 612784691 613052521 613402939 613437347 612856102 611651344
937.4 611651344 610342865 609155006 608652191 608117142 608058434 607723770 608050308 608907814 609060745 609703445
947.1 609703445 608758583 607049065 605983734 604928932 604174690 603785667 603264771 602692032 603018799
955.7 603018799 602508812 601085548 598991966 596499939 594218941 591349182 589478683 588384972 586859970
964.4 586859970 585500832 585357285 585452843 584644165 583659515 581986656 579788742 577003326 574225883
973.1 574225883 571950111 570616913 569920769 567670059 565532417 564104424 562030449 558928833 554740982
981.8 554740982 550877113 547534828 544490318 541738014 539240761 536585655 533448296 530623398
989.5 530623398 527255898 523429642 520525055 517770348 514391785 510517502 507290611 504356537
997.2 504356537 501325569 499132614 497219582 495799370 493703537 491649323 490391693 488684082
1004.9 488684082 487340508 485586090 483910408 482999649 483168144 482988129 481516685 480671844 479206009
1013.6 479206009 477580566 475909996 473712730 471689796 469947929 468358727 465642700 463677101
1021.3 463677101 462637596 460894318 458636894 457303848 456539688 454553757 452421455 450827446
1029 450827446 450550079 450054932 449638824 449452400 448524895 448775482 448704948 448405190 448220291 448608665
1038.7 448608665 449515686 450322990 450832672 450616379 451991920 452640343 452398872 452387505 451917267 451778908
1048.3 451778908 451416702 450826569 449131699 448999710 449685555 449105339 448769417 448667946 449337921
1057 449337921 449702148 450580902 451028137 451062355 451961479 453489304 455582123 456937141 459305458
1065.7 459305458 461598816 463179436 464517212 465652390 466916504 467678757 468555298 468251839 468593826
1074.4 468593826 469897308 471053391 472089195 472526932 473977623 474681168 474626884 474962425 475653152
1083 475653152 476295357 477062073 478281517 478727798 479782181 480911713 482681160 484483414 485734673
1091.7 485734673 487700882 488107834 488373566 489357719 490912552 492990265 494481583 495862617 496809349
1100.4 496809349 497746582 498670044 499906120 501651840 503119469 503835564 503621597 503608627 504760056
1109.1 504760056 506329956 506688423 506888771 508007431 508882141 508805313 508213463 508027534 508168526
1117.7 508168526 508028603 507540359 508124123 508995285 509013557 509197807 509134026 509117241 509102020 509735298
1127.4 509735298 510825806 511533470 513043976 514819183 516498795 518073158 519340477 520042763 521205177
1136.1 521205177 522703400 523440628 524614372 525689354 526721115 528020782 529391251 530340157 530384331
1144.8 530384331 531144638 531977730 532409859 532236061 531302299 531352234 531901627 532198219 532236977 532718391
1154.4 532718391 533145561 532968330 533090630 532435036 531311340 530030975 529151611 529148483 528479576 528695793
1164 528695793 529981079 531004372 532107544 533022690 533961601 534975700 536547699 538646584 539841270
1172.7 539841270 540544167 541807632 543999252 546000328 547761078 550020218 551731453 553183937
1180.4 553183937 553902931 554060898 554887695 555745544 556541901 557635193 558416367 558998871 559881287
1189.1 559881287 559717026 558903122 558696022 558530846 558008766 557339401 556804390 556092262 555441017 554910698
1198.8 554910698 554237709 553491707 552492867 551632156 551020470 550065079 548853035 547831421 547378464
1207.4 547378464 547498474 547394180 547060814 546651802 546073380 545965118 546219902 546179504 545905952 545906029
1217.1 545906029 546124916 546128769 546057968 546444054 547200165 547183456 546582184 546334763 545877991 545171738
1226.7 545171738 544538918 544048347 543774452 543417435 542864914 542204628 541617546 541186028 540693016 540246201
1236.4 540246201 539847755 539386787 539163017 539050713 538767281 538492279 538667183 538744431 538057823 537277489
1246 537277489 536660919 536115570 535777779 535506783 535136948 534928932 534993286 535152283 535045929 534441261
1255.7 534441261 534120903 533935776 533631706 533503380 533536873 533848953 534003830 534467316 535205612 535526428
1265.3 535526428 535719185 536117249 536491508 536920280 537543983 537818527 538187714 538628311 539285736 540472145
1274.9 540472145 541497536 542575493 543454437 544534378 545842209 546325569 546685371 547587662 548882408
1283.6 548882408 550165977 551122360 552093391 553349342 554832153 555906563 556470947 557331810 558303986
1292.3 558303986 559127083 559679832 560178375 560886192 561504402 562325974 563124390 563719521 563931427 564032898
1301.9 564032898 564256897 564194527 564314156 564502411 564532204 564350853 564187088 564235878 564522285 564854202
1311.6 564854202 564761238 564473839 563986855 563717804 563402672 563207741 563586311 564002151 564652252 565508308
1321.2 565508308 566754646 567464066 567642708 567874870 567913246 568566437 568776474 568472023 568366547 568208923
1330.9 568208923 568194733 568439369 568731270 568570824 568276939 567883797 567767792 567486076 566981812 566854744
1340.5 566854744 567086983 568073196 568649826 568972435 569297295 569447861 569653130 569688835 569959908 569534912
1350.2 569534912 569229546 569206467 569203148 569420662 569270401 569358940 569278679 569216805 568788109 568391800 568047867
1360.8 568047867 567484856 567024689 565485764 565780067 566126938 565855637 565800133 565138397 564993095 564972801
1370.4 564972801 564816895 564506950 563990021 562724266 561526985 561861076 562387276 562551880 562169762
1379.1 562169762 562230034 561962776 561353760 560359573 558470001 557425766 556860428 556315765 554712563
1387.8 554712563 554239960 554707756 554059296 552931061 551854935 551435394 549509048 546819992 546021500
1396.4 546021500 544819336 543560333 541184807 540255852 540098686 539216385 538618431 538087463 536195908
1405.1 536195908 534151611 533390198 532394753 531284866 530052681 528859787 528545303 528462868 528341484
1413.8 528341484 527855606 527289543 526675949 526140289 525943298 522557564 522795525 524774551 525912094
1422.5 525912094 526396828 525518074 526430855 527868462 527988091 528192444 528293304 528284760 528810043 529828529
1432.1 529828529 530507355 530861626 532102585 533522263 533976021 534789047 536195297 536638565 536743469
1440.8 536743469 536985779 537283249 538141899 538787842 539853745 540933342 541564751 541563187 542198257 542888870
1450.5 542888870 542692833 542926292 543265724 544426956 545248032 544780121 544517479 544377289 546947289
1459.1 546947289 548687057 550447655 551090164 551518402 552975349 552331848 553293762 555222282 557337570
1467.8 557337570 559019547 560904198 563789062 565657806 566391068 566814346 569727325 572800446 573534851
1476.5 573534851 574651375 576699028 578524666 580191498 581379547 582596436 584125404 585279770
1484.2 585279770 586088600 587086754 587260132 586996803 588638992 588981056 588075829 588797913 589347610
1492.9 589347610 588939323 588324547 587838020 583064690 583331223 582415810 578734207 578902130 578309669
1501.6 578309669 577380447 576982651 577819977 577592888 570082283 565587196 568069878 570522804 570035210
1510.2 570035210 571187820 570886803 569756813 570706558 570301132 570372887 568651924 565166397 567011642
1518.9 567011642 569396553 568772812 564888306 565456810 567296600 569504585 569000053 569264336 570315475
1527.6 570315475 569728050 570712547 571972733 572966461 574149857 573883057 571779327 573828468 575675621
1536.3 575675621 576865730 579004974 576975861 571131897 574235573 575478973 575967674 578901901
1544 578901901 579927711 578504868 580553474 581571350 582430267 582161827 581094055 582482567 582987251
1552.7 582987251 584094696 582119598 581669464 584295044 587451859 588227882 579952888 578319244 578789902
1561.4 578789902 580069695 579665337 578731384 576319962 574281158 574174347 573381996 573177109 567630463
1570 567630463 566734505 565854416 563223190 561277657 559235229 558174057 548027954 547590179 547210274
1578.7 547210274 545477600 543394775 539867172 537311363 532964783 530237808 526534691 523112946
1586.4 523112946 519852066 516141891 513998146 509671173 507278900 503358650 500920219 498111649
1594.1 498111649 493870964 491570091 487457123 485240173 481715622 479808846 477025833 474467506
1601.9 474467506 473005867 469515877 468154640 465095901 463745728 460604095 458846512 457716789
1609.6 457716789 454990997 455126114 452975655 452255974 450203896 450562019 450680313 445012093 446831856
1618.2 446831856 445662270 445848465 444352684 445409164 445966759 443585815 444713821 444842796 447475891
1626.9 447475891 446941223 447219429 447463493 447850723 449200058 449578667 451831818 452218513 452101517
1635.6 452101517 452265167 455179825 456431198 457598495 459662209 459676323 461431007 461459999 463388100
1644.3 463388100 465506058 465024109 466305084 464272461 467297859 469208488 472002525 473839455
1652 473839455 470902176 466753197 467546349 471694565 472840424 474421501 475743752 477221718 478479843
1660.7 478479843 479862251 481859932 481194992 483770676 485084190 486797180 489152107 491548271
1668.4 491548271 493381538 494126740 498253098 499390488 502554436 506059723 508001823 509710579
1676.1 509710579 512400436 516015968 518228874 521475716 523535118 527628174 532934113 533745728
1683.8 533745728 535066605 538140717 543534660 546952095 549859695 553399544 555649986 559448967
1691.5 559448967 563260727 567247620 571575317 575379601 575041542 579478111 584861984 590277748
1699.3 590277748 593444290 590379982 596828194 601498566 605075912 607931061 610421448 611981850
1707 611981850 614329338 618038635 620492630 622018509 623823433 626158600 629082527 630132370 630630646
1715.6 630630646 634214745 636607361 632367554 635134239 638176880 640247116 641995850 642823715
1723.4 642823715 643460083 644786377 645970230 646507416 647862854 650250320 650466156 650345688 653730850
1732 653730850 657673721 655950546 651366730 655313950 658772507 660094833 662192764 663063278 662030182
1740.7 662030182 665472183 668106613 668327179 669555588 672515182 675049667 676300430 677173920 678500671
1749.4 678500671 682426071 682793655 683622437 688459778 691068268 693544922 696094055 695650482 697119827
1758.1 697119827 699744110 701833649 704168396 703077393 703441391 706704483 708570251 709975815
1765.8 709975815 711712418 713182297 711257019 712893372 716825333 717302856 715185089 714052048
1773.5 714052048 717687531 719138565 717829895 719980469 721610870 723185349 723655853 722956238 723778534
1782.2 723778534 725277100 726896057 726381912 726241150 727365036 727937469 728644257 730390701 731184769
1790.9 731184769 731566696 730203705 729588242 732917786 733805847 733077316 733985672 735365829 735733566
1799.5 735733566 734532394 736181412 736353455 736542435 737967377 738359909 739355011 739996109 739788666
1808.2 739788666 740108490 741036072 740550995 741359482 742562714 742714844 743617630 743911057 744566116
1816.9 744566116 744262238 744115906 744853134 744966125 745673447 745520248 746679153 747890091 745595627
1825.6 745595627 745843735 748064575 750115814 750311356 746872864 747425919 749446869 749300232 749415359
1834.3 749415359 750053406 750951538 751411438 750940781 751965790 752087097 752322845 752408295 753210144 753448486
1843.9 753448486 748326492 750635834 753200073 753569031 753753281 754465866 755349655 754912796 754973068
1852.6 754973068 754885406 755047913 755090942 755035324 755348358 755462418 756465759 756742096 757041931 756945190
1862.2 756945190 756823959 757046280 757137070 757776947 757461319 758211060 757908630 756617126 757189789 757883987
1871.9 757883987 758683701 758759155 758899841 758593369 758600082 758759766 758797150 759277191 759234772 759562073
1881.5 759562073 759611511 760181656 760690994 760448380 760182190 760015793 761076508 760635071 758689041
1890.2 758689041 759154434 760161209 760284195 760908051 761132126 760201340 760910797 761283417 761349792 761199493
1899.8 761199493 760647354 760505371 760608521 761414490 761297379 761394119 761892624 761881943 761476517 761259308
1909.5 761259308 761315155 760918427 761541824 761586761 762046280 762550201 762724152 763879700 761974792 761090317
1919.1 761090317 761767807 762154083 762688522 761265793 760714951 761740341 762729416 762871704 762700577
1927.8 762700577 762343445 762137909 762155228 762029190 762031937 761239624 761553421 762108231 762117157 762181931 762165146
1938.4 762165146 762829742 762552795 762981644 762769623 760606079 761028671 761915512 762096100 761834793
1947.1 761834793 761788330 762048950 762253113 761886292 761485443 761514282 761329651 761196136 760858917 761121674
1956.7 761121674 761228943 761109543 761484222 761420212 761263428 760948563 760836945 760545731 760619507 760927963
1966.4 760927963 760111160 759563599 759727020 760466766 760970154 761208725 761146469 760652695 760592041 760593338
1976 760593338 760282364 759825516 759991455 760338211 760791245 760849152 760444489 760606995 760313797 759827042
1985.7 759827042 759476929 759436798 759144058 758880463 759767609 760083618 759302444 758935242 759413605 759531021
1995.3 759531021 759447021 759174652 758426208 758186417 757982330 758237762 758290100 758433380 758831329 758699112
2005 758699112 758846283 758564835 758180695 757598419 757166824 757108154 756944122 757011871 757246628 757979126
2014.6 757979126 758194199 758063126 757549133 757119446 756838074 756183090 756073761 755717468 756094818 756419296
2024.2 756419296 756289291 756711502 756917648 757186584 756634903 755958405 755186234 754515152 754319687 754034729
2033.9 754034729 754408569 754870224 755479126 755649872 755769348 755859451 755455627 755146637 754164352 753363571
2043.5 753363571 753026886 753260193 753622589 754148636 754682236 754593048 754957733 754930420 754855118 754393311
2053.2 754393311 753353043 752837677 752743607 752866287 752502289 752987061 753967133 754587479 754500732 753828278
2062.8 753828278 753519745 752651596 752261887 752207413 751950378 751938324 752292404 752856827 753164978 753764801
2072.5 753764801 753584290 753061066 752577667 751908722 751521912 751289062 751566162 751757126 752068176 752475739
2082.1 752475739 752852859 752727814 752488174 752395325 751329803 750786057 750643387 750630417 750822754 751196747
2091.7 751196747 751739807 751771774 752079468 751946411 751624680 751011734 750512695 750328979 749660034 749705734
2101.4 749705734 749841385 750234528 750179825 750097427 750708694 750499802 750160065 749719086 749408951 748747330
2111 748747330 748287201 748291779 748285141 748890076 749021225 749516678 749964676 749710770 749088287 748339081 748157654
2121.6 748157654 747788086 747603455 747563095 748012314 748599625 748503036 748367996 748684158 748872681 748113174
2131.3 748113174 748017960 748037796 747757263 747641907 747437286 747666855 747770309 748177261 748220520 748161316
2140.9 748161316 748225098 748059235 748135757 747624054 747431946 747425232 747570801 747974472 748218460 748420868
2150.6 748420868 748295593 748292465 747815857 747553635 747528992 747249985 747126999 747039566 747168045 747414322
2160.2 747414322 747917404 747661743 747743988 748311310 748077698 747997131 747737427 747602692 747515640 747381821
2169.9 747381821 747288666 747499924 747726593 747353439 747492523 747513046 747638550 747609634 747463455 747648697
2179.5 747648697 747263412 747457123 747770157 747704697 747583160 747489777 747593994 747690735 747646255 747572784
2189.1 747572784 747749100 747615738 747777634 747610931 747513504 747659302 747237473 747663956 747738037 747800293
2198.8 747800293 747971344 747895355 748007965 747665558 747726746 747554855 747611465 747604370 747264633 747190933 747343674
2209.4 747343674 748297043 748458481 748301315 748253098 748199005 748236542 747943954 747855072 747635727 747716522
2219 747716522 747613983 747510910 747466507 747579803 747911606 747608414 747772522 747803726 747844696 747681580
2228.7 747681580 747368240 747598343 747464981 747471390 747325821 747703629 748012924 747925949 748073120 747763214
2238.3 747763214 747508087 747071457 746959610 746781158 746896210 747346725 747178497 747355194 747526398 747469406
2248 747469406 747029572 746950912 747012787 746942368 746938629 746501007 746762161 746901932 746881027 746842422 746930084
2258.6 746930084 747169647 746874084 746889420 746499329 746291580 746195450 746130829 746374893 746564789 746781540
2268.2 746781540 746185837 746290131 746338043 746045303 746225891 746107864 746202393 746182861 746360321 746208267
2277.9 746208267 746011353 745816040 745564804 745724564 745533371 745535202 745132828 745166168 745332031 744916992
2287.5 744916992 744879837 744934311 745424042 745441895 745425644 745067215 744542999 744751053 744711227 744596558
2297.2 744596558 744057388 744369888 744755707 744442139 744060898 743593674 744139328 744072113 743489761 743244400
2306.8 743244400 743743744 744457855 744240723 744103546 743703766 743631744 743586731 743355255 743092499 742835541
2316.4 742835541 742907486 742440338 742569275 743126450 743892441 743838272 743243790 743031464 742238388 742226105
2326.1 742226105 742179337 742495575 742274551 740897293 740427551 740376511 741203613 741995239 741953278 741637039
2335.7 741637039 741684952 741378860 741188660 741089249 740707016 741122589 740737076 740726852 740485458 739842987
2345.4 739842987 739501190 738428192 738071747 739090347 741226120 741495056 740461426 740439835 739935455
2354.1 739935455 739472351 738841248 739500122 739318695 738820572 739051514 738865280 739674683 739459000 738834457
2363.7 738834457 737606125 737332306 737911530 737716217 737346191 737361298 737822952 737056808 736437607 735609512
2373.3 735609512 734950867 735217438 735318680 735463257 734952393 734135284 733861465 734277267 734201126 733838272
2383 733838272 733849869 733365326 733082352 732911530 732660446 732271729 731807404 731949158 732269897 732187881
2392.6 732187881 731568909 731275406 731144943 730989761 730861435 730409927 730090408 730060577 730209198 730110626
2402.3 730110626 730256042 730240097 729919052 729735947 729223938 728959503 728507080 728234787 728248367 728116531
2411.9 728116531 728156128 728040848 728132172 727906952 727331848 726689606 726190186 726109695 726028366 725953293
2421.6 725953293 725764008 725592651 725193481 725000381 725038223 724613190 723911438 723794174 724402771 724066925
2431.2 724066925 723482056 723146973 722880554 722832642 722331619 722365417 722445297 721948624 721383514 721052475
2440.8 721052475 720762863 720425339 720421295 720194397 720083847 719898987 719891129 719993668 719571838 719152603
2450.5 719152603 718439560 718035278 717694855 717076416 716781998 716875992 716959686 716881866 716976166 716452255
2460.1 716452255 715945740 715648270 715401154 715360870 715104904 714867401 714111252 713814621 713890915 713686142
2469.8 713686142 713437576 713132172 713214340 712696686 712171021 711898880 711441269 711151047 710890732 710698090
2479.4 710698090 710408783 710491180 710151825 709571915 709453049 709083557 708620071 708127060 707656631 707268219
2489.1 707268219 707126083 706860809 706832962 706792908 706367493 706119080 705478058 705569458 705626678 704869766
2498.7 704869766 704226456 703662643 703782578 703675766 703487701 703220901 702564316 702133713 701698532 701379776
2508.3 701379776 700762253 700308533 700166092 700048141 699927979 699753723 699917145 699742279 699177551 698823395
2518 698823395 698658142 698197327 697769470 697249756 696666641 696855316 696874466 696570129 696077576 695615082
2527.6 695615082 695471725 695373993 695032501 694254837 694049988 693963013 693832474 693612289 693123093 692911606
2537.3 692911606 692573318 692485580 692245789 692218018 692234802 691390839 690640106 690396194 690824127 690834351
2546.9 690834351 690081711 689437256 689305191 689509277 689498520 689050751 688098221 687863007 687774200 687551498
2556.6 687551498 687750397 687647858 687564468 686892395 686074448 685734329 685419998 685406494 685475922 685314407
2566.2 685314407 684822311 684482422 684179382 683772125 683694382 683879471 683725204 683183594 682912140 682578430
2575.9 682578430 681999130 681369324 681318741 681425552 680969696 680719833 680404205 680061722 679849396 679488373
2585.5 679488373 678981323 678758011 678988953 679134293 679280777 678890610 678259659 677905350 677727356 677595062
2595.1 677595062 676953430 676368866 676036758 675967331 675864944 675609665 675514603 675238724 674913712 674475174
2604.8 674475174 674075623 673552017 673073349 672923737 672771683 672730865 672437363 672008896 671660156 671509552
2614.4 671509552 671377258 670972290 670414581 670012360 670175858 669725266 668887482 668819580 668986053 668856735
2624.1 668856735 668435364 668146591 667929153 667609406 666920242 666145630 665606079 665201111 665146561 665126114
2633.7 665126114 665020523 664751434 664652023 664442291 663825912 663454590 662953033 662374115 661968079 661803513
2643.4 661803513 661776428 661587677 661227264 660900574 660933304 660699539 660261002 659906921 659294662 658751755
2653 658751755 658702240 658455811 657885132 657957153 657933807 657786636 657820053 657607956 657369003 657000198 656891098
2663.6 656891098 656659164 656052322 655492249 655173416 655116425 655055237 655259399 655255356 655002289 654721146
2673.3 654721146 654319611 654091873 653989029 653808823 653222504 652823715 652860870 652925797 652844009 652514114
2682.9 652514114 651994858 651475525 651356964 651160660 650978088 650806885 650210190 649771576 649732437 649846802
2692.5 649846802 649773178 649694214 649476852 649027100 648510666 648081818 648048325 648059464 648168030 647914200
2702.2 647914200 647302094 647062073 647108078 647098846 646910858 646953125 646797485 646471939 646257706 645998840
2711.8 645998840 645670547 645249863 645228195 645304031 645307083 645029678 644657516 644561920 644293900 643854599
2721.5 643854599 643304672 643311310 643485260 643282776 643108673 643132706 643353653 643181076 642751007 642114182
2731.1 642114182 641592102 641404343 641323471 641035461 640529480 640762939 640891724 640770111 640746384 640596771
2740.8 640596771 640741119 640825043 640636444 639997177 639712791 639625664 639286766 639388847 639581642 639652405
2750.4 639652405 639479675 639160080 638503113 638281670 638324509 637643700 637278366 636990776 636811600 636835060
2760 636835060 637177925 637542648 637149696 637097130 636915016 636261520 635662994 635383110 635349083 635008888
2769.7 635008888 634764709 634726295 634822350 634789162 634889832 634918289 634525337 633951073 632889328 632301712
2779.3 632301712 632385559 632460175 632212067 631941872 632021904 631967163 631820068 631367187 631118584 630962639
2789 630962639 630272369 629642372 629304581 629467812 629256401 628439827 628279228 628591766 628273735 627481270
2798.6 627481270 627066841 626727295 626332054 625957489 625066414 624367409 624363098 624091110 623973618 623906174
2808.3 623906174 623436012 622934761 621775436 621108055 620951347 620448112 620175323 619775658 619429398
2816.9 619429398 619042587 618923912 618613167 617843132 617553482 616989365 616293716 615753708 615403442 614895439
2826.6 614895439 614013367 613393517 612989998 613123398 613029823 612277718 611280785 610371170 609685669 608832245
2836.2 608832245 608223038 607563019 606622200 605511703 604744987 604138489 602726784 601708527 601068726
2844.9 601068726 599798660 598468018 597176704 595328178 593568153 592530556 591835556 591080894 589873123
2853.6 589873123 589327431 589548531 589565315 589072189 588618584 589184265 589351273 588989754 588609543 588186684
2863.2 588186684 588049545 587616463 587430496 587030640 586341515 585966339 585399437 584867058 584392319 583830643
2872.9 583830643 583117523 582608414 582245560 581988869 581940117 581419411 580842400 580712624 580496368 579709358
2882.5 579709358 578937378 578336525 577701263 577421799 576902199 575932579 574904404 574406700 574348793 573574600
2892.2 573574600 572609406 572239418 571714745 570937996 570575905 570266876 569678993 569319611 569115372 568500671
2901.8 568500671 568039703 567755585 566938896 566279373 565495987 564596062 563941917 563159676 562542725 561555290
2911.4 561555290 560656281 560004387 559050217 558112297 557055435 556127815 554922676 553359718 551944733
2920.1 551944733 550783157 550127182 549975510 549742432 548933907 548530388 548722687 549027557 549215240
2928.8 549215240 549379158 549404678 548622475 548531036 549293327 549462090 549441414 550135307 551122513 551541176
2938.5 551541176 552140045 552846336 553390694 554066505 554250603 554056854 554382820 555248375 555967026 556641579
2948.1 556641579 557042122 557390709 558052940 558450317 558600388 558349342 558144150 558296013 558544769 558884811
2957.7 558884811 559226761 559674339 560336342 561194954 561527596 561436501 561651382 562491646 563261261 563388710
2967.4 563388710 564006195 564788971 565113220 565283356 565789108 566472778 566697884 567056618 567282143 567596130
2977 567596130 568104401 568203354 568465042 568590050 568670387 569201889 569477997 569337845 569481125 569765778
2986.7 569765778 569742508 569404640 569464951 570333443 570602417 570453911 570544090 570278587 569983139 569946938
2996.3 569946938 570096092 569937134 569637985 569366722 568770638 568367691 568468056 568433228 567598495 566915092
3006 566915092 566862717 566962090 567098007 566776466 566384773 566169624 565601120 565028915 564682884 564081192
3015.6 564081192 563443375 563232841 563311424 563201294 562533531 561820793 561433945 561175995 560529404 559697380
3025.2 559697380 559294243 558785172 558092232 557485161 557355080 557363968 556576576 555597763 555063438 554953766
3034.9 554953766 554429131 553483391 552919350 552582512 552495155 552116165 551302528 550669098 549887390 549112167
3044.5 549112167 548773727 548345795 547655983 546873779 546159210 545844383 545616455 545142365 544544067 544247932
3054.2 544247932 544001732 543225403 542269249 541505203 540956116 540211334 539574699 539240799 538990135 538931122
3063.8 538931122 538512077 538131142 537538300 536793938 536708450 536318779 535639648 535006027 534465942 533834419
3073.5 533834419 533129387 533000717 532831345 532288437 531673393 531112061 530679741 530511284 530225143 529607925
3083.1 529607925 529108887 528399467 527850151 527732162 527466927 526753235 526047249 525882492 525553856 525253716
3092.7 525253716 524884109 523870697 522907906 522332649 522200813 522187958 521890678 521205254 520552902 520339317
3102.4 520339317 519659843 518430786 517849312 517952118 517984505 517618904 517065353 516616554 516006851 515533600
3112 515533600 515034065 514187584 513840942 513471565 512842407 512398300 511935997 511654778 511247253 510398293
3121.7 510398293 509340096 508590012 508323631 508297615 507842331 507100601 506708183 506052132 505440178 505017242
3131.3 505017242 504284668 503383522 502913399 502877655 502372971 501957779 501461449 500540276 499770508 499148865
3141 499148865 498740807 497973213 497496796 497081413 495979080 495406342 495103188 494483643 493943977 493711891
3150.6 493711891 493323708 492673340 492044182 491319962 490650673 489934158 489439926 488867607 487866707
3159.3 487866707 487088661 486678581 486510239 485978165 484841042 484060631 484070320 483682251 482523651 481796112
3168.9 481796112 481518555 480863228 480223961 480134239 479635353 478693314 478140793 478131561 477761154 476161232
3178.6 476161232 475071449 474577217 474092865 474150772 473713570 472902260 472354660 471859245 471194725 470404625
3188.2 470404625 469815025 469252052 468589897 468207703 467952728 467150764 466689034 466538963 465826149 465111313
3197.9 465111313 464680443 464665527 464018593 462850151 462265015 461829414 461550789 461006050 460180473 459575043
3207.5 459575043 459434891 459419518 458667336 457846870 457485619 457397385 456925697 456098518 455765305 455553360
3217.2 455553360 455257950 454448662 453139076 452773628 453076820 452537231 451590347 451319389 451247673 450982780
3226.8 450982780 450329628 449484787 449162140 449006577 448887634 448402519 447407303 447096329 446757240 446073647
3236.4 446073647 445598450 444813347 444527664 444672890 444552002 444150772 443694191 443644981 442839928 442004471
3246.1 442004471 441931343 441302071 440297432 439506111 439691162 439943390 439284248 439097633 439248543 438649826
3255.7 438649826 437660141 436995087 436632309 436238022 435563583 435228119 435412560 435019760 434402733 434017372
3265.4 434017372 433733139 433551254 433187256 432764626 432462082 432167397 432035751 432137146 431472054 430873604
3275 430873604 430965805 430373116 429827271 429417648 428876839 428613091 428408585 428458176 428042641 427337227
3284.7 427337227 427148209 426907692 426457787 426411324 426502266 425999718 425311203 425012169 425269508 425129547
3294.3 425129547 424520416 424444427 424059181 423474464 423209419 422721558 422206268 421754150 421518097 421648674
3303.9 421648674 421727943 421189804 420206184 419710083 419886284 419988556 419706383 419325180 418637352 417948608
3313.6 417948608 417921791 417605133 416691437 416346016 416162415 415487785 414973259 414390984 413614807 413268738
3323.2 413268738 413034706 412605133 412155457 411510353 410862236 410515938 410181236 409633484 408726616 407979813
3332.9 407979813 407692642 407290688 407148705 406917725 406150093 405645905 404910011 404034882 403773193 403474159
3342.5 403474159 402703438 401764221 401383247 401306114 400704918 400163918 399816666 399541588 399315948 398541489
3352.2 398541489 397840385 397467537 396831665 396337929 396180229 395943947 395678024 395162010 394035530
3360.8 394035530 392988930 392287674 392156754 392526550 392498856 392415123 391970825 391114311 390669022 390147133
3370.5 390147133 389305115 388637352 388652840 388523102 387867737 387755013 387678757 387199440 387070885 386778564
3380.1 386778564 385941124 385646744 385524216 385274239 385303040 384904251 384378815 383790855 383472252 383690987
3389.8 383690987 383821449 384232674 383995323 383070602 382467346 381987953 382311668 382621346 382213211 381944771
3399.4 381944771 381625481 381359825 381356239 381204643 380912247 380908127 380728340 380261421 380352859 380251503
3409.1 380251503 379807777 379953613 379994278 379542923 379319878 379415855 379575119 379989777 380078583 379983330
3418.7 379983330 380413513 380388222 380325279 380303116 379440308 379057274 379801941 380493240 380462914 380463295 380368118
3429.3 380368118 380019264 380224533 380978508 381397934 381082077 381273689 381696320 381705170 381748772 381886139
3439 381886139 382269745 382566948 383124542 383234253 383102226 383657188 384290123 385008698 384667702 384500046
3448.6 384500046 385202980 385790291 386273346 386405525 386952705 387623215 388364067 388638992 388668785 389528160
3458.2 389528160 389763374 389940147 390732040 391909676 392612991 392310600 392555923 393584213 394611015
3466.9 394611015 394999313 395758629 396622925 397138214 397637978 397744942 398533783 399446220 400266724 401123505
3476.6 401123505 401384926 401500473 402096634 403611526 404545708 404911613 405327110 405761642 406843414
3485.2 406843414 407717514 407933273 407987709 408582268 409301987 410241394 411506500 412231560 412869301 413732185
3494.9 413732185 414833374 415601158 415936546 416448593 417256432 418324051 419666023 421271095 421784325
3503.6 421784325 421637955 422198067 422848206 423354645 424753952 425909882 425838394 426725807 427484512
3512.2 427484512 428510323 429964027 430561714 431251831 431669617 432508926 434106560 435793495 436961670
3520.9 436961670 437604713 437890663 437452698 438253441 439653854 441178513 442738113 443620987 444266510
3529.6 444266510 445012016 446068649 446491089 447485428 448783951 449981956 451049271 451093330 452202339
3538.3 452202339 453668556 455156441 456477013 457697906 458639946 458756332 459844360 461170006 462551804
3547 462551804 462831116 463963432 465972862 467480469 469673271 469447136 469662895 470954819 472657776
3555.6 472657776 474512367 474874840 476548729 477401314 478335762 480267067 482338104 483963432 484476776
3564.3 484476776 487738762 488461838 488489075 489331665 488476753 491338043 493052177 494505005 496397285
3573 496397285 498190460 499370499 500400085 502742233 503217316 504762421 506617661 507226562 508627014
3581.7 508627014 510745926 512548599 513659782 517532425 518577728 517273483 519354477 519066811
3589.4 519066811 521926079 524636002 526882668 527836647 528868675 531925125 530632515 532910957
3597.1 532910957 536354141 537173958 539543877 540000458 540606804 542827797 544936371 546400032 549092636
3605.8 549092636 552659225 552531052 555058060 555164986 554853096 561338043 563307114 561203156 563590431
3614.5 563590431 564017334 568051643 571773682 572129898 573577995 572825165 574723511 577974892 580025330
3623.1 580025330 581860313 584050522 586249275 589009476 595900574 597527580 587786026 590490685
3630.9 590490685 594732590 600420761 602562485 601043053 603491096 606564217 608440666 608877792
3638.6 608877792 610123596 612527885 615337105 616455307 617062721 620492477 625105896 630922470
3646.3 630922470 630002327 626169128 630824623 630132942 628442955 629292145 633835907 637646103 641794510
3655 641794510 648127899 641968460 641800919 646803818 648519745 650167465 651217270 652825165 653665619
3663.6 653665619 654838104 657046204 658656540 662256088 663681793 662868042 663404236 657628326 660225830
3672.3 660225830 668430862 677286301 677876282 660320511 662622223 670756073 675449295 673084717
3680 673084717 672944489 675016785 676784363 678739777 678795319 678914185 682802963 689081268 681537247
3688.7 681537247 677276230 684593964 679479446 679324570 684723587 686112976 688200455 688284988 687084351
3697.4 687084351 687817993 688499756 691486511 694574661 688927307 685976105 690270996 691833649 692043457
3706.1 692043457 692974472 696154633 700205536 693029099 695806046 699210052 686385040 690815582
3713.8 690815582 694839325 694937973 696494446 699633789 701273422 697468719 697785263 703386154 699909821
3722.5 699909821 694483566 699358749 701382980 701174927 698232880 697367935 701216507 702981262 707665176
3731.2 707665176 704898148 698136826 706910629 708883438 698533020 697063217 699841003 700942535
3738.9 700942535 703017273 706566544 703128815 705100174 716915741 707698898 690979004 701202316
3746.6 701202316 706898499 712167816 708727188 699537964 708792419 700905380 695209274 701653137
3754.3 701653137 705832062 709159775 705380554 707415619 712208786 704595947 702480927 706130447
3762 706130447 707338181 708161392 712289047 709880676 704343491 707273254 712673569 713396225 704555817
3770.7 704555817 705978394 708747025 709011230 710070572 709194183 709587326 710092163 712734985 713096313
3779.4 713096313 705319443 706994629 709151154 710487213 712989807 710087662 708371811 709292450
3787.1 709292450 710341110 710768585 710340271 710763855 710335312 710320511 710603561 712295761 715739975
3795.8 715739975 712300720 707887878 709616470 714359589 721101608 715069580 704278183 706662064
3803.5 706662064 709369049 714490509 719975281 710550079 705207825 709750214 712313309 712379303 712067184
3812.2 712067184 711638947 712716827 717650223 716271667 703925247 708794708 714712601 719195938
3819.9 719195938 720334167 702088928 704006805 709850082 711686020 714280472 714446335 710443039
3827.6 710443039 710500336 712214584 715800629 717328720 708348236 710811996 718306732 713429642 712809753
3836.3 712809753 720731430 712792511 707850189 714553986 708466187 708196259 715252609 713418808
3844 713418808 709607315 711449585 712488098 713243561 715213242 713861313 715943298 722493439 717947083
3852.7 717947083 717863235 700740891 702818985 714517975 714062424 711433334 712749786 714255600
3860.4 714255600 715896301 710562897 711516266 717835007 711913605 707998962 711647263 715891266
3868.1 715891266 722040329 714554596 704306259 707626648 713670654 717484589 707849808 708331909
3875.8 708331909 712598267 712838211 715063705 718983078 713283234 706271439 711896286 713338623
3883.5 713338623 714908600 718859634 705583267 706887894 711228638 712714615 717157898 715919876
3891.2 715919876 708151398 709105988 712101212 711242599 712552567 713668442 715740891 717447052 707935104
3899.9 707935104 712533646 715497513 710583572 713930588 709731140 707696609 708608856 710073776
3907.6 710073776 711799698 711014709 711539993 711809006 711944733 711681976 711222992 712604141 714640961
3916.3 714640961 711966553 708782425 712564621 711885757 708510132 711127930 712477341 713204651 711174088
3925 711174088 708930435 711042099 712413712 713240967 711739578 710735168 712833023 710996704 708977966
3933.7 708977966 709281082 709540253 711040268 711764755 711004486 710628128 710429687 711626282 712933578
3942.3 712933578 709682922 708710175 709965363 710254745 711041031 709478760 710061798 710934982 708997345
3951 708997345 710527649 710842896 709251709 709006500 709901733 710502853 709466324 709890594 710116959
3959.7 710116959 710142365 710723495 709803009 709145584 709306183 709573364 709424591 709431076 709623337 709405823
3969.3 709405823 709170227 709750519 710020599 709407272 709810181 709709396 709248886 709493027 709908447 709976044
3979 709976044 709460220 709710236 709954605 710303421 710416489 710209961 709981308 709121552 709031754 708948212
3988.6 708948212 709001007 709173813 709303513 709944077 710033112 709618530 708604660 708425446 708810501 708801498
3998.3 708801498 708630066 708693924
4000.2 708693924
##END=$$ End of the data block
