##TITLE=$$ Begin of the data block
##JCAMP-DX=5.00 $$ ACD/SpecManager v 10.08
##SPECTROMETER/DATA SYSTEM=Varian
##DATE=15 Jan 2013 15:07:18
##DATA TYPE=INFRARED SPECTRUM
##DATA CLASS=XYDATA
##ORIGIN=
##OWNER=
##NPOINTS=3735
##FIRSTX=399.26403809
##LASTX=4000.35498047
##MAXX=4000.35498047
##MINX=399.26403809
##MAXY=76.54243469
##MINY=37.97310257
##XFACTOR=1.0000000000
##YFACTOR=0.000000100000000
##FIRSTY=58.92804337
##DELTAX=0.96440572
##XUNITS=1/CM
##YUNITS=TRANSMITTANCE
##XYDATA=(X++(Y..Y))
$$ plain form
399.3 589280434 581983147 579017143 577917328 568850136 567359009 560392418 557750359 563147583
407 563147583 561611519 563051949 558132324 557039490 563711548 563327522 563069725 563202782 561500282
415.7 561500282 561032066 563674660 568861389 569031372 562608032 559676018 559876480 561442490 561724014
424.3 561724014 556571732 555213203 559729233 563938370 566878929 566257973 566714439 569514275 571272240
433 571272240 568567734 564905319 567451553 568115540 563618240 561631317 561437912 560205650 560835075
441.7 560835075 562562332 565198860 567209435 565819588 560428238 552199898 554835052 559444580
449.4 559444580 558998718 561781197 560836601 558332329 561248245 561776161 560368729 558320045 550955849
458.1 550955849 551434669 557963982 561945381 561319809 559768295 560393791 560173149 555859032 552751236
$$ packed form
399.3E89280434p297287k966004j099815r067192j491127o966591k642059N397224
407E63147583j536064J440430m919625j092834O672058l84026k57797J33057j702500
415.7E61500282m68216K642594N186729J69983o423340k932014K00462J566010K81524
424.3E61724014n152282j358529M516030M209137K940559o20956M56466K799836J757965
433E71272240k704506l662415K546234O63987m497300j986923j93405j232262O29425
441.7E60835075J727257K636528K010575j389847n391350q228340K635154M609528
449.4E59444580m45862K782479r44596k504272K915916N27916j407432k048684p364196
458.1E50955849M78820O529313L981399o25572j551514O25496k20642m314117l107796
$$ plain form
466.8 552751236 551414642 551909714 552851410 553412132 553258133 551508560 551460190 550646515 550995598 553848267
476.4 553848267 557205582 556393661 551151810 550177612 548243179 544144630 545529137 547885742 548992157
485.1 548992157 549974556 549375916 546401863 543885612 546072235 549354210 550564346 549247131 546157875
493.8 546157875 546081009 550685921 551973839 547194023 544381332 544435005 544799347 547485886 548790932
502.5 548790932 547212105 549074478 551562729 550850792 549487343 548125916 546403008 545987358 546179733
511.1 546179733 545456123 543962173 543269005 544018364 544059181 543773422 543579903 543858185 544083061 542343407
520.8 542343407 541707573 541923714 542072792 543370132 544328651 544404945 543265877 542262077 542031288
529.5 542031288 541224060 540722008 540703278 541290741 540972214 540068054 541286240 542140083 542405167 542318192
$$ packed form
466.8E52751236j336594M95072R41696N60722j53999j749573m8370q13675L49083K852669
476.4E53848267L357315q11921n241851r74198j934433m098549J384507K356605J106415
485.1E48992157R82399n98640k974053k516251K186623L281975J210136j317215l089256
493.8E46157875p6866M604912J287918m779816k812691N3673L64342K686539J305046
502.5E48790932j578827J862373K488251p11937j363449j361427j722908m15650J92375
511.1E46179733p23610j493950o93168P49359M0817k85759j93519K78282K24876j739654
520.8E42343407o35834K16141J49078J297340R58519P6294j139068j003800k30789
529.5E42031288q07228n02052j8730N87463l18527r04160J218186Q53843K65084q6975
$$ plain form
539.1 542318192 541861610 542312889 541510391 539177628 536712875 535055351 534764099 535403099 536406288
547.8 536406288 537462997 538618927 538532143 538749123 538318939 535748863 533409729 531638718 531919212
556.5 531919212 533780174 535815582 537315178 538002586 537964783 536366959 535846786 536689606 536071320
565.1 536071320 533688927 532140236 533185463 533518639 533573799 534497337 535010605 534364700 533064919
573.8 533064919 532188606 531043892 530664177 530970764 530853767 531859703 534179192 534620361 533997383
582.5 533997383 534011345 533343925 532499886 531184654 531093369 532893639 533685532 533242455 533122635 534120979
592.1 534120979 534369354 535476303 536588058 536584740 537515678 537925873 538739700 538224258 536755714 537006721
601.8 537006721 537145729 537708969 537252884 536730347 537014198 536319656 535725021 535181351 534840126 535206490
$$ packed form
539.1E42318192m56582M51279q02498k332763k464753j657524k91252O39000J003189
547.8E36406288J056709J155930q6784K16980m30184k570076k339134j771011K80494
556.5E31919212J860962K035408J499596O87408l7803j597824n20173Q42820o18286
565.1E36071320k382393j548691J045227L33176N5160R23538N13268o45905j299781
573.8E33064919q76313j144714l79715L06587j16997J005936K319489M41169o22978
582.5E33997383J3962o67420q44039j315232r1285J800270P91893m43077j19820R98344
592.1E34120979K48375J106949J111755l318R30938M10195Q13827n15442j468544K51007
601.8E37006721J39008N63240m56085n22537K83851o94542n94635n43670l41225L66364
$$ plain form
611.4 535206490 536024818 535580940 534228554 533853951 534170227 534728584 535160637 535412979 534899979 534660454
621.1 534660454 534659805 535049210 536700096 537517509 538226128 539161911 539904671 539813004 538482399 538683167
630.7 538683167 540357361 542516594 544230804 545949936 548101349 548440552 548461876 548814926 549786224
639.4 549786224 551746750 552314758 552325363 553277931 554561119 555555763 556668663 557876015 558315430
648.1 558315430 558665237 559296417 558316803 556124344 556785812 559137459 560899887 561762733 561427498
656.8 561427498 561733360 561406174 560752602 561522827 562284050 562036285 560843582 559709091 560184326
665.4 560184326 563186073 565664330 563342590 564368439 565310364 565012856 563521118 563207130 564063225
674.1 564063225 564755669 566483727 567920341 568961372 569857521 570274811 570503731 571616821 572029915
$$ packed form
611.4E35206490Q18328m43878j352386l74603L16276N58357M32053K52342n13000k39525
621.1E34660454o49L89405J650886Q17413P08619R35783P42760r1667j330605K00768
630.7E38683167J674194K159233J714210J719132K151413L39203K1324L53050R71298
639.4E49786224J960526N68008J0605R52568J283188R94644J112900J207352M39415
648.1E58315430L49807O31180r79614k192459O61468K351647J762428Q62846l35235
656.8E61427498L05862l27186o53572P70225P61223k47765j192703j134491M75235
665.4E60184326L001747K478257k321740J025849R41925k97508j491738l13988Q56095
674.1E64063225O92444J728058J436614J041031Q96149M17290K28920J113090M13094
$$ plain form
682.8 572029915 570823135 571509819 572503586 572745171 573649216 574959946 577012291 578941765 579515610
691.5 579515610 578387146 577561340 577467690 577008476 576869278 578159981 579770889 579985924 579931946 580463104
701.1 580463104 581683426 582306671 582984886 583810501 582725449 582216721 582950935 584223328 585331650
709.8 585331650 586137390 587643242 588482628 589070168 589489479 588889809 587911224 587689514 587821770 588320007
719.5 588320007 589370728 590021706 591369057 592985268 594858894 595575638 594800301 594218559 593124161
728.1 593124161 594330940 595336800 594557686 595620880 597131462 598755379 600821991 602085800 600796928
736.8 600796928 599038734 598800163 599091225 599627724 599638863 600327873 601291580 602258835 603074150 602803688
746.5 602803688 602972031 603755035 605055809 605765839 605624123 605296402 604921761 605155106 606003990 608087425
$$ packed form
682.8E72029915j206780O86684R93767K41585R04045J310730K052345J929474N73845
691.5E79515610j128464q25806r3650m59214j39198J290703J610908K15035n3978N31158
701.1E80463104J220322O23245O78215Q25615j085052n08728P34214J272393J108322
709.8E85331650Q05740J505852Q39386N87540M19311n99670r78585k21710J32256M98237
719.5E88320007J050721O50978J347351J616211J873626P16744p75337n81742j094398
728.1E93124161J206779J005860p79114J063194J510582J623917K066612J263809j288872
736.8F00796928j758194k38571K91062N36499J1139O89010R63707R67255Q15315k70462
746.5F02803688J68343P83004J300774P10030j41716l27721l74641K33345Q48884K083435
$$ plain form
756.1 608087425 609537659 609166565 609604454 610967216 611227379 611338234 611567154 610767822 611268883
764.8 611268883 613489265 614613342 614269905 615048447 616666145 616730690 616263618 616136398 615685539
773.5 615685539 614586372 614588356 615900345 615784645 614507523 614882851 616850548 617315483 616435776
782.1 616435776 616354370 616522942 615651169 615561142 617006531 617743263 618201027 618906097 619931030 620683517
791.8 620683517 620288963 619469604 618726807 617921600 617002068 617320976 617106857 616457787 616354599 615711975
801.4 615711975 615541840 614091797 612410164 611649399 610216560 608481255 606988487 606536789 605846748
810.1 605846748 604571266 604124107 603700867 602381821 601346016 599133034 596291428 595989304 595999069
818.8 595999069 596405258 597155457 597537117 598453789 598806076 599575462 600092010 600490227 601904526 603498001
$$ packed form
756.1F08087425J450234l71094M37889J362762K60163J10855K28920p99332N01061
764.8F11268883K220382J124077l43437P78542J617698O4545m67072j27220m50859
773.5F15685539j099167J984J311989j15700j277122L75328J967697M64935q79707
782.1F16435776q1406J68572q71773r0027J445389P36732M57764P05070J024933P52487
791.8F20683517l94554q19359p42797q05207r19532L18908k14119o49070j03188o42624
801.4F15711975j70135j450043j681633p60765j432839j735305j492768m51698o90041
810.1F05846748j275482m47159m23240j319046j035805k212982k841606l02124R765
818.8E95999069M06189P50199L81660R16672L52287P69386N16548L98217J414299J593475
$$ plain form
828.4 603498001 605334930 607721596 610099792 611387939 613346977 616016731 618349152 619737663
836.1 619737663 620683479 622321091 623367271 625211449 626220703 626820488 628880081 630506973 632121925
844.8 632121925 633940277 635807495 635726433 635974960 636939621 636835670 637839241 639064369 640784454
853.5 640784454 641713409 642392273 643661118 645070190 647111969 647474976 647100525 647292786 648424683
862.2 648424683 649025726 649744415 651288605 651781464 651973877 651581192 651599884 650815506 649441147 648182068
871.8 648182068 646284637 644871902 644304047 645102081 645022736 645085526 645041122 644954453 645786896 644916534
881.5 644916534 644156265 642308350 640580902 640039749 639987793 641420059 641427917 640994873 640726242 640773468
891.1 640773468 640590668 639487114 639292717 639497375 639584846 639650497 640712357 641512375 642424088 643704224
$$ packed form
828.4F03498001J836929K386666K378196J288147J959038K669754K332421J388511
836.1F19737663R45816J637612J046180J844178J009254N99785K059593J626892J614952
844.8F32121925J818352J867218q1062K48527R64661j03951J003571J225128J720085
853.5F40784454R28955O78864J268845J409072K041779L63007l74451J92261J131897
862.2F48424683O01043P18689J544190M92859J92413l92685J8692p84378j374359j259079
871.8F48182068j897431j412735n67855P98034p9345O2790m4404q6669Q32443q70362
881.5F44916534p60269j847915j727448n41153n1956J432266P858m33044k68631M7226
891.1F40773468j82800j103554j94397K04658Q7471O5651J061860Q00018R11713J280136
$$ plain form
900.8 643704224 643303680 642953262 642835693 642390442 642298279 643132248 643934860 644876175 646357422 647563171
910.4 647563171 648618240 648967056 649290466 647854996 645560226 643962631 641780930 639938698 638604851
919.1 638604851 637906189 636790047 636096382 634957657 633189430 631445198 627602577 624622726 621871109
927.8 621871109 618877907 616770401 615039062 614284439 613245506 613585815 613959351 612968674 612622795
936.4 612622795 612193909 611254921 609730225 608580055 608002434 607732582 607528229 607730179 608856773
945.1 608856773 609669571 609867897 609141884 607913055 606372261 605035133 604299088 603775406 603590279
953.8 603590279 602961159 602476082 601779861 600422592 599070702 597059669 594174118 591495552 589775543
962.5 589775543 588335800 587238731 586287956 585643845 585074844 584008827 583296089 581340523 578533287
$$ packed form
900.8F43704224m00544l50418j17569m45251r2163Q33969Q02612R41315J481247J205749
910.4F47563171J055069L48816L23410j435470k294770j597595k181701j842232j333847
919.1F38604851o98662j116142o93665j138725j768227j744232l842621k979851k751617
927.8F21871109k993202k107506j731339p54623j038933L40309L73536r90677l45879
936.4F12622795m28886r38988j524696j150170n77621k69852k04353K01950J126594
945.1F08856773Q12798J98326p26013j228829j540794j337128p36045n23682j85127
953.8F03590279o29120m85077o96221j357269j351890k011033k885551k678566j720009
962.5E89775543j439743j097069r50775o44111n69001j066017p12738j955566k807236
$$ plain form
971.2 578533287 576592484 574550705 572336540 570685654 569384842 567420654 565798988 564329681
978.9 564329681 561434402 558400307 555060005 551085854 547689705 544756165 541809769 538862686
986.6 538862686 536359024 532876358 529002571 526772957 524248276 520421410 516216888 512901955
994.3 512901955 510157013 507392006 504609947 501696625 499444962 497247772 495494041 493363647
1002 493363647 491484833 490159950 487871933 486441765 484983559 483629074 483167076 483002205 482663765
1010.7 482663765 482054787 481334534 479623413 478214455 476281548 474153862 472357254 470134773 467981682
1019.4 467981682 465569153 464529114 463281021 461462784 459572105 457537117 456416397 454883118
1027.1 454883118 453137016 451215706 450042877 449127350 449080772 449364471 448528519 448532372 448189697 447987709
$$ packed form
971.2E78533287j940803k041779k214165j650886j300812j964188j621666j469307
978.9E64329681k895279l034095l340302l974151l396149k933540k946396k947083
986.6E38862686k503662l482666l873787k229614k524681l826866m204522l314933
994.3E12901955k744942k765007k782059k913322k251663k197190j753731k130394
1002D93363647j878814j324883k288017j430168j458206j354485m61998j64871l38440
1010.7D82663765o08978p20253j711121j408958j932907k127686j796608k222481k153091
1019.4D67981682k412529j040039j248093j818237j890679k034988j120720j533279
1027.1D54883118j746102j921310j172829r15527m6578K83699q35952L853l42675k01988
$$ plain form
1036.7 447987709 447848320 448482666 449335403 449991150 451442108 451784744 452777710 452638969 452363129
1045.4 452363129 453125000 452509384 451957817 451330109 450547371 449251595 449202499 449011917 448529739 449531479
1055.1 449531479 449549675 449510880 449589157 450509071 451108398 451238937 451836777 452955360 455529823 457391930
1064.7 457391930 459641685 461348839 462228928 463650208 465108833 466298752 467109413 468575249 468457870
1073.4 468457870 468163338 469321098 470739365 471660576 472436600 474206314 474664421 474833527 474902306
1082.1 474902306 474887009 475621147 476729240 478260689 479048576 480995865 483214149 484743347 485452576
1090.7 485452576 485680161 486780205 487854004 488704872 488411713 489668236 492191315 493695679 495007439
1099.4 495007439 496063576 497591820 498424797 499844208 502075691 503393898 503428955 502949448 504025078
$$ packed form
1036.7D47987709j39389O34346Q52737O55747J450958L42636R92966j38741k75840
1045.4D52363129P61871o15616n51567o27708p82738j295776m9096j90582m82178J001740
1055.1D49531479J8196l8795P8277R19914N99327J30539N97840J118583K574463J862107
1064.7D57391930K249755J707154Q80089J421280J458625J189919Q10661J465836j17379
1073.4D68457870k94532J157760J418267R21211P76024J769714M58107J69106O8779
1082.1D74902306j5297P34138J108093J531449P87887J947289K218284J529198P09229
1090.7D85452576K27585J100044J073799Q50868k93159J256523K523079J504364J311760
1099.4D95007439J056137J528244Q32977J419411K231483J318207L5057m79507J075630
$$ plain form
1108.1 504025078 505042267 506141472 507167740 507189560 507919540 508744621 508462791 507919006 508229561
1116.8 508229561 508500786 508333740 507880440 508152771 508993149 508971901 509130974 509397049 509829254 509940491
1126.4 509940491 510143509 510855675 511320724 512771721 514679604 516547585 518041840 519277306 520622711
1135.1 520622711 522071915 523153458 523453674 524684753 525946007 526329308 527001495 528370361 529641571
1143.8 529641571 530439987 531170311 531405983 532203941 532368622 531783142 532167664 532381439 532604027 532238312
1153.4 532238312 532231216 533372726 533909416 533645706 532420349 531024704 529915314 529207153 528783264
1162.1 528783264 528694763 529388237 530197296 531299515 532485847 533435249 534236565 535330582 536665802
1170.8 536665802 538247528 539650574 540255089 542112999 544587440 546307335 548518295 550442619
$$ packed form
1108.1E04025078J017189J099205J026268K1820P29980Q25081k81830n43785L10555
1116.8E08229561K71225j67046m53300K72331Q40378k1248J59073K66075M32205J11237
1126.4E09940491K03018P12166M65049J450997J907883J867981J494255J235466J345405
1135.1E20622711J449204J081543L00216J231079J261254L83301O72187J368866J271210
1143.8E29641571P98416P30324K35672P97958J64681n85480L84522K13775K22588l65715
1153.4E32238312p096J141510N36690k63710j225357j395645j109390p08161m23889
1162.1E28783264q8501O93474Q09059J102219J186332R49402Q01316J094017J335220
1170.8E36665802J581726J403046O04515J857910K474441J719895K210960J924324
$$ plain form
1178.5 550442619 551561852 552455711 553403740 554500885 555106850 555754890 556973953 558142357 558695641
1187.2 558695641 558915596 559090233 559142456 559539146 559470520 558674927 558063240 557553635 556787109 555873222
1196.8 555873222 555281487 555256271 554921646 553553200 552620773 552089615 551088676 550108070 548963585
1205.5 548963585 548069191 547530289 546992264 546884956 547063446 546987152 547039223 546953201 546420441 546254196
1215.1 546254196 546229477 546196060 546229782 546055832 546108131 546322823 546369171 546462669 546573601 546270332 545680962
1225.8 545680962 545224609 544794998 544385109 544081917 543784523 543272858 542613487 541946716 541365395 541036530
1235.4 541036530 540753021 540442543 540200005 539527626 538945312 538940887 538642960 538523979 538295021 537782097
1245 537782097 537551880 537026367 536641312 536196442 535836258 535710526 535343704 534912643 534572716 534712563
$$ packed form
1178.5E50442619J119233Q93859R48029J097145O05965O48040J219063J168404N53284
1187.2E58695641K19955J74637N2223L96690o8626p95593o11687n09605p66526r13887
1196.8E55873222n91735k5216l34625j368446r32427n31158j000939r80606j144485
1205.5E48963585q94394n38902n38025j07308J78490p6294N2071q6022n32760j66245
1215.1E46254196k4719l3417L3722j73950N2299K14692M6348R3498J10932l03269n89370
1225.8E45680962m56353m29611m09889l03192k97394n11665o59371o66771n81321l28865
1235.4E41036530k83509l10478k42538o72379n82314m425k97927j18981k28958n12924
1245E37782097k30217n25513l85055m44870l60184j25732l66822m31061l39927J39847
$$ plain form
1254.7 534712563 534766273 534880676 534569511 534008293 533989372 533653679 533728027 534187851 534844589 535400963
1264.3 535400963 535805817 536226654 536247635 536670341 537096367 537417488 537638168 538197403 539422913 540293732
1274 540293732 541182251 542056427 542937622 543612862 544458580 545590401 545873489 546540871 547783813 548783722
1283.6 548783722 550114212 551657295 552804527 553849754 555133896 555924149 556694794 557707329 558322372
1292.3 558322372 559062195 559682350 560399818 561364365 562163162 562958946 563581314 564309959 564456367 564134560
1301.9 564134560 564282684 564575043 564650497 564790840 565146866 564999619 565169601 565416832 565128822 565051308
1311.6 565051308 565137024 565227432 564458122 563862076 563884811 563799973 564174995 565035820 565939903 566378937
1321.2 566378937 566913338 567327881 567450676 567766647 568083229 568431129 568430252 568616714 568748665 568616753
$$ packed form
1254.7E34712563N3710J14403l11165n61218j8921l35693P4348M59824O56738N56374
1264.3E35400963M04854M20837K0981M22706M26026L21121K20680N59235J225510Q70819
1274E40293732Q88519Q74176Q81195O75240Q45718J131821K83088O67382J242942R99909
1283.6E48783722J330490J543083J147232J045227J284142P90253P70645J012535O15043
1292.3E58322372P39823O20155P17468R64547P98797P95784O22368P28645J46408l21807
1301.9E64134560J48124K92359P5454J40343L56026j47247J69982K47231k88010p7514
1311.6E65051308Q5716R0408p69310n96046K2735q4838L75022Q60825R04083M39034
1321.2E66378937N34401M14543J22795L15971L16582L47900q77J86462J31951j31912
$$ plain form
1330.9 568616753 568757286 568881989 568933144 568809090 568650055 568201256 567944260 567847939 567517662 567299843
1340.5 567299843 567506218 568248749 568688850 569180756 569758263 569998550 569949684 569869080 570449524 570477562
1350.2 570477562 569980049 569513206 569353828 569387970 569428711 569732132 569866600 570162277 569694633 569182739
1359.8 569182739 568575363 567745819 567460022 566213036 566620483 566792984 566232681 566219635 565599937 565401459
1369.4 565401459 565467453 565244598 564877930 564093513 562845383 562555542 562748642 562858047 563337784 563063240
1379.1 563063240 562838745 562444305 561706543 560729904 559173126 558331909 557836723 557354622 555676842
1387.8 555676842 554880104 555004425 554252510 553357468 552549324 551927910 549956932 547741013 546814613
1396.4 546814613 545249252 543679008 541561699 540776901 540620575 539790421 538918915 538063965 536202698
$$ packed form
1330.9E68616753J40533J24703N1155j24054j59035m48799k56996r6321l30277k17819
1340.5E67299843K06375P42531M40101M91906N77507K40287m8866q0604N80444K8038
1350.2E70477562m97513m66843j59378L4142M0741L03421J34468K95677m67644n11894
1359.8E69182739o07376q29544k85797j246986M07447J72501n60303j3046o19698j98478
1369.4E65401459O5994k22855l66668p84417j248130k89841J93100J09405M79737k74544
1379.1E63063240k24495l94440p37762r76639j556778q41217m95186m82101j677780
1387.8E55676842p96738J24321p51915q95042q08144o21414j970978k215919r26400
1396.4E46814613j565361j570244k117309p84798j56326q30154q71506q54950j861267
$$ plain form
1405.1 536202698 534674263 533951187 532647629 531495934 530596428 529783859 529330101 528755493 528354454
1413.8 528354454 528345375 528341751 527525787 526530151 526010666 523037987 523615799 525434761 526175728 526612434
1423.4 526612434 526260834 527140846 528696136 529031868 529241791 529060364 528448982 529038353 530086632
1432.1 530086632 530665512 531424637 533100624 533937721 532939987 534498749 536212883 536723862 537096329
1440.8 537096329 537502975 537831116 538628693 538962059 540059433 541365204 541446075 541338921 542537498
1449.5 542537498 543672638 543741951 543521194 543596039 544958916 546210175 546194267 545542297 544618530 546743698
1459.1 546743698 548458443 550334129 551381950 552243271 553587303 552665977 553525772 555444832 557923889
1467.8 557923889 559844437 561376419 564202080 566568604 567294502 567763634 570338440 572756996 573274651
$$ packed form
1405.1E36202698j528435p23076j303558j151695q99506q12569m53758n74608m01039
1413.8E28354454r079l624q15964r95636n19485k972679N77812J818962P40967M36706
1423.4E26612434l51600Q80012J555290L35732K09923j81427o11382N89371J048279
1432.1E30086632N78880P59125J675987Q37097r97734J558762J714134N10979L72467
1440.8E37096329M06646L28141P97577L33366J097374J305771Q0871j07154J198577
1449.5E42537498J135140O9313k20757P4845J362877J251259j5908o51970r23767K125168
1459.1E46743698J714745J875686J047821Q61321J344032r21326Q59795J919060K479057
1467.8E57923889J920548J531982K825661K366524P25898M69132K574806K418556N17655
$$ plain form
1476.5 573274651 574869957 577285919 579207306 580912666 582361641 583583641 585002098 585970764
1484.2 585970764 586651001 587571030 587738495 588007317 589494705 589033089 588393059 589408340 589853859
1492.9 589853859 589418869 589193268 588686790 583147774 583397865 582593727 579319420 579514961 578948288
1501.6 578948288 578007126 577471390 578609276 580034561 576753349 568422775 568136864 570302887 570152473
1510.2 570152473 571675072 571324158 570395546 571652260 570750694 569484444 567140083 565173111 567621422
1518.9 567621422 569810867 568159218 564862747 565391235 567239418 570077095 570279655 570194244 570751114
1527.6 570751114 570798569 571915436 572838326 573778229 574724579 574661446 573384361 575329857 576868439
1536.3 576868439 577901497 579799690 577520485 574162941 576351204 577514305 577969818 579700394
$$ packed form
1476.5E73274651J595306K415962J921387J705360J448975J222000J418457R68666
1484.2E85970764O80237R20029J67465K68822J487388m61616o40030J015281M45519
1492.9E89853859m34990k25601n06478n539016K50091q04138l274307J95541n66673
1501.6E78948288r41162n35736J137886J425285l281212q330574k85911K166023j50414
1510.2E70152473J522599l50914r28612J256714r01566j266250k344361j966972K448311
1518.9E67621422K189445j651649l296471N28488J848183K837677K02560q5411N56870
1527.6E70751114M7455J116867R22890R39903R46350o3133j277085J945496J538582
1536.3E76868439J033058J898193k279205l357544K188263J163101M55513J730576
$$ plain form
1544 579700394 580031929 578317909 580606461 582307014 583342934 582892303 581775932 583185921 584082336
1552.7 584082336 585021973 582216759 582411461 585383072 588616753 587807007 575277138 577570801 579784546
1561.4 579784546 581249428 580706596 579850578 577444534 575429192 575428543 574799728 574781761 568142090 567318535
1571 567318535 566928482 564282761 562282486 560305290 559129753 549231567 548909492 548100891 545928497
1579.7 545928497 543838692 540401993 538136978 534094658 531029739 527010918 523708878 520414581
1587.4 520414581 516446686 514197388 510326347 508287697 504114571 501351585 498469849 494597740
1595.1 494597740 492236290 487807426 485758057 482110214 480189285 477718582 474850388 473170433
1602.8 473170433 470191612 469226799 466084518 464557838 461606903 459535141 457759323 455275993
$$ packed form
1544E79700394L31535j714020K288552J700553J035920m50631j116371J409989Q96415
1552.7E84082336R39637k805214J94702K971611L233681q09746j2529869K293663K213745
1561.4E79784546J464882n42832q56018k406044k015342o49o28815j7967o639671q23555
1571E67318535l90053k645721k000275j977196j175537r898186l22075q08601k172394
1579.7E45928497k089805l436699k265015m042320l064919m018821l302040l294297
1587.4E20414581l967895k249298l871041k038650m173126k762986k881736l872109
1595.1D94597740k361450m428864k049369l647843j920929k470703k868194j679955
1602.8D73170433k978821r64813l142281j526680k950935k071762j775818k483330
$$ plain form
1610.5 455275993 455255356 452827492 452650452 451036606 451559563 451285934 444481926 446441460 445407639
1619.2 445407639 445847244 444634819 445759201 445657730 443311996 445143814 445246811 447485924 446263695
1627.9 446263695 446644783 447576904 448473549 449707718 449811325 452237244 453351631 454169655 452635841
1636.6 452635841 454934311 456703529 458023148 459781418 459618301 461410713 461681671 463600502 464887314
1645.3 464887314 463478470 465704536 464939804 468030319 469321480 471763344 473066597 466305809
1653 466305809 464966202 468369446 473231659 474218903 475569992 476792107 478085442 479268379 480474129
1661.6 480474129 482209320 481436310 484050941 485684891 487753448 490165520 492485428 494395027
1669.4 494395027 494807587 498711281 500097885 503129959 506230278 507758064 510174980 513049240
$$ packed form
1610.5D55275993k0637k427864j77040j613846N22957k73629o804008J959534j033821
1619.2D45407639M39605j212425J124382j01471k345734J831818J02997K239113j222229
1627.9D46263695L81088R32121Q96645J234169J03607K425919J114387Q18024j533814
1636.6D52635841K298470J769218J319619J758270j63117J792412K70958J918831J286812
1645.3D64887314j408844K226066p64732L090515J291161K441864J303253o760788
1653D66305809j339607L403244M862213R87244J351089J222115J293335J182937J205750
1661.6D80474129J735191p73010K614631J633950K068557K412072K319908J909599
1669.4D94395027M12560L903694J386604L032074L100319J527786K416916K874260
$$ plain form
1677.1 513049240 516497383 518976822 522378426 524452667 528590736 533818932 536067352 536974640
1684.8 536974640 538844566 544247627 547740097 550615463 554102135 556836700 560447922 563810463
1692.5 563810463 567741508 572186241 576159973 575655861 580933304 586539459 591736641 593576965
1700.2 593576965 590391998 597990494 602760468 605874901 608042183 610673561 613101540 615599251
1707.9 615599251 619429321 621839104 623040237 624588165 627175980 630773468 631848373 631748085
1715.6 631748085 634695473 636646576 632730980 636026268 639352264 641348953 643108978 643888626
1723.4 643888626 644504166 645618286 646785736 647781982 649102859 651365509 651293106 651250992 654962006
1732 654962006 658598022 656886063 652152557 656043320 659667206 661188507 663348389 663611298 662992172
$$ packed form
1677.1E13049240L448143K479439L401604K074241M138069N228196K248420R07288
1684.8E36974640J869926N403061L492470K875366L486672K734565L611222L362541
1692.5E63810463L931045M444733L973732n04112N277443N606155N197182J840324
1700.2E93576965l184967P598496M769974L114433K167282K631378K427979K497711
1707.9F15599251L830070K409783J201133J547928K587815L597488J074905j00288
1715.6F31748085K947388J951103l915596L295288L325996J996689J760025P79648
1723.4F43888626O15540J114120J167450R96246J320877K262650p2403m2114L711014
1732F54962006L636016j711959m733506L890763L623886J521301K159882K62909o19126
$$ plain form
1740.7 662992172 666769409 669120560 669009018 670052567 673180466 675719604 677014999 678435287
1748.4 678435287 679617157 683563004 684691544 685215225 689448318 692174072 694988937 697231216
1756.2 697231216 696518555 698172302 701023712 703463058 705793839 704567795 704871674 707997742 709687653
1764.8 709687653 710828018 712502441 713764954 711882172 713867264 717511673 718024979 716414337
1772.5 716414337 714927216 718780289 720967712 720200729 721773071 722706528 724314880 724520111 723494110
1781.2 723494110 724875031 726656647 727922211 727103195 727262726 728860703 729533310 730025101 732063675
1789.9 732063675 733058395 732882614 731422501 730851746 734173660 735082855 734107819 735225830 736898499
1798.6 736898499 736788406 735459061 737321320 737399750 737909317 739397278 739619217 740659561 741236496
$$ packed form
1740.7F62992172L777237K351151j11542J043549L127899K539138J295395J420288
1748.4F78435287J181870L945847J128540N23681M233093K725754K814865K242279
1756.2F97231216p12661J653747K851410K439346K330781j226044L03879L126068J689911
1764.8G09687653J140365J674423J262513j882782J985092L644409N13306j610642
1772.5G16414337j487121L853073K187423p66983J572342R33457J608352K05231j026001
1781.2G23494110J380921J781616J265564q19016J59531J597977O72607M91791K038574
1789.9G32063675R94720j75781j460113n70755L321914R09195r75036J118011J672669
1798.6G36898499j10093j329345J862259P8430N09567J487961K21939J040344N76935
$$ plain form
1807.3 741236496 741182327 741758575 742675323 741939316 742530594 743644867 743888855 745037308 745347748
1815.9 745347748 745916672 745792160 746096649 746815186 746281509 747021484 747274704 748287735 749350815
1824.6 749350815 747074280 747151947 749384689 751648560 751741562 748096313 748560562 750629807 750838165
1833.3 750838165 751013260 751396332 752042999 752539673 752206116 753345108 753837967 753957825 753735428
1842 753735428 754866943 755637741 750454636 752348862 754819794 755264511 755178223 755674667 756577530
1850.7 756577530 756261368 756506424 756436920 756552887 756437225 756557159 757497635 757361832 757587433 757773590
1860.3 757773590 758397064 758478775 758256531 758408585 758404007 759051285 759045563 759664688 758947449 757957687
1869.9 757957687 758746796 759378891 760223618 760355072 760569382 760463257 760284424 759835434 759727249 760390854
$$ packed form
1807.3G41236496n4169N76248R16748p36007N91278J114273K43988J148453L10440
1815.9G45347748N68924j24512L04489P18537n33677P39975K53220J013031J063080
1824.6G49350815k276535P7667K232742K263871R3002l645249M64249K069245K08358
1833.3G50838165J75095L83072O46667M96674l33557J138992M92859J19858k22397
1842G53735428J131515P70798n183105J894226K470932M44717q6288M96444R02863
1850.7G56577530l16162K45056o9504J15967j15662J19934R40476j35803K25601J86157
1860.3G57773590O23474Q1711k22244J52054m578O47278n722O19125p17239r89762
1869.9G57957687P89109O32095Q44727J31454K14310j06125j78833m48990j08185O63605
$$ plain form
1879.6 760390854 760538254 761291962 761364899 761618042 761884460 761543961 761518707 761404648 762427444 762148972
1889.2 762148972 760143204 760389481 761437988 761961060 762890244 763058472 761895523 762587051 762840195
1897.9 762840195 762689133 762517776 761842194 761759109 762013626 762771759 762874908 763356247 763763580 763585739
1907.6 763585739 763444748 763159485 763071289 762687531 763158875 763005524 763159332 763647156 763946533 765424347
1917.2 765424347 763834076 762556534 763301544 763738708 764127045 762928696 762455750 763473892 764441452
1925.9 764441452 764378891 764213943 764160004 763890076 763535080 763222580 763620377 763427429 763449402 763653870
1935.5 763653870 763766785 763729782 763458405 764057846 764295578 765126343 764798508 762475357 762823563 763606873
1945.2 763606873 763491287 763279495 763433762 763463440 763654022 763511124 763099823 763075943 762882690 762713165
$$ packed form
1879.6G60390854J47400P53708P2937K53143K66418l40499k5254j14059J022796k78472
1889.2G62148972k005768K46277J048507N23072R29184J68228j162949O91528K53144
1897.9G62840195j51062j71357o75582q3085K54517P58133J03149M81339M07333j77841
1907.6G63585739j40991k85263q8196l83758M71344j53351J53808M87824K99377J477814
1917.2G65424347j590271j277542P45010M37164L88337j198349m72946J018142R67560
1925.9G64441452o2561j64948n3939k69928l54996l12500L97797j92948K1973K04468
1935.5G63653870J12915l7003k71377N99441K37732Q30765l27835k323151L48206P83310
1945.2G63606873j15586k11792J54267K9678J90582j42898m11301k3880j93253j69525
$$ plain form
1954.8 762713165 762391281 762674713 762806931 762842636 763287048 763360748 763439636 762873459 762543564 762496567
1964.5 762496567 762568665 762643204 761958389 761643829 761610184 762032013 762473068 762610474 762457047 762230072
1974.1 762230072 762090988 761542969 761208496 761057510 761503525 762055130 762488480 762687149 762184830 762069626
1983.7 762069626 761904755 761489944 761126785 761086731 760826950 760698547 761306305 761251221 760877686 760921631
1993.4 760921631 761145248 760849609 760526505 760291748 759829178 759941559 759886856 759924698 759814682 760022125
2003 760022125 760543518 760450592 760353088 759989090 759867859 759332886 758677902 758582001 758756714 759094238
2012.7 759094238 759182510 759650040 759707718 759591904 759233170 758820572 758403244 757518692 757381363 757274170
2022.3 757274170 757553253 757757416 757907867 758420639 758555756 758809128 758159256 757431335 756827621 756418076
$$ packed form
1954.8G62713165l21884K83432J32218L5705M44412P3700P8888n66177l29895m6997
1964.5G62496567P2098P4539o84815l14560l3645M21829M41055J37406j53427k26975
1974.1G62230072j39084n48019l34473j50986M46015N51605M33350J98669n02319j15204
1983.7G62069626j64871m14811l63159m0054k59781j28403O07758n5084l73535M3945
1993.4G60921631K23617k95639l23104k34757m62570J12381n4703L7842j10016K07443
2003G60022125N21393r2926r7504l63998j21231n34973o54984r5901J74713L37524
2012.7G59094238Q8272M67530N7678j15814l58734m12598m17328q84552j37329j07193
2022.3G57274170K79083K04163J50451N12772J35117K53372o49872p27921o03714m09545
$$ plain form
2032 756418076 756265106 755789642 755963669 756466141 757181625 757179031 757067795 757174530 756865768 756337814
2041.6 756337814 755457611 755323868 755282364 755422440 755494766 755695114 756240158 756285934 756655960 756327744
2051.2 756327744 755942764 755541077 755015488 754989624 754589310 754451065 754591599 755180359 755629120 756165085
2060.9 756165085 756239471 755415268 755068512 754446716 754052658 753817291 753699417 753708878 754198074 754938812
2070.5 754938812 754640045 754944839 755322800 755183105 754539795 753806000 753588943 753426743 753740387 753706970
2080.2 753706970 753954697 754321213 754648972 754934082 754771805 754661636 753613281 752886047 752600555
2088.9 752600555 752420349 752434540 752594910 753438797 753663406 753646622 753608780 753506622 752917023 752331924
2098.5 752331924 752133713 751549072 751723785 752014999 752284546 752212524 752297134 752812729 752532654 752167969
$$ packed form
2032G56418076j52970m75464J74027N02472P15484k594j11236J06735l08762n27954
2041.6G56337814q80203j33743m1504J40076P2326K00348N45044M5776L70026l28216
2051.2G56327744l84980m01687n25589k5864m00314j38245J40534N88760M48761N35965
2060.9G56165085P4386q24203l46756o21796l94058k35367j17874R461M89196P40738
2070.5G54938812k98767L04794L77961j39695o43310p33795k17057j62200L13644l3417
2080.2G53706970K47727L66516L27759K85110j62277j10169j048355p27234k85492
2088.9G52600555j80206J4191J60370Q43887K24609j6784l7842j02158n89599n85099
2098.5G52331924j98211n84641J74713K91214K69547p2022Q4610N15595k80075l64685
$$ plain form
2108.1 752167969 751315536 750928497 750674438 750258713 750424500 750590973 751028824 751137314 751380997 751518631
2117.8 751518631 751392899 750896225 750106201 749776535 749556198 749963455 750075684 750248337 750597305 750632706
2127.4 750632706 750784836 750702744 750595474 749894943 749674911 749665451 749419403 749409943 749407654 750000458 750248642
2138 750248642 750559540 750479355 749997635 749897385 749777069 749808044 749235153 748754578 748712616 749225845
2147.7 749225845 749602661 749542236 749742584 749476318 749506989 749405746 749238586 749296570 749121017 749079285
2157.3 749079285 749141541 749398193 749356461 749493637 749650726 750004578 750199432 749657822 749546432 749355316
2167 749355316 749284439 749268951 749078293 748896942 749078064 749503555 749436340 749521408 749377670 749483337 749364853
2177.6 749364853 749111481 749395752 749155884 749237671 749375916 749393005 749238663 749275894 749497986 749148407
$$ packed form
2108.1G52167969q52433l87039k54059m15725J65787J66473M37851J08490K43683J37634
2117.8G51518631j25732m96674p90024l29666k20337M07257J12229J72653L48968L5401
2127.4G50632706J52130q2092j07270p00531k20032r460k46048r460k289N92804K48184
2138G50248642L10898q0185m81720j00250j20316L0975n72891m80575m1962N13229
2147.7G49225845L76816o0425K00348k66266L0671j01243j67160N7984j75553m1732
2157.3G49079285O2256K56652m1732J37176J57089L53852J94854n41610j11390j91116
2167G49355316p0877j5488j90658j81351J81122M25491o7215Q5068j43738J05667j18484
2177.6G49364853k53372K84271k39868Q1787J38245J7089j54342L7231K22092l49579
$$ plain form
2187.2 749148407 749215927 749447098 749720612 749439392 749314423 749733429 749501877 749098740 748706970 749091034
2196.9 749091034 749653778 749922638 749928207 749667892 749660645 749640961 749746323 749391556 749262772 749256058 749168091
2207.5 749168091 749385986 749476929 749873886 749801865 749763565 749825363 749670868 749742813 749856491 749893341 749472733
2218.1 749472733 749394608 749373932 749422226 749485474 749777374 750269547 749545517 749188156 749514999 749746475
2227.7 749746475 749518356 749123688 749153900 749132767 749428558 749560623 749676361 749419403 749151840 749382248
2237.4 749382248 749264526 749105148 748750076 748829575 748895569 748896561 749223557 749493942 749729309 749414673
2247 749414673 749178391 748804932 748854218 749196472 748809509 748166504 747997971 748707123 748774719 748724365
2256.7 748724365 748897552 748889847 748899918 748858032 748863678 748169174 747974014 747924881 748071365 748453903 748233719
$$ packed form
2187.2G49148407O7520K31171K73514k81220j24969M19006k31552m03137l91770L84064
2196.9G49091034N62744K68860N569k60315p247j9684J05362l54767j28784o714q7967
2207.5G49168091K17895R0943L96957p2021l8300O1798j54495P1945J13678L6850m20608
2218.1G49472733p8125k0676M8294O3248K91900M92173p24030l57361L26843K31476
2227.7G49746475k28119l94668L0212k1133K95791J32065J15738k56958k67563K30408
2237.4G49382248j17722j59378l55072P9499O5994R92L26996K70385K35367l14636
2247G49414673k36282l73459M9286L42254l86963o43005j68533P09152O7596n0354
2256.7G48724365J73187p705J0071m1886N646o94504j95160m9133J46484L82538k20184
$$ plain form
2267.3 748233719 748438568 748379440 748557892 748410568 747833481 747854996 748079224 748323288 748141632 748272781
2276.9 748272781 747881317 747320557 747239609 747197723 747198639 746894989 747107315 747116470 747142639 746966095 746756973
2287.5 746756973 747116470 746843185 746907043 747045441 747164230 746994629 746598663 746568298 746177063 746024704
2297.2 746024704 745707855 745620041 745883026 746243439 746299591 746216049 746463394 745777664 745287247 745289078
2306.8 745289078 746139679 746658707 746031189 746158524 745694351 745345459 745142441 745007248 745278168 745045395
2316.4 745045395 744768829 744303207 744744644 745210037 745419540 745305862 744689331 744318466 743786163 744287491
2326.1 744287491 744243088 743982162 744349594 744358215 744350128 744315186 744322281 743582077 743302917 743076553 742551498
2336.7 742551498 742559967 742465439 742381668 743033066 743585281 742573929 742556458 742460709 741621552 741130447
$$ packed form
2267.3G48233719K04849n9128J78452j47324n77087K1515K24228K44064j81656J31149
2276.9G48272781l91464n60760q0948m1886R16l03650K12326R155K6169j76544k09122
2287.5G46756973L59497k73285O3858J38398J18789j69601l95966l0365l91235j52359
2297.2G46024704l16849q7814K62985L60413N6152q3542K47345o85730m90417J831
2306.8G45289078Q50601N19028o27518J27335m64173l48892k03018j35193K70920k32773
2316.4G45045395k76566m65622M41437M65393K09503j13678o16531l70865n32303N01328
2326.1G44287491m4403k60926L67432Q621q087l4942P095p40204k79160k26364n25055
2336.7G42551498Q469r4528q3771O51398N52215j011352j7471r5749q39157m91105
$$ plain form
2346.3 741130447 740339584 740531693 741156311 741833115 741732330 741396408 741416245 741178513 741757736 741724701
2356 741724701 742015457 742643661 742461548 741231766 740687561 740921631 740969772 741848297 740734253 740301361
2365.6 740301361 739780655 738097153 737886200 738014832 738480530 738380432 737913513 737336273 737109756
2374.3 737109756 736742401 736557617 737018433 736508865 736316757 736257401 736068268 736028366 735555801 735108643
2383.9 735108643 734720383 734677353 734618378 734554138 734495621 734231796 734090729 734129105 734017868 733431549
2393.6 733431549 733483734 733384323 732814941 732710876 732474289 732269058 732161865 732149658 731915207 731855469
2403.2 731855469 731984482 731831818 731752548 731360245 730729599 730032501 730079041 730407867 730252380 730019150
2412.9 730019150 729716797 729785156 729404755 728828201 728357925 727776337 727712250 727788239 727883224 727831345
$$ packed form
2346.3G41130447p90863J92109O24618O76804j00785l35922J9837k37732N79223l3035
2356G41724701K90756O28204j82113j229782n44205K34070M8141Q78525j114044m32892
2365.6G40301361n20706j683502k10953J28632M65698j00098m66919n77240k26517
2374.3G37109756l67355j84784M60816n09568j92108n9356j89133l9902m72565m47158
2383.9G35108643l88260m3030n8975o4240n8517k63825j41067L8376j11237n86319
2393.6G33431549N2185r9411n69382j04065k36587k05231j07193j2207k34451n9738
2403.2G31855469J29013j52664p9270l92303o30646o97098M6540L28826j55487k33230
2412.9G30019150l02353O8359l80401n76554m70276n81588o4087P5989R4985n1879
$$ plain form
2422.5 727831345 727597198 726911621 726405640 726521454 726331406 725922775 725597382 725501175 725264740 725147018
2432.2 725147018 725075607 724783554 724577637 724598618 724938507 724470825 723890686 723702927 723353882 722892380
2441.8 722892380 722106628 721889801 721929703 721905899 721975937 721859970 721617584 721314011 721173935 720797272
2451.5 720797272 720274353 719828873 719279556 718787079 718970337 719127274 718714981 718403931 717976608 718179092
2461.1 718179092 718103409 717170258 716640396 716404343 716326675 715868301 715486374 715399246 715698471 715992737
2470.7 715992737 715444641 714969101 714468765 713915939 713478241 713409729 713218079 712692947 712513962 711964417
2480.4 711964417 711836929 711908875 711458817 711005630 710730133 710703659 710350037 709810944 709246140 709140625
2490 709140625 709065323 708691483 708568649 708196716 707669373 707204361 707236633 706949692 706196899 705938034
$$ packed form
2422.5G27831345k34147o85577n05981J15814j90048m08631l25393r6207k36435j17722
2432.2G25147018p1411k92053k05917K0981L39889m67682n80139j87759l49045m61502
2441.8G22892380p85752k16827L9902k3804P0038j15967k42386l03573j40076l76663
2451.5G20797272n22919m45480n49317m92477J83258J56937m12293l11050m27323K02484
2461.1G18179092p5683r33151n29862k36053p7668m58374l81927q7128K99225K94266
2470.7G15992737n48096m75540n00336n52826m37698o8512j91650n25132j78985n49545
2480.4G11964417j27488P1946m50058m53187k75497k6474l53622n39093n64804j05515
2490G09140625p5302l73840j22834l71933n27343m65012L2272k86941p52793k58865
$$ plain form
2499.7 705938034 705822525 705720673 705296631 705110474 705025558 704637299 704131775 703533020 703258133 702802658
2509.3 702802658 702341080 701923676 701740570 701895599 701868362 701825638 701535797 701260834 700997391 700493088
2519 700493088 699775314 699230194 698979111 698662109 698474731 698185730 698141556 698215408 697789688 697542343
2528.6 697542343 697857742 697319183 696079178 695824738 695555801 695373459 695406494 695072937 694933395 694761658
2538.2 694761658 694723816 694386597 694063492 693927231 693522644 693015137 692573318 692687454 692563934 692324066
2547.9 692324066 691842041 691142960 691068268 691023483 691027527 690764389 690302200 689774857 689294510 689134369
2557.5 689134369 688946762 688885574 688702927 688437119 687979584 687697906 687480164 686979599 686900482 686627121
2567.2 686627121 686355896 686256409 685784378 685288239 685319748 685571671 685094147 684367218 683923721 683761063
$$ packed form
2499.7G05938034j15509j01852m24042j86157q4916l88259n05524n98755k74887m55475
2509.3G02802658m61578m17404j83106J55029k7237m2724k89841k74963k63443n04303
2519G00493088p17774n45120k51083l17002j87378k89001m4174P3852m25720k47345
2528.6F97542343L15399n38559j240005k54440k68937j82342L3035l33557j39542j71737
2538.2F94761658l7842l37219l23105j36261m04587n07507m41819J14136j23520k39868
2547.9F92324066m82025o99081p4692m4785M044k63138m62189n27343m80347j60141
2557.5F89134369j87607o1188j82647k65808m57535k81678k17742n00565p9117k73361
2567.2F86627121k71225r9487m72031m96139L1509K51923m77524p26929m43497j62658
$$ plain form
2576.8 683761063 683621140 683497543 683455582 682919998 682118073 681797256 681867981 681597748 681437073 681289825
2586.5 681289825 680993576 680942230 680604401 680399399 680316620 680099945 679734650 679457932 679165802 678370132
2596.1 678370132 678050079 678024979 677911301 677554703 677289200 677595596 677225800 676590652 676413727 676261520
2605.7 676261520 675794067 675281219 675084534 674911346 674776154 674305801 673672714 673384247 673123245 672648621
2615.4 672648621 672446671 672508163 672125549 671701736 671402969 671040344 670712509 670385132 670063782 670004883
2625 670004883 670182724 669857788 669092484 668421478 668104324 667735672 667407608 667302399 666819382 666480255
2634.7 666480255 666258392 666153793 666232376 665838547 665299683 664772415 664240341 664087753 664030533 663491592
2644.3 663491592 663263474 663266525 662880478 662648239 662536469 662523575 661937256 661052170 660806427 660668106
$$ packed form
2576.8F83761063j39923j23597m1961n35584q01925l20817P0725k70233j60675j47248
2586.5F81289825k96249n1346l37829k05002q2779k16675l65295k76718k92130p95670
2596.1F78370132l20053k5100j13678l56598k65503L06396l69796o35148j76925j52207
2605.7F76261520m67453n12848j96685j73188j35192m70353o33087k88467k61002m74624
2615.4F72648621k01950O1492l82614m23813k98767l62625l27835l27377l21350n8899
2625F70004883J77841l24936p65304o71006l17154l68652l28064j05209m83017l39127
2634.7F66480255k21863j04599P8583l93829n38864n27268n32074j52588n7220n38941
2644.3F63491592k28118L051l86047k32239j11770j2894n86319q85086k45743j38321
$$ plain form
2654 660668106 660226288 659879227 659844894 659408569 659315109 659421844 658879700 658578491 658637924 658711548 658256683
2664.6 658256683 657825089 657512283 656909027 656504974 656444168 656766129 656560440 656155701 656002274 655893555
2674.2 655893555 655977859 656044388 655986481 655190353 654686432 654743958 654438171 654110489 653931503 653760300
2683.9 653760300 653332520 653047256 652546616 652291031 652603989 652422180 652077484 651597137 651321793 651375809
2693.5 651375809 651544342 651581573 651103745 650769119 650535431 650173492 649609604 649227295 649196320 649329071
2703.1 649329071 649584656 649458923 649135361 648598251 648334961 648438950 648024521 647367706 647049408 647092590
2712.8 647092590 647023392 646856613 646709518 646748962 646731567 646235428 646037598 646251068 646090393 645585632
2722.4 645585632 645377808 645069809 644808578 644866714 644755859 644956207 644862289 644226379 643946457 643939285
$$ packed form
2654F60668106m41818l47061l4333m36325r3460J06735n42144l01209N9433P3624m54865
2664.6F58256683m31594l12806o03256m04053o0806L21961k05689m04739j53427j08719
2674.2F55893555Q4304O6529n7907p96128n03921N7526l05787l27682j78986j71203
2683.9F53760300m27780k85264n00640k55585L12958j81809l44696m80347k75344N4016
2693.5F51375809J68533L7231m77828l34626k33688l61939n63888l82309l0975J32751
2703.1F49329071K55585j25733l23562n37110k63290J03989m14429o56815l18298M3182
2712.8F47092590o9198j66779j47095L9444j7395m96139j97830K13470j60675n04761
2722.4F45585632k07824l07999k61231N8136j10855K00348r3918o35910k79922p172
$$ plain form
2732.1 643939285 643841248 643742676 643295822 642612152 642919998 643149719 642752609 642479477 642412415 642722321
2741.7 642722321 642350845 641800308 641572189 641341171 641493835 641400070 641141129 641024551 640982361 640977173
2751.4 640977173 641013947 641030121 640801086 640349960 639632530 639366722 639522247 639229164 638863449 638965225
2761 638965225 639125748 639027214 638957443 638864021 638401909 637759590 637562637 637475777 637192268 636994438 637066460
2771.6 637066460 637416573 637296333 637000961 636829185 636356544 635538330 634679947 634422264 634365463 634314613
2781.3 634314613 634041901 633593903 633698463 634097481 634284630 633579063 632698898 632353058 631905365 631553917
2790.9 631553917 631249886 630793991 630422592 630024147 629798431 629945030 629617920 629027672 628791618 628314362
2800.5 628314362 627806664 627303619 626697845 626345825 626207771 626154480 625970879 625783234 625761795 625435677
$$ packed form
2732.1F43939285r8037r8572m46854o83670L07846K29721l97110k73132o7062L09906
2741.7F42722321l71476n50537k28119k31018J52664r3765k58941j16578m2190n188
2751.4F40977173L6774J6174k29035m51126p17430k65808J55525k93083l65715J01776
2761F38965225J60523r8534o9771r3422m62112o42319j96953q6860k83509j97830P2022
2771.6F37066460L50113j20240k95372j71776m72641q18214q58383k57683n6801n0850
2781.3F34314613k72712m47998J04560L99018J87149p05567q80165l45840m47693l51448
2790.9F31553917l04031m55895l71399l98445k25716J46599l27110n90248k36054m77256
2800.5F28314362n07698n03045o05774l52020j38054n3291j83601j87645k1439l26118
$$ plain form
2810.2 625435677 624425621 623462181 622909355 622631645 622542038 622044144 621333694 620806236 620521698 620219116
2819.8 620219116 619656677 619294815 619067459 618325653 617305756 616874886 616501884 615918007 615499763
2828.5 615499763 614926186 614468384 614140930 613650627 613129692 612756310 612262383 611423569 610260506
2837.2 610260506 609054489 608358459 607696724 607181435 606595802 605226059 603763084 602541237 601610641
2845.9 601610641 600429382 598847122 597414131 595963936 594668388 593857269 593139381 591980743 591203117
2854.6 591203117 591061478 590785217 590747833 590997467 590883408 590557594 590478287 590314178 590016136 589575081
2864.2 589575081 589158783 589145737 588819160 588300934 587984238 587416267 586663322 586296844 586017761 585209732
2873.8 585209732 584384689 583624191 583169365 583276863 583122139 582592316 582233429 581880569 581304855 580724869
$$ packed form
2810.2F25435677j010056r63440n52826k77710q9607m97894p10450n27458k84538l02582
2819.8F20219116n62439l61862k27356p41806j019897m30870l73002n83877m18244
2828.5F15499763n73577m57802l27454m90303n20935l73382m93927q38814j163063
2837.2F10260506j206017o96030o61735n15289n85633j369743j462975j221847r30596
2845.9F01610641j181259j582260j432991j450195j295548q11119p17888j158638p77626
2854.6E91203117j41639k76261l7384K49634j14059l25814p9307j64109k98042m41055
2864.2E89575081m16298j3046l26577n18226l16696n67971p52945l66478k79083q08029
2873.8E85209732q25043p60498m54826J07498j54724n29823l58887l52860n75714n79986
$$ plain form
2883.5 580724869 579956131 579564972 579198036 578088264 577588387 577349243 576522980 575785370 575229568
2892.2 575229568 574626846 574102402 573977165 573968391 573606110 572769814 571881866 571216240 570512085 569684639
2901.8 569684639 568952713 568628387 568416023 567957344 567179260 566440392 565701256 564728241 564057350 563450966
2911.4 563450966 562834473 562032204 560932274 560121155 559174232 557844467 556245308 554778557 553679199
2920.1 553679199 552577896 551876945 551583633 551248741 551053467 551046181 551016388 550878754 550652504 550578461
2929.8 550578461 550297241 549889145 550360794 551002426 551091347 551414032 552294235 553207664 553656578 553717041
2939.4 553717041 553876457 554607735 555547333 556075783 555925980 555859070 556666565 557481079 557860107 558342552
2949.1 558342552 559218216 559869614 560221710 560586052 560455856 560481186 560798225 560791626 560898781 561398087
$$ packed form
2883.5E80724869p68738l91159l66936j109772m99877k39144q26263p37610n55802
2892.2E75229568o02722n24444j25237q774l62281q36296q87948o65626p04155q27446
2901.8E69684639p31926l24326k12364m58679p78084p38868p39136r73015o70891o06384
2911.4E63450966o16493q02269j099930q11119r46923j329765j599159j466751j099358
2920.1E53679199j101303p00951k93312l34892j95274p286k9793j37634k26250p4043
2929.8E50578461k81220m08096M71649O41632Q8921L22685Q80203R13429M48914O0463
2939.4E53717041J59416P31278R39598N28450j49803o6910Q07495Q14514L79028M82445
2949.1E58342552Q75664O51398L52096L64342j30196K5330L17039o599J07155M99306
$$ plain form
2958.7 561398087 561895142 562433815 563146935 563366966 563418694 563717575 564405708 565416222 565807762 565727539
2968.3 565727539 565942154 566609001 566987076 567459068 568401833 568703728 569008789 569571609 569909554 570369072
2978 570369072 570510712 570301895 570412102 570726967 570705223 570759583 571369629 571802788 571883850 572131081
2987.6 572131081 571885490 571261063 571524086 572367554 572675743 572651482 573064919 573207092 572959213 572589531
2997.3 572589531 571737595 571455574 571646004 571395569 570858879 570435257 570309219 570095634 569817696 569421043
3006.9 569421043 569195709 569402504 569204521 568531189 568162041 567755775 567233963 567233047 566717949 566022110
3016.6 566022110 565925713 565519333 565038567 564316406 563341904 562690620 562378387 562165146 561862373 561787834
3026.2 561787834 561486244 560792580 560090065 559389229 558631363 558138084 558218918 558070831 557453499 556506081
$$ packed form
2958.7E61398087M97055N38673P13120K20031N1728K98881O88133J010514L91540q0223
2968.3E65727539K14615O66847L78075M71992R42765L01895L05061N62820L37945M59518
2978E70369072J41640k08817J10207L14865k1744N4360O10046M33159Q1062K47231
2987.6E72131081k45591o24427K63023Q43468L08189k4261M13437J42173k47879l69682
2997.3E72589531q51936k82021J90430k50435n36690m23622j26038k13585k77938l96653
3006.9E69421043k25334K06795j97983o73332l69148m06266n21812r16n15098o95839
3016.6E66022110r6397m06380m80766p22161r74502o51284l12233k13241l02773p4539
3026.2E61787834l01590o93664p02515p00836p57866m93279Q0834j48087o17332r47418
$$ plain form
3035.9 556506081 555513763 555067825 554864922 554578094 554044762 553521004 553089714 552356987 551786842 551411743
3045.5 551411743 550737953 550059319 549440651 548794136 548485870 548140450 547275314 546391449 545547752 544863739
3055.1 544863739 545038185 544817238 543652344 542841721 541992187 541278763 541250763 541382980 541254234 540796776
3064.8 540796776 540621071 540149994 539133224 538524208 538112564 537516899 536963921 536438866 535509758
3073.5 535509758 534876595 534957352 535152779 534976349 534027672 533046875 532314720 531978531 531992683 531678276
3083.1 531678276 531558304 531124878 530290260 530069008 529820251 529282188 528785286 528376732 527974052 527302895
3092.7 527302895 526791878 526358299 525530701 524774628 524408989 524238091 523960495 523464241 522738075 522149162
3102.4 522149162 521579437 520684166 520306511 520125961 519819641 519500351 519059982 518869629 518161163 517617149
$$ packed form
3035.9E56506081r92318m45938k02903k86828n33332n23758m31290p32727n70145l75099
3045.5E51411743o73790o78634o18668o46515l08266l45420q65136q83865q43697o84013
3055.1E44863739J74446k20947j164894q10623q49534p13424k8000J32217j28746m57458
3064.8E40796776j75705m71077j016770o09016m11644n95665n52978n25055r29108
3073.5E35509758o33163Q0757J95427j76430r48677r80797p32155l36189J4152l14407
3083.1E31678276j19972m33426q34618k21252k48757n38063m96902m08554m02680o71157
3092.7E27302895n11017m33579q27598p56073l65639j70898k77596m96254p26166n88913
3102.4E22149162n69725q95271l77655j80550l06320l19290m40369j90353p08466n44014
$$ plain form
3112 517617149 517523766 517002373 516516914 515855370 515413246 515182266 514605675 513782158 513021317 512600136
3121.7 512600136 511881294 510978699 510414543 510096436 509494476 508728752 508243752 507846794 507570152 506958885
3131.3 506958885 506275291 505485878 504878311 504923134 504337311 503640594 503340874 502922401 502437286 501809540
3141 501809540 501178741 500302658 499309578 498723068 498444061 497946396 497443428 497115746 496785316 496414337
3150.6 496414337 495824394 495357704 494469223 493492661 493161736 492510147 491399117 490610046 490547371 490124359
3160.3 490124359 489167175 488415108 487769203 487137604 486159515 485532188 485287971 484724693 484342957 484253273
3169.9 484253273 483363113 482016029 481563339 480983315 480533524 480446014 480035210 479708672 478619423
3178.6 478619423 477713356 477220230 476412239 476090660 475771942 475159073 474205742 473549194 473528595 473020134
$$ packed form
3112E17617149r3383n21393m85459o61544m42124k30980n76591q23517p60841m21181
3121.7E12600136p18842r02595n64156l18107o01960p65724m85000l96958k76642o11267
3131.3E06958885o83594p89413o07567M4823n85823o96717k99720m18473m85115o27746
3141E01809540o30799q76083r93080n86510k79007m97665n02968l27682l30430l70979
3150.6D96414337n89943m66690q88481r76562l30925o51589j111030p89071o2675m23012
3160.3D90124359r57184p52067o45905o31599r78089o27327k44217n63278l81736q9684
3169.9D84253273q90160j347084m52690n80024m49791q7510m10804l26538j089249
3178.6D78619423r06067m93126q07991l21579l18718o12869r53331o56548k0599n08461
$$ plain form
3188.2 473020134 472199669 471600151 471086807 470785103 470472221 469757614 468878517 468157272 467820320 467187614
3197.9 467187614 466432648 466383781 465696869 464578705 464159698 463946037 463671265 463450050 463166275 462355652
3207.5 462355652 461556740 461130791 460790062 460496635 460067940 459560776 458863220 458563766 458397980 457539558
3217.2 457539558 457080269 456875725 456028290 455324554 454811363 453954048 453298416 453275032 453179054 452499542
3226.8 452499542 451850243 451490440 451277657 451038055 450658836 450377731 449374809 448269386 448148766
3235.5 448148766 447870560 447303009 446669273 446161880 446067009 445801277 445495110 445407906 445245018 444744797
3245.1 444744797 444287338 444058418 443656616 442709389 441558456 441120110 441135597 441259003 441211815 440650864
3254.8 440650864 440176125 439884415 439157333 438231583 438127556 438068466 437154503 436494064 436511116 436510468
$$ packed form
3188.2D73020134q20465n99518n13344l01704l12882p14607q79097p21245l36952o32706
3197.9D67187614p54966m8867o86912j118164m19007k13661k74772k21215k83775q10623
3207.5D62355652p98912m25949l40729k93427m28695n07164o97556k99454j65786q58422
3217.2D57539558m59289k04544q47435p03736n13191q57315o55632k3384r5978o79512
3226.8D52499542o49299l59803k12783k39602l79219k81105j002922j105423j20620
3235.5D48148766k78206n67551o33736n07393r4871k65732l06167q7204j62888n00221
3245.1D44744797m57459k28920m01802r47227j150933m38346J5487J23406m7188n60951
3254.8D40650864m74739k91710p27082r25750j04027n9090r13963o60439J7052o48
$$ plain form
3264.4 436510468 436086807 435519257 435119743 434947586 434619179 434169350 433967857 433792458 433644943 433011093
3274 433011093 432329521 432297745 432123070 431882706 431710472 431412354 430854530 430146599 429846077 429632797
3283.7 429632797 429513092 429505844 429094429 428690567 428318062 427626724 427151794 427113075 427111588 426843719
3293.3 426843719 426369095 425948868 425502243 425047493 425218201 425428696 424740372 424267159 424040298 423703003
3303 423703003 423813133 423331757 422616348 422433510 422212639 421930351 421285782 420696106 420557823 420009193
3312.6 420009193 419148674 418865623 418550301 418169899 418207130 418000641 417428551 416344604 415787621 415869064
3322.3 415869064 415384979 414770088 413993759 413549500 412937698 412104073 411844864 411204414 410758629 410387650
3331.9 410387650 409708366 408970947 408494682 408574486 408186302 407694283 406863289 405788536 405146446 404611588
$$ packed form
3264.4D36510468m23661n67550l99514j72157l28407m49829k01493j75399j47515o33850
3274D33011093o81572l1776j74675k40364j72234k98118n57824p07931l00522k13280
3283.7D29632797j19705p248m11415m03862l72505o91338m74930l8719j487k67869
3293.3D26843719m74624m20227m46625m54750J70708K10495o88324m73213k26861l37295
3303D23703003J10130m81376p15409j82838k20871k82288o44569n89676j38283n48630
3312.6D20009193q60519k83051l15322l80402L7231k06489n72090j083947n56983Q1443
3322.3D15869064m84085o14891p76329m44259o11802q33625k59209o40450m45785l70979
3331.9D10387650o79284p37419m76265P9804l88184m92019q30994j074753o42090n34858
$$ plain form
3341.6 404611588 404541855 403910904 402650299 402128487 402026558 401270447 400547485 400504570 400455055 400613022
3351.2 400613022 399792099 398255653 397659340 397266121 396963196 396854706 396773033 396630440 396332817 395470657
3360.8 395470657 394381981 394066963 393826523 393791008 393891678 393511658 392600822 391444511 391371040 391316605
3370.5 391316605 390513191 390037079 389769897 389367142 388800659 388745804 388648796 387928848 387379951 386888390
3380.1 386888390 386478043 385772133 385174026 385595932 386097260 386191788 385399513 384081306 383824844 384334297
3389.8 384334297 384554176 384703026 384472198 383299255 383228111 383759613 383156815 382755814 382703209 382671165
3399.4 382671165 382181396 381793785 382371483 382233925 381632767 380944443 380348358 380676231 380922050 380502396
3409.1 380502396 380166969 380299683 380306358 380635872 381090431 380914497 380556412 379974365 379865379 380172462
$$ packed form
3341.6D04611588o9733o30951j260605n21812j01929p56111p22962m2915m9515J57967
3351.2D00613022q20923j536446n96313l93219l02925j08490q1673j42593k97623q62160
3360.8C95470657j088676l15018k40440l5515J00670l80020r10836j156311p3471n4435
3370.5C91316605q03414m76112k67182m02755n66483n4855r7008p19948n48897m91561
3380.1C86888390m10347p05910n98107M21906N01328R4528p92275j318207k56462N09453
3389.8C84334297K19879J48850k30828j172943p1144N31502o02798m01001n2605l2044
3399.4C82671165m89769l87611N77698j37558o01158o88324n96085L27873K45819m19654
3409.1C80502396l35427J32714O675L29514M54559j75934l58085n82047j08986L07083
$$ plain form
3418.7 380172462 380055580 379768715 379826355 379925804 379731026 380001602 380378227 380353432 380514946 380906296
3428.3 380906296 380980835 380867920 380884628 380996628 381373901 381612129 382008934 382455635 382430267 382334518
3438 382334518 382373505 382829170 383311272 383852501 384162178 384028091 383781967 383895302 384918671 385247116
3447.6 385247116 385423241 385630760 385712700 386869202 387830162 388203773 388166656 388722878 389392891 389087563
3457.3 389087563 389687881 390504990 390818520 391523819 392487183 392978935 393129272 393695602 394648247 395442123
3466.9 395442123 395696678 396698189 397704926 397930031 398268127 398338432 398743706 399578323 400402946
3475.6 400402946 401191444 402037048 402626419 403014526 403941956 404734116 405443649 406236534 407253342
3484.3 407253342 408074799 408188667 408558540 409077072 409927177 411159172 412282829 412534065 412525177 413282089
$$ packed form
3418.7C80172462j16882k86865N7640R9449j94778K70576L76625k4795J61514L91350
3428.3C80906296P4539j12915J6708J12000L77273K38228L96805M46701k5368r5749
3438C82334518L8987M55665M82102N41229L09677j34087k46124J13335J023369L28445
3447.6C85247116J76125K07519Q1940J156502R60960L73611l7117N56222O70013l05328
3457.3C89087563O00318Q17109L13530P05299R63364M91752J50337N66330R52645P93876
3466.9C95442123K54555J001511J006737K25105L38096P0305M05274Q34617Q24623
3475.6D00402946P88498Q45604N89371L88107R27430P92160P09533P92885J016808
3484.3D07253342Q21457J13868L69873N18532Q50105J231995J123657K51236q888P56912
$$ plain form
3493.9 413282089 414364090 415721092 416036530 416225319 417563515 418703003 419657516 420748482 421520309
3502.6 421520309 421780815 422458267 423069038 423826027 425164757 426136780 426780891 427167130 427963066
3511.3 427963066 428831329 429654808 430723152 431866302 433305626 433826561 433894577 435101738 436763077
3520 436763077 437698975 438871498 440461349 440596008 440564613 441365929 442314682 443230972 444207153 444682541
3529.6 444682541 445549774 447001381 448100281 449602356 450509758 451659241 452600517 452610016 454207840
3538.3 454207840 455577316 456744919 458046074 459006615 459853363 460876465 462172356 463030128 464179497
3547 464179497 464044037 465684853 467903404 468653145 470273170 470629425 471652489 472832527 474181366
3555.6 474181366 475898437 476481438 478521385 480132179 481075096 482192879 484390984 485607033 485659370
$$ packed form
3493.9D13282089J082001J357002L15438J88789J338196J139488R54513J090966P71827
3502.6D21520309K60506O77452O10771P56989J338730R72023O44111L86239P95936
3511.3D27963066Q68263Q23479J068344J143150J439324N20935O8016J207161J661339
3520D36763077R35898J172523J589851J34659l1395Q01316R48753R16290R76181M75388
3529.6D44682541Q67233J451607J098900J502075R07402J149483R41276R499J597824
3538.3D54207840J369476J167603J301155R60541Q46748J023102J295891Q57772J149369
3547D64179497j35460J640816K218551P49741J620025L56255J023064J180038J348839
3555.6D74181366J717071N83001K039947J610794R42917J117783K198105J216049N2337
$$ plain form
3564.3 485659370 488841019 489181328 490367737 492053642 491479988 494301949 495590439 496869278 498443146
3573 498443146 499890709 501515961 503238449 505282288 505150833 506727371 508216515 508759727 511384125
3581.7 511384125 514279785 515920525 516307602 519540329 521755600 520842972 521822433 521951218 525026207
3590.4 525026207 527858429 530236359 530997543 531400871 534482651 533761711 535853233 539333267 540114899
3599 540114899 542807617 543921585 544529686 546284370 547752609 549982872 553034630 555199394 554597931
3607.7 554597931 556722298 556311073 557698708 564969215 566019325 564500847 568313484 568360939 571927719
3616.4 571927719 575842819 576233253 577170906 575743370 577502365 580919495 583162117 585188942 587933006
3625.1 587933006 590499039 592667122 598559380 598561478 589943161 594479561 598744545 603747864 605787125
$$ packed form
3564.3D85659370L181649L40309J186409J685905n73654K821961J288490J278839J573868
3573D98443146J447563J625252J722488K043839j31455J576538J489144N43212K624398
3581.7E11384125K895660J640740L87077L232727K215271r12628R79461J28785L074989
3590.4E25026207K832222K377930P61184M03328L081780p20940K091522L480034P81632
3599E40114899K692718J113968O08101J754684J468239K230263L051758K164764o01463
3607.7E54597931K124367m11225J387635P270507J050110j518478L812637M7455L566780
3616.4E71927719L915100L90434R37653j427536J758995L417130K242622K026825K744064
3625.1E87933006K566033K168083N892258K098q618317M536400M264984N003319K039261
$$ plain form
3633.8 605787125 604519806 607219582 610689926 612934074 613167305 613830376 616153450 619214172 620953751
3642.4 620953751 621610031 623937721 628084526 634263420 633421631 630128937 635221214 634236984 632227287
3651.1 632227287 632925262 637403297 641008148 645155869 651120682 644463806 645058975 650234070 652184067
3659.8 652184067 654150925 655157700 657102737 657906723 659189453 661189346 661706161 665587997 668046799
3668.5 668046799 667561646 668395767 662033005 664264832 672476730 681381989 681465759 663756104 666921921
3677.1 666921921 674464569 677672958 674964752 675709305 678383179 680281906 682253342 682799072 682987976
3685.8 682987976 686796875 693520966 685256424 681209412 690007095 685002441 683984375 689162827
3693.5 689162827 690293884 691833725 691673431 690812988 691764221 692411041 695142593 698250961 693652649
$$ packed form
3633.8F05787125j267319K699776L470344K244148K33231O63071K323074L060722J739579
3642.4F20953751O56280K327690M146805O178894q41789l292694N092277r84230k009697
3651.1F32227287O97975M478035L604851M147721N964813o656876N95169N175095J949997
3659.8F52184067J966858J006775J945037Q03986J282730J999893N16815L881836K458802
3668.5F68046799m85153Q34121o362762K231827Q211898Q905259Q3770j7709655L165817
3677.1F66921921P542648L208389k708206P44553K673874J898727J971436N45730J88904
3685.8F82987976L808899O724091q264542m047012Q797683n004654j018066N178452
3693.5F89162827J131057J539841j60294q60443R51233O46820K731552L108368m598312
$$ plain form
3702.2 693652649 690718002 694411697 695968018 696228714 696886673 700021515 704122772 696971207 700084229
3710.9 700084229 703954544 690731506 694912262 699339905 699405823 699930496 702315216 704110794 701020737
3719.6 701020737 701486206 706110611 702329712 699167175 704686661 705613174 704692307 701733398 701379242
3728.3 701379242 705572052 707205505 712355194 709663315 701519623 710049210 711189194 701071548
3736 701071548 701957397 704154510 704011536 706666565 710718842 707704468 709450684 718946304 704725113
3744.7 704725113 691461945 703709946 710200272 716959686 715292587 703378143 712111206 705754318
3752.4 705754318 699739456 705877075 710050125 713287430 708841171 710893097 716148987 708196030
3760.1 708196030 706148224 710271912 711704407 712318573 716217957 714277954 708969193 711671219
$$ packed form
3702.2F93652649k934647L693695J556321K60696O57959L134842M101257p151565L113022
3710.9G00084229L870315j3223038M180756M427643O5918N24673K384720J795578l090057
3719.6G01020737M65469M624405l780899l162537N519486R26513r20867k958909l54156
3728.3G01379242M192810J633453N149689k691879q143692Q529587J139984j0117646
3736G01071548Q85849K197113j42974K655029M052277l014374J746216R495620j4221191
3744.7G04725113j3263168J2248001O490326O759414j667099j1914444Q733063o356888
3752.4G05754318o014862O137619M173050L237305m446259K051926N255890p952957
3760.1G08196030k047806M123688J432495O14166L899384j940003n308761K702026
$$ plain form
3767.8 711671219 716893234 716998138 707462692 709050674 712646484 713310242 713812408 713032227 713782730
3776.5 713782730 714483414 717644272 717954559 709795761 711387100 713017502 713688507 715592117 712686615
3785.2 712686615 712235641 713854294 714751511 715317383 714451218 714647980 715225983 715507660 715273209
3793.8 715273209 716643448 719722824 716170349 712383652 713845215 717780228 724787598 718772583
3801.5 718772583 706965637 710261459 713452454 718195877 722436523 712859039 709775543 714210358
3809.3 714210358 715480576 715185776 715427780 716118622 717810822 722739334 722019424 708856277 712810516
3817.9 712810516 718844528 723129425 722751999 705988922 708308868 713366165 715179520 717529068
3825.7 717529068 718191757 714497604 713696976 715425720 718506470 719401855 712123337 715751343 723141022
$$ packed form
3767.8G11671219N222015J04904r535446J587982L595810O63758N02166p80181P50503
3776.5G13782730P00684L160858L10287q158798J591339J630402O71005J903610k905502
3785.2G12686615m50974J618653Q97217N65872q66165J96762N78003K81677k34451
3793.8G15273209J370239L079376l552475l786697J461563L935013P007370o015015
3801.5G18772583j1806946L295822L190995M743423M240646r577484l083496M434815
3809.3G14210358J270218k94800K42004O90842J692200M928512p19910j3163147L954239
3817.9G12810516O034012M284897l77426j6763077K319946N057297J813355K349548
3825.7G17529068O62689l694153q00628J728744L080750Q95385p278518L628006P389679
$$ plain form
3834.3 723141022 717086716 716192703 724666290 718106995 712919922 719233017 714354401 714117508 719964066
3843 719964066 716964798 713729553 715987473 716719742 717067947 718593674 717409515 719869080 725861359
3851.7 725861359 719819794 720536728 706539154 706808624 717055664 716407013 714144287 716059647
3859.4 716059647 718360977 720938110 716232071 716716309 723137436 717090149 711857681 715200348
3867.1 715200348 719754868 726670914 718990784 707506256 711452637 718010254 721771851 712122574
3874.8 712122574 712348938 716187515 716157990 718523636 722188568 715814896 709810791 716294861 718365555
3883.5 718365555 719591980 723015594 710120468 710707321 714939651 716855316 721334534 720407791
3891.2 720407791 713048248 713750153 715970306 714890823 716173859 717185516 719662247 721355743
$$ packed form
3834.3G23141022o054306q94013Q473587o559295n187073O313095m878616k36893N846558
3843G19964066k999268l235245K257920P32269L48205J525727j184159K459565N992279
3851.7G25861359o041565P16934j3997574K69470J0247040o48651k262726J915360
3859.4G16059647K301330K577133m706039M84238O421127o047287n232468L342667
3867.1G15200348M554520O916046p680130j1484528L946381O557617L761597r649277
3874.8G12122574K26364L838577k9525K365646L664932o373672o004105O484070K070694
3883.5G18365555J226425L423614j2895126N86853M232330J915665M479218r26743
3891.2G20407791p359543P01905K220153j079483J283036J011657K476731J693496
$$ plain form
3898.9 721355743 711979141 716643600 720007248 715369263 718077164 714536667 712731018 712949753
3906.7 712949753 714232025 716486588 716062393 716087418 716173401 716645966 716375885 715263901 716394577
3915.3 716394577 718360519 715477829 712573929 715958939 715721970 712965927 715466537 717648163
3923.1 717648163 718388748 715775375 713462219 715034180 716159973 717011642 715804596 715170441 716747971
3931.7 716747971 714063950 712532196 713820343 713822327 714199600 714699173 714615250 714714050 714624252 716020966
3941.4 716020966 717318649 713415527 712463608 714254913 715205154 716283493 713686295 713424454 714134750
3950.1 714134750 712463150 714242706 714398193 713406601 713914566 714547195 714693527 713837051 714270020
3958.7 714270020 713979492 714087143 714508133 713033066 713083344 713851013 714088364 714301300 714102631 713777771
$$ packed form
3898.9G21355743r376602M664459L363648m637985K707901l540497j805649K18735
3906.7G12949753J282272K254563m24195K5025Q5983M72565k70081j111984J130676
3915.3G16394577J965942k882690k903900L385010k36969k756043K500610K181626
3923.1G17648163P40585k613373k313156J571961J125793Q51669j207046o34155J577530
3931.7G16747971k684021j531754J288147J984L77273M99573q3923R8800q9798J396714
3941.4G16020966J297683l903122r51919J791305R50241J078339k597198k61841P10296
3950.1G14134750j671600J779556J55487r91592N07965O32629J46332q56476M32969
3958.7G14270020k90528J07651M20990j475067N0278P67669K37351K12936j98669l24860
$$ plain form
3968.4 713777771 713813400 713408508 713579865 714465561 714104843 714216614 714799042 714597549 713998489 713419113
3978 713419113 712957306 712856064 713477936 713970947 714191971 713735657 713506393 713638916 713578796 714040604
3987.7 714040604 714219437 714210892 713704605 713176117 712904892 713091049 713613129 712906113 712923508 713501740
3997.3 713501740 713535385 713286285 713255997
4000.2 713255997
$$ packed form
3968.4G13777771L5629m04892J71357Q85696l60718J11771N82428k01493n99060n79376
3978G13419113m61807j01242O21872M93011K21024m56314k29264J32523o0120M61808
3987.7G14040604J78833q545n06287n28488k71225J86157N22080p07016J7395N78232
3997.3G13501740L3645k49100l0288
4000.2G13255997
##END=$$ End of the data block
