##TITLE=$$ Begin of the data block
##JCAMP-DX=5.00 $$ ACD/SpecManager v 10.08
##SPECTROMETER/DATA SYSTEM=Varian
##DATE=15 Jan 2013 15:07:12
##DATA TYPE=INFRARED SPECTRUM
##DATA CLASS=XYDATA
##ORIGIN=
##OWNER=
##NPOINTS=3735
##FIRSTX=399.26403809
##LASTX=4000.35498047
##MAXX=4000.35498047
##MINX=399.26403809
##MAXY=76.62364197
##MINY=38.00395966
##XFACTOR=1.0000000000
##YFACTOR=0.000000100000000
##FIRSTY=58.26379395
##DELTAX=0.96440572
##XUNITS=1/CM
##YUNITS=TRANSMITTANCE
##XYDATA=(X++(Y..Y))
399.3 582637939 582805748 568924942 570937309 574105797 569497566 561052628 551934128 556505928
407 556505928 569008904 571478844 567799301 572070808 575991898 571792526 570765305 569775391 560664520
415.7 560664520 560850105 574171410 573927765 554964409 559744453 568434830 569563637 563432426
423.4 563432426 562404938 559478264 559577713 557801819 557307968 561920471 560682259 563041840 569189339
432.1 569189339 571164970 569259834 566553574 567143860 566529350 564157333 559370575 558559227 563735161
440.7 563735161 565988159 562810211 562856178 566042900 564098206 562248001 560642776 560311584 565326843
449.4 565326843 565997505 562372284 560157471 562245865 564771614 561402702 557699394 554055099 551252975
458.1 551252975 556946869 559641647 560131607 559421616 557943192 561176338 564517250 562084618 558657074
466.8 558657074 556774826 554135742 550818138 551790504 553938103 552738609 553104286 554401627 555375710
475.5 555375710 556604462 555923729 552502403 549425011 549326134 549808044 547719650 547804108 551108665
484.1 551108665 551300087 550871658 549612770 546246071 544692841 546886711 550083542 549333267 546782112
492.8 546782112 546207085 545991936 547639198 549036865 548242378 549763336 551588860 550739288 549842339
501.5 549842339 546950226 545704269 548559952 549300957 547943916 548959351 548933983 546359406 545173378
510.2 545173378 544651871 544393578 545899353 545977478 545484810 545627594 545154915 544401131 544761391 546376343
519.8 546376343 544088440 541053238 541330376 542028122 543307838 543388214 542225227 543094940 543223190
528.5 543223190 543681564 543683777 540989532 538735466 537632790 537678032 539752502 542384987 543657951
537.2 543657951 543368950 541620941 540844307 541519547 539839172 537362328 536583366 536710968 537391510
545.9 537391510 536686707 535880928 537075806 538848991 539410210 538772850 537710686 536644287 535079651
554.5 535079651 533825569 534119644 534437103 536050911 537226372 536453476 537320213 537381821 535681763
563.2 535681763 534605904 533507118 532529640 532716446 532961082 533312798 535803833 536986237 537052612
571.9 537052612 535842247 533033333 532438316 531945229 532808685 534082909 533159790 532883720 533509941
580.6 533509941 535138054 535308990 534124985 534897766 535530815 533973808 532837296 533420219 533984032
589.3 533984032 534787331 535841827 536322594 536551857 536945801 537138062 536752853 536495743 536898232 538133049
598.9 538133049 538334351 537650566 537705193 537576065 538010254 538882065 539477577 538802643 536886940 536095581
608.5 536095581 536124344 535998077 535644875 535209656 535282822 536138611 535878716 534995155 534931450 534092979
618.2 534092979 533434792 533025970 534786949 537282677 536965485 537432327 538242874 538557663 539309387
626.9 539309387 540208893 540821266 539685364 540298157 542556152 543848114 545177803 547184296 549938049
635.5 549938049 550554008 549876823 550089073 550774651 551927834 551993713 551355476 552212296 554380302 556088066
645.2 556088066 558005524 559900703 559472923 558297348 558731728 559050407 558185387 559619713 561508713
653.9 561508713 562287064 563497086 563213501 562950401 562291527 562310104 563124199 561814117 561227036 561258850
663.5 561258850 561401024 562587585 564161110 564450455 559037666 561231346 564130859 565565071 565063362
672.2 565063362 564596634 565105476 564627228 564928474 566831856 569628372 572047920 572540092 572179070
680.9 572179070 572018814 571351433 570875435 571360703 572199707 573389854 573948669 574794960 576499214
689.6 576499214 578460999 579862328 579375572 578714981 578256645 578748360 578951569 579128761 581129570
698.2 581129570 581335983 581054497 581558113 582222557 583372421 584064522 584410324 583703346 583495331 584339714
707.9 584339714 585851707 587336884 587471886 587838783 589137535 590434074 590813522 590891991 590066910
716.6 590066910 589039612 588995514 589058037 589822540 590144081 591247368 594029884 595739670 596003342
725.2 596003342 596619492 596938744 595337753 594941711 595355759 595559769 597179756 598674889 599299049
733.9 599299049 599381752 600597267 602064972 601920052 601290741 601399231 601965027 601796112 601903992 602524490
743.6 602524490 603770561 605085793 604984932 604258995 604011345 604854622 605320778 605400848 606109924 606431160
753.2 606431160 606894989 608203735 609451294 610124588 609966660 610074043 611668777 612297134 612506332
761.9 612506332 613222847 612739334 613093872 614606934 615469093 615263023 615517120 616405106 616833115 617045784
771.5 617045784 616274490 615600624 615247116 615112267 615552254 615470467 615264168 615567970 616404457 616985817
781.2 616985817 617329330 617701111 618075256 617881355 617522354 618091278 617925873 617821655 618749886 620185699
790.8 620185699 621100235 620543289 620018120 619433479 618651848 617960701 617546844 617143288 617223854 617092896
800.5 617092896 615825043 615624962 614636459 612881203 612055321 610717621 609230309 607434349 605925636
809.1 605925636 605675850 605323677 604135361 603281746 602642632 601959114 601072769 599331245 598147659
817.8 598147659 597531929 596964493 596786270 597796211 599766846 600203743 599830093 600472450 601225624
826.5 601225624 601838455 603686028 605438080 606584244 609192963 612344818 615425644 617337914 618225403
835.2 618225403 619512825 620859184 622610283 623888931 625126228 625945511 626877556 629480934 631931190
843.9 631931190 633129272 633734398 634628220 635642395 637268219 637651329 637318497 638958244 640282745
852.5 640282745 640719910 641782074 643727875 644955139 646677704 648680038 648600769 647716827 647181320
861.2 647181320 648464127 649753494 650609055 651059647 651165085 651843033 651630402 651715164 650471268
869.9 650471268 648655930 647196350 645729446 645232773 644479294 644384613 644722824 645753937 645930939
878.6 645930939 646072540 646245270 644269638 643238068 641894531 641146545 641103058 641101608 641509705 640957336
888.2 640957336 641637421 641746826 641846542 641885376 640584335 640126114 640011444 639829865 639638367 641280365
897.9 641280365 643291473 643800659 643719330 643666000 644034348 643128967 642239304 642350845 643253403 644561005
907.5 644561005 645367889 646335297 648141098 649923782 650024338 649406662 647952118 646143646 643994141
916.2 643994141 641640472 640180893 638592567 637679176 637214851 636690140 634929886 633180962 631643524
924.9 631643524 628165703 625289230 622040062 618825150 616756020 615225182 614595642 613900452 613950005
933.6 613950005 613852539 613529053 613255844 612249336 610928917 609590302 608801842 608323669 608686867
942.2 608686867 608631668 608213844 608687630 609305305 609738426 608660774 607065735 605664711 604526863
950.9 604526863 604091072 603629494 603184128 602815704 602751236 602033157 600593300 598901100 596613541
959.6 596613541 593906403 591455307 589862366 588448296 587249069 586206055 585552521 585357018 584680519
968.3 584680519 583589134 581884079 579456940 576632004 574121132 572002754 570184975 568777428
976 568777428 567349319 565871696 564164200 562088509 559311523 555393791 551174202 547894020 544800606
984.7 544800606 541539268 538909912 536188927 532955971 529846191 527219086 524338760 520653572
992.4 520653572 516725998 513426819 510233917 506920280 504048157 501703186 500345993 498239861
1000.1 498239861 495242424 492921066 491791306 490736961 488661537 486908340 484875755 483410873
1007.8 483410873 483250771 482928696 482104568 481294022 480901108 480235481 478892479 476195221 473866577
1016.5 473866577 472164841 470121765 468353500 466412773 464771423 462266731 460344048 459134560
1024.2 459134560 457395439 456312065 454868851 453118286 451168022 450248222 449730453 449826431 450467644
1032.9 450467644 449927292 449460678 448528862 448245544 448214035 448947182 450312958 450804863 451562538 451524506
1042.5 451524506 451950188 452091179 452261810 452897720 452730026 452956161 452719078 451771507 449882355
1051.2 449882355 449167442 449129105 448786888 449467392 450016937 450585327 450478973 451255455 451937523 451622849
1060.9 451622849 451907082 453066368 455359879 457237053 459876709 462073174 463638382 465598869
1068.6 465598869 466558189 466925430 467609825 468973389 469131432 469496918 471204224 472479134 472139854
1077.2 472139854 471530685 472668991 473940430 475497208 476123085 476680183 477599754 477535515 478678207
1085.9 478678207 480167503 481938057 483099976 484066162 485849495 487224541 488240929 488440742 489329987
1094.6 489329987 490076637 490808105 492421875 493397560 494480133 495790482 497948761 499981384 501200676
1103.3 501200676 503386574 504616356 503802567 503525085 503942680 504646072 505767860 506671104 507925606
1112 507925606 508723564 509040909 509201393 508828392 508690338 508237000 508105431 508392067 508551407 508736649
1121.6 508736649 508950005 509516716 509950066 510518379 510341377 510598373 511644325 511870880 513229256
1130.3 513229256 515066833 516602745 518597298 520285797 521073494 521534500 522167892 523008461 524556274
1139 524556274 526127281 527194214 527933235 528897591 529639969 530151443 531376915 531954727 532435608
1147.6 532435608 533127937 533173714 532959633 532291756 532117081 532096214 532552528 533561134 533533630 533589668
1157.3 533589668 533227539 531804085 530647087 530237350 530202026 529771347 529502716 530110397 531465683
1166 531465683 532579117 533069992 533855591 535135040 536547089 538130226 539690819 540938911 542515602
1174.6 542515602 544684525 546595650 548617401 550422440 551506653 552981987 554259796 555120964
1182.4 555120964 555623512 556050606 557223206 558077087 558340302 559160614 560271797 560409317 560012093
1191 560012093 559485283 558614235 558077393 557918358 557433395 556573792 555674095 555068626 554747849 554062386
1200.7 554062386 553372383 552607765 551664391 550588264 549228477 548596840 548082085 547641602 547666130
1209.4 547666130 547436142 547238846 547108345 546940117 546533737 546156158 546386986 546959534 547255898 547039719
1219 547039719 546941566 547001457 547062988 546974068 546768188 546608772 546182709 545820122 545340500 544685936 543935051
1229.6 543935051 543341103 543399048 543275337 542596092 541644440 541196480 541383476 540894241 540338097 540401726
1239.3 540401726 540097504 539582939 539419365 539366035 538893433 538202019 537917976 537425766 536609421 536225700
1248.9 536225700 535923004 535665855 535771217 535638733 535511398 535420380 534949875 534772186 534547195 534240074
1258.5 534240074 534213181 534079971 534140129 534376526 534857864 535574799 536001282 536236801 536792145 537356033
1268.2 537356033 537799416 538121033 538374939 538999863 539506302 540394135 541630096 542718582 543710518
1276.9 543710518 544157295 544951553 545952950 546678696 547377396 547928772 548953171 550666084 552222443
1285.5 552222443 553079453 554081116 555332527 556192017 557009506 557943268 558830376 559610748 560022812
1294.2 560022812 560740242 561624947 562078056 563031197 563960876 564850922 565323029 564862328 564842949 564799690
1303.9 564799690 564933739 565424805 565230103 564961815 565290794 565560684 565311584 565091934 565271683 565582848
1313.5 565582848 565448112 565004082 564591255 564567947 564955788 565389404 565956535 566395073 566964188 567969589
1323.2 567969589 569000893 569065094 568607788 569007378 569347496 569228859 568893433 568643684 568799515 569108086
1332.8 569108086 569249954 569127045 569040108 568562241 568497849 568554344 567845917 567508698 567868347 568596001
1342.4 568596001 569231453 569940109 570370560 570752449 570914497 570553970 570916672 570746880 570373650 570156860
1352.1 570156860 569900894 570057106 570072899 570339355 570501785 570597763 570100327 569550743 569012222 568325615
1361.7 568325615 567795334 566116714 566723137 567274742 566680069 566673203 566211739 565798378 565736427 565864677
1371.4 565864677 565555992 564642715 563614845 562872276 563046989 563260307 563463783 563433914 563335915 562928085
1381 562928085 562216301 561251068 559743958 558739891 558491478 558438454 556047516 554559441 554755249
1389.7 554755249 554239540 553551598 552859383 552239494 550241089 547608185 546767120 545733604 544578362
1398.4 544578362 542345848 540942650 540766678 540280762 539804344 539329453 537207031 535213852 534623795
1407.1 534623795 533640442 532337532 530966454 530073471 529665680 529312820 529305649 529219513 528911896 528073120
1416.7 528073120 527268715 527233543 524891510 524757347 526100922 526890411 527240410 526929283 527905121
1425.4 527905121 529050064 529280472 529590034 529400101 528506699 528986778 530635796 531375427 531834641
1434.1 531834641 533189926 533888931 533696060 534791908 536572533 537391930 537592087 538151093 538431625
1442.7 538431625 538987617 539605789 540719109 541837425 542447510 542295151 542774124 543543816 543446121
1451.4 543446121 543818932 544155388 545161171 546431007 546215668 545331459 545514107 548008728 549608879
1460.1 549608879 551394348 552272606 553110504 554813538 553659248 554344559 556345291 558466644 560268097
1468.8 560268097 561948395 564898376 566955757 567540588 568269730 570744820 573503227 573944740 575511627
1477.5 575511627 578070755 579735718 581251602 582491608 583701553 585142822 586230659 587280426
1485.2 587280426 588417854 588339615 588129845 589956055 589767647 588964653 589882584 590101929 589505005
1493.8 589505005 588732033 588053436 583532028 583899155 582888031 579558525 580297585 579894676 578728714
1502.5 578728714 578064537 578717232 579277611 573705673 567517242 569479218 571898346 571717186 572779655
1511.2 572779655 571865578 570198326 571036530 571013908 571183472 568414345 566035995 568305206 569749489
1519.9 569749489 568268204 566131020 567125053 568744698 570928688 570396690 570454063 572068291 572307205
1528.6 572307205 572634239 573338623 574378662 575400314 575349274 574366455 576002579 577347412 578619843
1537.2 578619843 580649948 578364487 575361099 577921638 578804283 578243103 580180016 581670990 580298805
1545.9 580298805 582194901 583503265 584432716 584525261 583141441 583890152 584397850 585399895 583328896
1554.6 583328896 583699913 586715317 589628029 587993965 574541740 577775688 580539780 581955528
1562.3 581955528 581687393 580694656 578079033 576535301 576576385 575929375 575801048 569129219 568099060
1571 568099060 567532845 565215645 563373756 561460495 560790138 550722504 549645576 548661575 546471405
1579.7 546471405 544125175 540817299 538766670 534651985 531669540 527602158 524233322 520972862
1587.4 520972862 517151299 515161552 511179771 509022865 505091591 502362099 499191399 494948845
1595.1 494948845 492523804 488278008 486203041 482646332 480771294 478063126 475496025 473985672
1602.8 473985672 470650673 469678955 466511803 464746437 461693077 459882431 458358192 455871201
1610.5 455871201 456005783 453552666 453085785 451243401 451733665 451902542 445410385 447147903 446099243
1619.2 446099243 446518478 445000534 445960617 446444702 443913345 445429306 445692902 447852287 446735039
1627.9 446735039 447272072 448100853 448977470 450231056 450335541 452506027 453402901 454799347 453080635
1636.6 453080635 455382233 457040253 458008347 459805908 460004997 462240143 462524109 464068642 465684929
1645.3 465684929 464979057 467039566 466405182 468905373 469861755 472295341 474123459 470905914 468276863
1653.9 468276863 470041466 473841972 474579086 475933342 476717186 477945938 479259605 480648575 483106804
1662.6 483106804 482747574 485412865 486906395 488684006 490870132 493011856 495180550 495723152 499475861
1671.3 499475861 500820885 503866043 507171021 509191589 510827560 513538857 517302055 519737129
1679 519737129 523192291 525442963 529551086 534729958 536226654 537685547 539678345 544708252 548150673
1687.7 548150673 551484680 555203857 557809639 561594849 565232277 569036598 572909317 576486053
1695.4 576486053 576021233 580961876 586712341 591708412 593354607 591230354 598512230 603411407
1703.1 603411407 606634598 608745766 611746063 614161987 616178551 619889030 622381439 623823357
1710.8 623823357 625730591 628101120 630963860 632062416 633018570 636010742 636665268 632197952 636603012
1719.5 636603012 640433731 642163544 643527985 644418335 645232391 646585312 647715225 648504791 649821396
1728.2 649821396 651909943 652024536 652503891 656123276 659628372 658204727 653594666 656950226 659964066
1736.9 659964066 661646576 664478226 664864960 663718414 667393494 670400925 670917511 671640625 674335709
1745.5 674335709 676580963 678207321 679617844 680635910 684672165 685816727 686367035 690443649
1753.3 690443649 693025513 695373077 697629318 697682724 699217377 701928940 704358368 707187805 706144409
1761.9 706144409 705405426 708540726 710618286 712024536 713661575 714774780 712901077 714893646
1769.7 714893646 718906021 719653625 717743607 716383057 719998016 721863327 721310425 723102264 723700790
1778.3 723700790 725212479 726089935 724988480 725550003 727158585 728622589 727893372 728022919 729532852
1787 729532852 730483704 731123505 732757797 734188080 735253754 733583984 731787415 734744415 736091232
1795.7 736091232 735276413 736070709 738047409 738509521 737060089 738495255 738302841 738730240 740313492
1804.4 740313492 740631256 741582642 742279129 742170410 742439117 743284836 742660446 743454514 744940643
1813 744940643 745602875 746468201 746243515 746768036 746570511 746809158 747695007 747576904 748375702 748285599
1822.7 748285599 749184799 750142136 748157883 748546448 750791855 753209763 753266907 748815079 748937836
1831.4 748937836 751265335 751659164 751816025 752311630 752995987 753690262 753650360 754672318 754828873
1840.1 754828873 754878464 754888153 756340179 757392883 751732330 753339157 755722122 756091309 756370316
1848.7 756370316 756999588 757674179 757448349 757898331 757679367 757564240 757482147 757581787 758220215 758241043
1858.4 758241043 759057465 759311523 759752121 759739838 759417267 759534836 759535294 760211105 759938660 760415039
1868 760415039 759916992 759105225 760338516 760891113 761170349 761135178 761494293 761571274 761693039 761625443
1877.7 761625443 761224213 761490402 761736221 762291183 762381210 762897949 763314590 763211594 763037643 762478256
1887.3 762478256 763423462 763641510 762033615 762243652 763043137 762921295 763284073 763640823 762976837
1896 762976837 763437729 763584061 763680725 763591080 763088837 763116760 763371201 764070663 763952560 764188004
1905.6 764188004 764589005 764436874 764477921 764521866 764289169 763904190 764339142 764257812 764618454 764791794
1915.3 764791794 765027313 766236420 764689102 764070740 764633026 765015259 765511322 764240494 763431854
1923.9 763431854 764191208 765354767 765458755 765303650 765232849 765197983 765224915 764860916 764752655 764308319
1933.6 764308319 764539871 764755478 764559555 764441376 764692459 765515594 765523376 766107178 765345535 763076553
1943.2 763076553 763466187 764359665 764682236 764438477 764584122 765017853 765292740 764731674 764380646 764500809
1952.9 764500809 764072342 763972778 763558426 763533173 763815460 764136581 764476852 764261017 764120789 763627243
1962.5 763627243 763363266 763195953 763558731 763917618 763199387 762911148 763261795 763908844 763980865 764159851
1972.2 764159851 764018173 763489151 763339462 762915039 762699814 762451630 762717285 762908401 763196716 763645554
1981.8 763645554 763406067 763511353 763207397 762676926 762286835 762313919 762056885 761686020 762621460 762915192
1991.5 762915192 762290421 762315369 762835999 762722855 762444382 762003555 761246643 761209412 760884781 761049118
2001.1 761049118 761189957 761360245 761958008 761865005 761736603 761124039 760729218 760336456 760075226 760048294
2010.7 760048294 759804535 760187836 760360031 760710754 761022797 760769043 760036240 759724960 759632416 759135361
2020.4 759135361 759028397 758551102 758824310 759231186 759293365 759789352 760011520 760218506 759529266 758857574
2030 758857574 758018494 757225571 757089233 756728821 757036743 757718811 758548050 758886108 758862305 758588104
2039.7 758588104 758182983 757832565 757115402 756896439 756357193 756301956 756597595 756987457 757637711 757714310
2049.3 757714310 758149338 757907639 757497482 756941605 756291046 756099854 755617065 755708084 755962448 756564484
2059 756564484 756996613 757350693 757461090 756891708 756656265 755948257 755413132 755120239 755060043 755071640
2068.6 755071640 755476913 756253281 756259155 756839218 757017059 756555786 755780792 754992294 754760361 754602203
2078.2 754602203 754744415 754438629 755050278 755951309 756088791 756070709 755834122 755668869 754722977 754099655
2087.9 754099655 753783417 753587189 753800964 754193497 754385986 754123230 754820328 755045853 754788666 754262466
2097.5 754262466 753571167 753257446 752716141 752865219 752822800 753414001 753935471 753857880 753941345 753289566
2107.2 753289566 753175049 752743835 752394104 752026825 751505737 751813354 752084503 752707138 752795258 752924194
2116.8 752924194 753242874 753002167 752435837 751759033 751444092 750927505 750801010 750887451 751343384 751948090
2126.5 751948090 752197647 752456512 752361450 752063293 751356049 751194000 750894470 750427246 750622559 750783997
2136.1 750783997 751134415 751185303 751591110 751629944 751254120 751187363 751022568 751149292 750689621 750335770
2145.8 750335770 750463181 750998917 751430206 751367950 751436462 751210480 751364899 751300278 750904770 750601807
2155.4 750601807 750414810 750558777 750492325 750524368 750754395 751192551 751224823 751225433 751274567 751222000 751212387
2166 751212387 750662918 750651093 750769196 750889359 750825195 750683975 751051788 751120682 751238251 751018295
2175.6 751018295 750906525 750516510 750264282 750398712 749838181 750179672 750801544 751074600 750992279 751063614
2185.3 751063614 751291428 751014557 751109772 751081009 751315765 751053238 750580139 750825806 751138306 751008759
2194.9 751008759 750215759 750522919 750973129 751271515 751300430 750798111 751019745 750870819 750798874 750695953
2204.6 750695953 750618362 750677338 750634995 750784683 750755463 751210480 751324387 751361160 751483536 751423950 751500015
2215.2 751500015 751392975 751459808 751390839 751360092 751043777 751153336 751400146 751207123 751513901 751446838
2224.8 751446838 751339798 751220627 751268997 751143799 750657806 750606842 750696182 750909653 750747528 751138840
2234.5 751138840 751165619 750577393 750542755 750547180 750798950 750580826 750590897 750466690 750407104 750818634 750727005
2245.1 750727005 750933762 750817261 750836258 750807266 750581818 750410004 749920044 749795227 749676514 750156403
2254.7 750156403 750477600 750357895 750388947 750312729 750248108 749913712 749891052 749818192 749564896 749258652
2264.4 749258652 749452820 749791031 749766159 750079193 749875870 749903412 749805756 749438477 749479523 749514542
2274 749514542 749749069 749706650 749647446 749276047 749203339 749001999 748602905 748733521 748323975 748330307 748255157
2284.6 748255157 748399429 748521957 748064651 748312912 748289642 748316422 748478241 748684235 748556137 748208694
2294.3 748208694 747999039 747460861 747643814 747626419 747872696 748268661 747923508 747648849 747376175 747482147
2303.9 747482147 747343521 747203140 747151566 747331238 747515030 747205505 746890488 746368103 746888657 746858902
2313.5 746858902 746289825 746623611 746625137 746326752 745789566 746156998 746683197 747190704 747855453 747534561
2323.2 747534561 746562347 745856018 746583405 746932373 746661453 745978928 745222778 745347748 745364151 745590286
2332.8 745590286 744992218 744307098 744267426 744509583 744757462 744189377 743539734 743620987 744025040 744055252
2342.5 744055252 744894638 745008621 743744278 742435989 741299744 741384277 742630310 744180679 744398270
2351.2 744398270 744705353 745125351 744237442 743560791 742597046 742914658 743228226 742890549 742981033 743338165
2360.8 743338165 743452225 743287048 743583374 742258606 741912003 741645966 740789032 739950485 738955154
2369.5 738955154 739595032 739612122 739739609 739626617 738828735 738394547 738022614 738026886 737532730 737392197
2379.1 737392197 737633667 737555237 737380066 737183990 737066040 736733856 736496429 736115417 735697174 735603638
2388.8 735603638 735731354 735716324 735518265 735393219 735035477 734952621 734683304 734313660 734161224 733787918
2398.4 733787918 733680801 733811340 734027939 733619843 733274918 733420563 733193359 732730331 732295990 732201843
2408.1 732201843 731832504 731657562 731784134 731749954 731652527 731177063 730794067 730310974 730002594 729691620
2417.7 729691620 729289322 729094696 728895111 728972321 728661575 728421783 728491592 728681183 728579941 727782974
2427.3 727782974 727356873 727086639 726991730 726872025 726512833 726434784 726455460 726318817 726057510 725829315
2437 725829315 725188828 724670258 724598923 724627686 724219666 723678055 723818207 723515244 723156891 723127823
2446.6 723127823 723232651 723372116 723043671 722763748 722136230 721662292 721375046 720559616 720005875 719961090
2456.3 719961090 719984360 719983521 719977417 719784317 719932938 719621048 718666229 718280029 717923203 717476120 717239227
2466.9 717239227 717047958 716789856 716847992 716766205 716450424 716464157 715906067 715211716 715038605 714924927
2476.5 714924927 714395981 714000320 713880997 713448257 713218384 712995453 713063507 712871475 712410660 712366028
2486.2 712366028 711605301 710761032 710515671 710539551 710267487 709943542 709667969 709247513 709373093 709191208
2495.8 709191208 708773117 708206940 707649765 707590790 706986389 706166382 706115341 706448441 706194763 705997391
2505.5 705997391 705764694 705277405 704926682 704000626 703485794 703425674 703224106 703083038 703037338 702994766
2515.1 702994766 702721481 702605972 702175751 701657410 701343155 700980453 700478821 700033722 699994507 699743958
2524.7 699743958 699671783 699444122 698789597 698537445 698572006 698195038 697675476 697709351 697186050 696788254
2534.4 696788254 696916199 696800537 696539001 695805206 695451508 695469666 695653915 695426865 694729919 694303894
2544 694303894 694020691 694306183 694144058 693715820 693191757 692437668 692469940 692389526 691967850 691550980
2553.7 691550980 691414108 691304474 691059494 690848389 690317459 689935532 689549942 689263382 689134521 688996582
2563.3 688996582 688915176 688569641 688146286 687819595 687587891 687364273 687429810 687394409 687052383 686714401
2573 686714401 686246109 685959778 685785522 685679932 685276566 684769821 684687347 684706879 684526825 683929977
2582.6 683929977 683234482 682696838 682681198 682498093 682078934 682048187 681821365 681787643 681697922 681301727
2592.2 681301727 680839157 680469437 680133972 679756317 679661255 679190063 679019852 679140625 678844299 678461761
2601.9 678461761 678296509 678445969 677903900 677244339 676676941 676160736 676027069 675596390 675483246 675510788
2611.5 675510788 675314865 675147629 675002289 674625320 674091644 673601227 672869186 672631531 672438812 672045517
2621.2 672045517 672055664 672041245 671705017 671226120 671233521 671031799 670348282 669841232 669527740 669247131
2630.8 669247131 669025269 669003143 668536453 668066635 667895432 667513275 667196274 666990356 666682816 666162186
2640.5 666162186 665763016 665291214 664798203 664609604 664399261 664270706 664225998 664101410 663824692 663542404
2650.1 663542404 663296356 662791061 662171249 661936951 661645508 661315689 661547928 661396713 661079102 660828857
2659.8 660828857 660358353 660167465 659936523 659932404 659805069 659083633 658418427 658283310 658362198 658123169
2669.4 658123169 658151703 658207245 657778549 657317505 657155991 657163391 657226486 656974411 656191483 656040344
2679 656040344 656231613 655846252 655290222 655201874 655423126 655121231 654762268 654476089 654186478 654068375
2688.7 654068375 653780060 653463440 653276291 653182907 653010406 652790833 652590256 652370071 651902618 651634903
2698.3 651634903 651673584 651481705 651366043 651025314 651010284 651062927 650680618 650560760 650292358 650208511
2708 650208511 649893494 649420471 649143066 648825302 648730316 648150635 647886810 648114624 648120956 647913589
2717.6 647913589 647742615 647947464 647742920 647336578 647011337 646751862 646623306 646577911 646492691 646242065
2727.3 646242065 646405029 646371613 645887146 645176010 644768906 644989548 644717407 644094849 643941269 644448929
2736.9 644448929 644507828 643958817 643804092 643837891 643876953 643577271 643267441 643205185 643148270 642921906
2746.5 642921906 642347336 642205353 642569656 642761230 642690659 642469177 642261810 642203445 641589432 640893631
2756.2 640893631 640810394 640357666 640325928 640826111 640847092 640788193 640679474 640403519 640210495 640061035
2765.8 640061035 639306221 638473740 638183823 638110504 638178253 638137932 638051987 637947311 637839622 637644119
2775.5 637644119 637347527 636721954 636009750 635920906 635631104 635392647 635507088 635104828 634694557 634958344
2785.1 634958344 635353775 635319481 634887505 634044037 633486328 633001060 632377930 632257042 631951637 631519966
2794.8 631519966 631590843 631858521 631639023 631112404 630462952 629781227 629561234 629278870 628743057 627860489
2804.4 627860489 627336540 627417793 627196388 627004776 626810989 626309433 625343590 624610519 623967857 623263283
2814 623263283 623363571 623076019 622588692 622218323 621551208 621304817 621018066 620466385 620062103 619644585
2823.7 619644585 619000244 618416367 617718353 617164650 616838875 616262741 616017609 615592041 614901276 614641953
2833.3 614641953 614547768 613766441 612283707 611413994 610671158 609495316 608559723 608102989 607448387
2842 607448387 606185608 605101357 604167213 603173027 601825943 600084343 598500595 596931915 595552902
2850.7 595552902 594795189 593960953 592779007 592516479 592770309 592734184 592672691 592494431 592300301 591911278
2860.3 591911278 591563950 591386757 591237373 591039619 590790787 590547981 590102615 589643440 589000435 588245811
2870 588245811 587500763 587187233 586968803 586385384 585930748 584902534 584582100 584840164 584354210 583982048
2879.6 583982048 583512154 583146515 582427826 581834526 581657524 580886955 580187416 579487724 579028015 578595200
2889.3 578595200 577801132 577169418 576922646 576688271 575826492 575242996 574751167 573995094 573362579 572578087
2898.9 572578087 571869011 571367950 571057625 570471001 569828606 569324417 568550377 567905884 567661362 567283783
2908.6 567283783 566437912 565617027 564492187 563578262 562994995 561888390 560942497 559920654 558980675
2917.2 558980675 558038254 556681900 555692062 554702530 553716354 552960815 552260551 551798859 551715698 551922417
2926.9 551922417 552268906 552379341 551755257 551330376 551664658 552027893 552428093 552958031 553098946 553199310
2936.5 553199310 553650818 554486732 555519180 555560532 555953522 557308655 557468987 557151718 557579803
2945.2 557579803 558594513 559399071 559613876 559948921 560249786 560578232 561205902 561781235 561848793 561644173
2954.8 561644173 561718521 561926727 562518959 563086472 563162346 563781700 564565620 564841347 565140495 565309143
2964.5 565309143 565557861 566012497 566465073 567034416 567729225 568439598 568813477 569411163 570242310 570658607
2974.1 570658607 570756760 570829926 571293793 571700592 571974792 572104530 572075157 572332230 572416534 572578506
2983.8 572578506 573199806 573713379 573623466 573477058 573602943 573661613 574063377 574589386 574715424 574293137
2993.4 574293137 573801460 573620605 573674622 573763237 573262405 573013153 573071213 572782631 572546501 572159920
3003.1 572159920 571727638 571391945 571091423 570875130 570976982 571077042 570510483 569790611 569341240 569060745
3012.7 569060745 568883438 568672295 567920494 567328911 567728310 567750282 567061348 566418228 565740814 564779625
3022.4 564779625 563982239 563760872 563491325 563075180 562746277 562377853 561973190 561486359 561024284 560569878
3032 560569878 559858818 559242859 558706741 557954216 557402115 556679077 555980988 555863800 555609970 555017090
3041.6 555017090 554420395 553911705 553264389 552494049 551665649 551076889 550960503 550675240 550021591 549178162
3051.3 549178162 548544579 548113213 547481079 546884346 546854248 546781540 545672417 544668694 544020767 543360062
3060.9 543360062 543232536 543373947 543049507 542230682 542004166 541494102 540707245 540523453 539916611 539151917
3070.6 539151917 538164635 537439766 537131462 536710968 536971931 537127876 536500664 535690384 535457802 535318680
3080.2 535318680 534437561 533388901 532666702 532593536 532568245 532000046 531456604 531382370 531086845 530322914
3089.9 530322914 529507866 528766785 528896713 528838387 527992363 527465172 526848946 526255379 525902863 525522728
3099.5 525522728 524740219 523978462 523871193 523441048 522570953 522143288 522306595 521969070 521128960 520992661
3109.1 520992661 520846481 520239105 519709854 519227676 518671417 517887268 517203522 516873550 516567001 516060028
3118.8 516060028 515037346 514165764 513962059 513492012 512458191 511620636 511677704 511762047 511068878 510353432
3128.4 510353432 509899902 509781113 509259071 508240929 507442360 506788177 506344261 505806084 505319862
3137.1 505319862 504860840 504137955 503509178 503066788 502603378 501765900 501048965 500531425 499576797 498761406
3146.8 498761406 498768387 498587723 497829666 497646370 497489357 496660461 495504646 494757805 494551926 493773270
3156.4 493773270 492832489 492336578 491928253 491343918 490882759 490489502 489482040 488405342 487705116
3165.1 487705116 487518387 487324982 486800575 486431351 485763626 484777870 483725128 483406258 483394699 482318001
3174.7 482318001 481340866 481081390 480722656 479834938 479132195 478949051 478211784 477168770 476683807
3183.4 476683807 476582451 476264076 475498276 474640999 474046478 473882980 473537292 472576180 471760292 471318855
3193 471318855 470943451 470492744 469744225 469263687 468961830 468391190 468093681 467308273 466043015 465788956
3202.7 465788956 465588837 464727287 464532013 464446869 463835144 463080254 462319450 462358322 462187309 461349182
3212.3 461349182 460836830 460081520 459276505 458771744 458595085 458766556 458373489 457359810 456401138
3221 456401138 455759315 455546341 455395737 454999619 454553032 453874626 453507462 453620148 453191528 452477455
3230.7 452477455 451948929 451495934 450769196 450150681 450040703 449465981 448423615 447900200 447930946 447683868
3240.3 447683868 447112885 446530380 446456261 446904373 446544151 445676842 444836502 444196091 443821907 443544846
3249.9 443544846 443473396 442711792 441869545 441647263 441816711 441539841 440500221 439919357 439213829 438650551
3259.6 438650551 438676796 438580055 438183937 437492981 437454987 437382050 436700439 436249847 436140633 435920982
3269.2 435920982 435442963 435323334 435302467 435066032 434526215 434010506 433677864 433265610 433232841 433085098
3278.9 433085098 432578773 431937675 431494141 431527367 431423950 431163216 430879707 430230408 429325218 429092941
3288.5 429092941 429248123 428946991 428558807 428127556 427957039 428067894 427828827 427264023 426774025 426477013
3298.2 426477013 426121979 425607567 425121460 424794388 424555321 424445877 424285889 424064102 423950882 423837013
3307.8 423837013 423307800 422489510 422129974 421762772 421415215 420915146 420229378 420000954 419353027 418942184
3317.4 418942184 418989220 418458176 417558823 416918831 416739578 416259308 415935135 415708656 415057678 413997459
3327.1 413997459 413089409 413041077 412305870 411397934 411095924 410871048 410877914 410336800 409609947 408951797
3336.7 408951797 408212585 407294350 406534615 406684494 406679878 406165466 405439339 404467278 403878975 403839531
3346.4 403839531 403363342 402385368 401479530 400788651 400637245 399877243 398989639 399301643 399363594 398591232
3356 398591232 397949524 397478790 396653366 396342201 396308060 395639420 394933510 394382133 394073563 393586464
3365.7 393586464 393332329 393279266 392591209 392247314 392082558 391661491 391304321 390441704 389336815 388847733
3375.3 388847733 388664398 388653450 388644905 388260994 388140640 387985573 387379074 386664848 386322899 386106873
3384.9 386106873 385663681 385816727 385764465 385506973 385525169 385258713 385039330 384439926 384004860 384002571
3394.6 384002571 383825188 383881912 384227066 384423866 383828163 383247719 383133545 382866135 382709122 382538834
3404.2 382538834 382334862 381764755 381121368 381499977 381855621 381532173 381442604 381587791 381261253 380607224
3413.9 380607224 380832024 381287918 380886688 380760345 381073303 381060181 380542717 380039597 380537071 381429482
3423.5 381429482 381461678 381076927 381326599 381767273 381830139 381799507 381646347 381399460 381375008 381541367
3433.2 381541367 381975670 382875519 383487740 383229752 382926483 383350716 383762970 383902550 384092941 383928337
3442.8 383928337 384234352 384772377 385371017 385891685 385459900 385653229 386107216 386805344 387794380 388558998
3452.5 388558998 389042320 388826714 389527245 389903717 389922791 391030464 391633377 392174263 392877502 393570175
3462.1 393570175 394070435 394652557 395119934 395418701 396321526 396558914 397041588 397700691 398243179 398937225
3471.7 398937225 398904762 399626122 400791931 401583214 402092438 402561874 403216934 404115677 405083847 405250740
3481.4 405250740 405715866 406312904 407117004 407959518 408595810 410137520 410792656 410811501 411617355 412899132
3491 412899132 413978996 414390640 415038338 415778847 416459045 417437134 418411674 418936501 419980659 421066666
3500.7 421066666 421521416 422506943 422925377 423088264 423779602 424799156 426036530 427484016 428379097
3509.4 428379097 428064461 428968430 430184135 431388474 432436676 432950630 434125862 434944687 435896339
3518 435896339 436613617 437342873 438874512 440237656 441060066 441113968 442455101 443900604 444120331
3526.7 444120331 444157219 445093079 446659431 447731819 448910561 449907150 451074257 452102356 453380127
3535.4 453380127 454648590 454858437 455829926 456740685 457875710 459406967 460621109 461517525 463276329
3544.1 463276329 465227051 465110435 465864868 466062546 467223816 469149780 470277672 472198944 472577362
3552.7 472577362 474064598 475388412 476443901 478051453 478295784 480309601 481797943 482279205 483437958
3561.4 483437958 485711899 487346039 488102226 492145805 493719978 493277359 493357925 493481216 496310616
3570.1 496310616 497516060 499179802 500989876 502149162 502999992 504528160 507160912 508088074 509924011
3578.8 509924011 511085777 511577225 513452377 515746651 517512207 518261566 522085609 524278984 523055229
3587.5 523055229 524460030 524563637 526951523 529438896 531881676 532760429 533806419 536953430 535896950
3596.1 535896950 538084526 541356087 542120018 545059967 546285782 546679764 548456268 550542793 552734108
3604.8 552734108 555472069 558148842 558044395 560681114 560219421 560238228 566994820 568020210 566868706
3613.5 566868706 571455116 571660614 574662628 578205032 578630714 579856262 579049721 580772438 583981209
3622.2 583981209 586294861 588258743 590639381 592943649 595457802 601110954 601675720 594662933
3629.9 594662933 597595024 601260910 606270523 608222656 607121696 609701004 612940445 615165291
3637.6 615165291 616066170 617330360 619655113 622425690 623789597 624316483 626581802 630763588 637038574
3646.3 637038574 635952415 631904907 637088737 637620544 635584297 635803032 640724411 644725494 648600845
3655 648600845 654248276 647517929 647998734 653345413 654886551 656199112 657247696 659389648 660641022
3663.6 660641022 662143860 664222641 665434723 669321976 671412582 671117859 671194077 665363388 667457123
3672.3 667457123 674697113 683174591 682067413 664055710 668193054 676736755 681723328 679586945
3680 679586945 679366379 681547012 683720474 685534973 685298386 685880661 690517654 696752014 687596436
3688.7 687596436 683657684 691241150 686975403 687255783 691674118 692170486 693747635 694109192 693670044
3697.4 693670044 694623108 695089874 697586975 700995941 696426849 693835373 698160019 699374466 699127731
3706.1 699127731 699874725 702801666 706796265 700732117 703279953 706305466 694766235 698512268
3713.8 698512268 702296295 702655182 703343277 705288620 706582108 703839264 704804535 709859695 706177521
3722.5 706177521 702060471 707064743 707887955 707682953 705791016 705069427 708426361 709743729 715132446
3731.2 715132446 712602234 704075317 712692261 715242157 705754242 705240860 707274551 707609711 710570908
3739.8 710570908 714841232 710902710 712217102 722555008 709964142 696095276 707440720 713278427
3747.5 713278427 719041214 716016617 706415176 716525345 709160309 701815720 707835922 712697754
3755.3 712697754 716436234 711754837 714031830 720073547 712690735 709555283 713193207 714935303
3763 714935303 715080566 718813629 717437973 712363510 714987564 719450989 719335327 709887314 711245499
3771.7 711245499 715115967 716048584 717046661 716236725 716740646 717405930 719816208 720379181 713354721
3780.3 713354721 714890594 716626587 717344894 719651642 716884537 715329208 716658478 717707825
3788 717707825 717988281 717058792 717170334 717865219 718505402 717714157 718352127 721641617 718656998 715494919
3797.7 715494919 717749100 721595688 727535400 722037430 711935959 713966599 716052322 721141891
3805.4 721141891 726652908 716648102 711616974 716209259 718370361 718857651 719386444 719147034 720049973
3814.1 720049973 725051727 724826736 711541214 715327682 721661606 726535263 727601776 709161758
3821.8 709161758 710593262 716336517 718494720 721471252 722090683 718331070 717900620 719175949 722608490
3830.5 722608490 724035721 715375671 718212891 725422821 719853745 719076004 726018448 717882919
3838.2 717882919 714912720 722594833 716728592 715957642 722890320 720467453 716318741 718295212
3845.9 718295212 718965530 719291077 721121521 720053253 722522354 729901962 725150681 722375793 707631073
3854.6 707631073 710067139 720736237 720078201 717821732 719739304 721781998 724007645 719142532
3862.3 719142532 719073792 723987579 717330856 714028320 718334503 722534332 727969284 720562515 711682358
3871 711682358 715690231 721387634 724859238 715695190 715510330 719480972 720046158 721849136 724869690
3879.7 724869690 719973679 714033966 719662628 721355820 722118759 725414810 713643570 714865875
3887.4 714865875 718634796 720226593 725036774 723090057 714401398 715917664 719662933 718752365
3895.1 718752365 718956451 719709702 722281265 724366226 715501938 719707947 721707153 716748734 720830307
3903.8 720830307 717360229 715681534 716456146 717066803 718792953 718370132 718631973 718406525 718318710
3912.5 718318710 719272614 719508820 720418472 722424850 719289169 715599365 719599228 720046692 716461029
3921.1 716461029 718372879 720394592 720735626 718152313 715565491 716985474 719002991 720115585
3928.8 720115585 718395767 717288589 719037552 717375488 715908966 717299118 717687302 718054123 718324127
3937.5 718324127 717859116 717738647 717641144 719097595 720383224 716923065 716064072 717119293 717751007
3946.2 717751007 719258423 717333298 717481689 718415909 716398544 717562943 717680969 716833649 716836090
3954.9 716836090 717049408 717492981 716644363 716804352 716606064 716894531 717397003 716005020 716206284
3963.6 716206284 716968384 716848450 716223068 715912476 716507187 716821976 716674957 717099991 717276230 716681824
3973.2 716681824 716935883 717026825 716778488 717022781 717276306 716966095 716940384 717525101 716851578 716567307
3982.8 716567307 716882019 717145996 717297287 716773148 716497040 715655975 715529861 715634689 715237427 715528412
3992.5 715528412 716277542 717380676 716776810 715769730 715525818 715637436 716114578 716262741
4000.2 716262741
##END=$$ End of the data block
