##TITLE=$$ Begin of the data block
##JCAMP-DX=5.00 $$ ACD/SpecManager v 10.08
##SPECTROMETER/DATA SYSTEM=Varian
##DATE=15 Jan 2013 15:07:08
##DATA TYPE=INFRARED SPECTRUM
##DATA CLASS=XYDATA
##ORIGIN=
##OWNER=
##NPOINTS=3735
##FIRSTX=399.26403809
##LASTX=4000.35498047
##MAXX=4000.35498047
##MINX=399.26403809
##MAXY=76.95812988
##MINY=38.35203934
##XFACTOR=1.0000000000
##YFACTOR=0.000000100000000
##FIRSTY=58.14489746
##DELTAX=0.96440572
##XUNITS=1/CM
##YUNITS=TRANSMITTANCE
##XYDATA=(X++(Y..Y))
399.3E81448975j0133324j2961464M911194K681274O863861l465347o610832o55785
$$ 581448975 571315651 558354187 563265381 565946655 572810516 569345169 562734337 562078552
407E62078552J93215O351471K178230m61578k473450p34406J061631j900254l849907
$$ 562078552 562271767 568623238 570801468 570339890 567866440 567132034 568193665 566293411 562443504
415.7E62443504n88417k968788k3406105R385948J7866135K711830l212547p522583
$$ 562443504 561855087 558886299 535480194 544866142 562732277 565444107 562231560 554708977
423.4E54708977J028328J285858O241569R36165j292724N071334n43708O47888K041740
$$ 554708977 555737305 557023163 563264732 564200897 562908173 567979507 567435799 568083687 570125427
432.1E70125427n014229o004524m28924M318504K33803m632454n42832K097512K500267
$$ 570125427 565111198 559106674 558677750 562996254 563230057 558597603 558054771 560152283 562652550
440.7E62652550M229889k698365m925460j882630J181603L874092l248482n281486
$$ 562652550 566882439 564184074 559258614 557375984 558557587 562431679 559183197 553901711
448.4E53901711q05817L995514O437874M239158K289467k128715o814270o407090j694564
$$ 553901711 553095894 557091408 563529282 567768440 570057907 567929192 561114922 554707832 553013268
457.1E53013268M925231K223969m52766L462753O32477n403252k756233m16870o02532
$$ 553013268 557938499 560162468 559709702 563172455 563804932 558401680 555645447 555228577 554626045
465.8E54626045r4757M097557j517792p419853Q70133M726181K392158l065681o79207
$$ 554626045 554531288 558628845 557111053 549691200 550561333 555287514 557679672 554613991 553934784
474.5E53934784J203766k181511r24339J369934j751976n054245j337128J275635K398796
$$ 553934784 555138550 552957039 552032700 553402634 551650658 546596413 545259285 546534920 548933716
483.2E48933716K868500J26495L17001j573600j181298j90506J53618K144699O55899
$$ 548933716 551802216 551928711 552245712 550672112 549490814 549300308 549453926 551598625 552254524
491.8E52254524o93855j661720k493630Q99620K612610k154236l738556m66842J602554
$$ 552254524 551560669 549898949 547405319 548304939 550917549 548763313 545024757 544557915 546160469
500.5E46160469K2049k213631K774430L467445J219101n11551o30951j306724m013253
$$ 546160469 546182518 543968887 546743317 550210762 551429863 550918312 550287361 548980637 544967384
509.2E44967384n6991K010765l81890j278610p42302R32007J030502O42357l632774
$$ 544967384 544910393 546921158 546539268 545260658 544518356 545450363 546480865 547123222 543490448
517.9E43490448m99496J537132k451821q07838j220932J646194M093972K0981k223053
$$ 543490448 542990952 544528084 542076263 541268425 540047493 541693687 545787659 545808640 543585587
526.6E43585587k170639j255456K116700J726150l680877l019371P83500J723023P48634
$$ 543585587 541414948 540159492 542276192 544002342 540321465 537302094 538085594 539808617 540557251
535.2E40557251m16183J039161P23267l26157l36761o65627o85615j119042j380577
$$ 540557251 540141068 541180229 541903496 541577339 541240578 540574951 539889336 538770294 537389717
543.9E37389717p77779P78466M79469r4261R62067J381568o23130j583825k72026r62524
$$ 537389717 536611938 537390404 537869873 537775612 538737679 540119247 539496117 537912292 537640266 536677742
553.6E36677742k035370r55009J930122J293984p65114O561N93071O89239j632041
$$ 536677742 534642372 533687363 535617485 536911469 536146355 536152916 536745987 537435226 535803185
562.3E35803185j281090R57565R20067K69775j405334k87476J19820p2518M50173K39754
$$ 535803185 534522095 535479660 536399727 536669502 535264168 534976692 535096512 535023994 535474167 535713921
571.9E35713921J04217j283073p62215J60027M46052n1384r54628o60286K29225M07219
$$ 535713921 535818138 534535065 533772850 533932877 534378929 534327545 533372917 532712631 532941856 533349075
581.5E33349075p18918O69404J236305Q583r26705r91783R52721R27963J89133J87225
$$ 533349075 532630157 533299561 534535866 534544449 533617744 532625961 533578682 534506645 534695778 534883003
591.2E34883003J239052J373863J91918N21812O55251k40670l21083M95682j209602
$$ 534883003 536122055 537495918 537687836 538209648 538864899 538624229 538303146 538798828 537589226
599.9E37589226m85649K051696Q39005l7499m56619l69758j580544j409454J28250
$$ 537589226 537103577 539155273 539994278 539956779 539500160 539130402 537549858 536140404 536268654
608.5E36268654p41615M96215J076508M31061o69022j120567K60277P47184K84958
$$ 536268654 535527039 536023254 537099762 537530823 536861801 535741234 536001511 536748695 537033653
617.2E37033653j112747m77867Q01735P84187j089134q51784J844864R89990J268158
$$ 537033653 535920906 535443039 536244774 537028961 535939827 535088043 536932907 537922897 539191055
625.9E39191055J207009K36091Q17871N19257O57196Q81577J402587J004029J113853
$$ 539191055 540398064 540634155 541452026 541971283 542628479 543510056 544912643 545916672 547030525
634.6E47030525J807862J270027J337928R04618N59196n57022o02951J043320J900978
$$ 547030525 548838387 550108414 551446342 552350960 552910156 552353134 551750183 552793503 554694481
643.3E54694481J670799o05621L69224K454911R31816N7487J044884K41775j613464
$$ 554694481 556365280 555759659 556128883 558583794 559515610 559573097 560617981 560859756 559246292
651.9E59246292P37953J843262N73120O79970K44102J289902L89290j292191j66931
$$ 559246292 559984245 561827507 562400627 563080597 563324699 564614601 565003891 563711700 563544769
660.6E63544769k96249n33409k93541L35960J805458J900368J016006l028335m00620
$$ 563544769 563248520 562715111 562421570 562757530 564562988 566463356 567479362 564451027 564050407
669.3E64050407J441575P50999R0141j30729M21753L55911n6381J770401K251815R24492
$$ 564050407 565491982 566242981 566333122 566202393 566624146 566980057 566923676 568694077 570945892 571870384
678.9E71870384K87514M38690L23181r23691M17748J466141N15556O29006Q11805J082611
$$ 571870384 572157898 572596588 572919769 571996078 572413826 573879967 574395523 575024529 575836334 576918945
688.6E76918945J528397J910324Q49686L02658n85213j362572M49829O6758J073379
$$ 576918945 578447342 580357666 581207352 581510010 580924797 579562225 580012054 580078812 581152191
697.3E81152191J292305p82699K12974J081963J661796L51754L13072J133499r22928
$$ 581152191 582444496 581661797 581874771 582956734 584618530 584970284 585283356 586416855 585493927
705.9E85493927m19312K62566P96433J615676J230965J482010R11903k975J47514O87
$$ 585493927 585074615 585337181 586133614 587749290 588980255 590462265 591374168 591371193 591518707 591519394
715.6E91519394j134262m09126J028900Q32214L03345P73697J489067J043052J178933
$$ 591519394 590385132 589976006 591004906 591837120 592140465 592914162 594403229 595446281 596625214
724.3E96625214R46998O60515n61905j606483J003112J193200M88853J500282J360512
$$ 596625214 597572212 598232727 597670822 596064339 597067451 598260651 598749504 600249786 601610298
733F01610298J85394J44043J950570M84619j311417j236954k89573Q85353k81296L54309
$$ 601610298 601795692 601939735 603890305 604374924 603063507 601826553 601536980 602422333 602141037 602495346
742.6F02495346J193848Q28552J415176P92694j40762L5439O10618j32026p81632J38435
$$ 602495346 603689194 604517746 605932922 606725616 606584854 606620293 607230911 607098885 606317253 606455688
752.2F06455688M08783N60875J831055J590653M28886L34167K64092P76482O97708
$$ 606455688 606864471 607425346 609256401 610847054 611275940 611610107 611874199 612650681 613348389
760.9F13348389N66101O63910k25716O56052J228981J06010L55339M72450r3040P08237
$$ 613348389 613914490 614578400 614352684 615008736 616237717 616343727 616699066 617171516 617078476 617786713
770.6F17786713L62816q23632m18434k23083N6610L90320L19786j01052R6398Q58345
$$ 617786713 618149529 617325897 616907463 616684380 616740990 617131310 617451096 617350044 617446442 618304787
780.2F18304787O73904J98021o11076m58336k90833L09944J103363N9624M25072J341057
$$ 618304787 618978691 619176712 618565636 618107300 617816467 618126411 619229774 619289398 619714470 621055527
789.9F21055527J542511L39355q64410n81093j086807l60222L6812q36106r02328k98386
$$ 621055527 622598038 622937393 622072983 621491890 620405083 620044861 620081673 619245567 618343239 618044853
799.5F18044853k26059o98166p91549j177559j289826j002807p24869j942940k057495
$$ 618044853 617818794 617120628 616329079 615151520 613861694 612858887 612134018 610191078 608133583
808.2F08133583l33137o65131j198196m74167m13514j737861q08144q0337j954460
$$ 608133583 607800446 607135315 605937119 605462952 605049438 603311577 602503433 602423096 600468636
816.9F00468636j892586q08983n6801L37448J345864R75723J20354J165847j39351
$$ 600468636 598576050 597767067 597710266 598047714 599393578 600369301 600489655 601655502 601516151
825.5F01516151p6370K137032J997757J596565J923180J784935J640472K162590J932144
$$ 601516151 601439781 603576813 605574570 607171135 609094315 610879250 612519722 614682312 616614456
834.2F16614456J966629K140923J968422J380577R00001J949616J145401J023941J869316
$$ 616614456 618581085 620722008 622690430 624071007 624971008 626920624 628066025 629089966 630959282
842.9F30959282J187477P68623J427460K148705M96139L89443M95605j93748P43103
$$ 630959282 632146759 632915382 634342842 636491547 636987686 637377129 637872734 637678986 638422089
851.6F38422089J253585J254731R11712J347580J722489K484436J320495k53906K51999
$$ 638422089 639675674 640930405 641842117 643189697 644912186 647396622 648717117 648463211 648715210
860.3F48715210q9874R41238Q82874J192627J069488l2349J37024k87170N53207j542282
$$ 648715210 648625336 649566574 650449448 651642075 652711563 652679214 652816238 652529068 653082275 651539993
869.9F51539993k756500j302414j070480o77185J3427J26038p44476P04193r92l34625
$$ 651539993 648783493 647481079 646410599 645733414 645746841 645872879 645128403 645832596 645831604 645496979
879.5F45496979P50122r06754j029281j505661j238861j177140K15836J768570K83432
$$ 645496979 646247101 645340347 644311066 642805405 641566544 640389404 640605240 642373810 642657242
888.2F42657242K46124k12860J52283l80173j765213j023788K02865P20291L04642
$$ 642657242 642903366 642690506 642842789 642462616 640697403 639673615 639876480 640596771 640901413
896.9F40901413J004181Q13904O44302K07596k15988M89883L22724j70517r35898M82101
$$ 640901413 641905594 642719498 643363800 643571396 643355408 643845291 644168015 643997498 643061600 643543701
906.5F43543701J180115J216583J449509R34295J240387K38266j84326j452102k013245
$$ 643543701 644723816 645940399 647389908 648324203 649564590 649802856 649618530 648166428 646153183
915.2F46153183j859512k256623j411361j248131p92580q89053m57573j688233k100296
$$ 646153183 644293671 642037048 640625687 639377556 638584976 637695923 637238350 635550117 633449821
923.9F33449821j465110l838883l591041l320465k536240j869240j944809m72603k33116
$$ 633449821 631984711 628145828 624554787 621234322 618698082 616828842 614884033 614411430 614178314
932.6F14178314O34728j39580o41251k83851j286049j096611j393051j286660p37991
$$ 614178314 614813042 614673462 614032211 613748360 612462311 611365700 609972649 608685989 607947998
941.3F07947998L4637N76897M60968M14887Q6212L6812o78063j148758j806946j807708
$$ 607947998 607982635 608559532 609020500 609435387 609521599 609558411 608880348 607731590 605924644 604116936
950.9F04116936m26750J22222j63002o02645m36020o79436j008797j304550k263374
$$ 604116936 603690186 603812408 603649406 603046761 602610741 601931305 600922508 599617958 597354584
959.6E97354584l183632k821007j388702j215401j617394j392517k83165R4796r31130
$$ 597354584 594170952 591349945 589961243 588745842 587128448 585735931 585452766 585547562 584616432
968.3E84616432j815643k073670j559715k452354k989922j856346j399422j567077
$$ 584616432 582800789 580727119 579167404 576715050 573725128 571868782 570469360 568902283
976E68902283k103463j477470j324921k433586k433662l604546m376754l478013l299598
$$ 568902283 566798820 565321350 563996429 561562843 559129181 555524635 551147881 547669868 544370270
984.7E44370270k713394l124581l334770k927628l031425k351189k876548l064843
$$ 544370270 541656876 538532295 535197525 532269897 529238472 526887283 524010735 520945892
992.4E20945892l567619l905640l242340l639335l028794k385025k022171k030945
$$ 520945892 517378273 513472633 510230293 506590958 503562164 501177139 499154968 497124023
1000.1D97124023j566848j205139j708489k184677k663918j312980q43277p77779m64783
$$ 497124023 495557175 494352036 492643547 490458870 487794952 486481972 485638695 484860916 484396133
1008.8D84396133r53331j166076o39572m2496j366921j675453k307205k804489j688423
$$ 484396133 483442802 482276726 481637154 481594658 480227737 478552284 476245079 473440590 471752167
1017.5D71752167j593895j752510k373772j616783j764450k421646j665421j320877
$$ 471752167 470158272 468405762 466031990 464415207 462650757 460229111 458563690 457242813
1025.2D57242813j303368j910133j785774j474838j58234Q5220n44281m39758m95415
$$ 457242813 455939445 454029312 452243538 450768700 450610466 450695686 450151405 449711647 449216232
1033.8D49216232J85051J76964l21312j250648M85801J292267N56374J069946J70174
$$ 449216232 449401283 449578247 449256935 448006287 448492088 449784355 450340729 451410675 451580849
1042.5D51580849J241951O00166j41792N25398l5782n49431j497993q95462j167488
$$ 451580849 452822800 453422966 453281174 453806572 453770790 453221359 451723366 450827904 449660416
1051.2D49660416m72947K09427j50222Q3313K76146P01675l17726J100387O38924j75133
$$ 449660416 449187469 449396896 449246674 449329987 449606133 450307808 449990082 451090469 451729393 451554260
1060.9D51554260R29528M89273J653328K034568K918091K965164J891060Q29468M69170
$$ 451554260 452483788 452973061 454626389 456660957 459579048 462544212 464435272 465264740 465733910
1069.5D65733910J307144R66568J038208L98063J035347J036606N24178Q89282J02921
$$ 465733910 467041054 468007622 469045830 469443893 470479240 471515846 472040024 472929306 473032227
1078.2D73032227P63168J017380J455269J64794l11775M98543k6131J976853J836776
$$ 473032227 473795395 474812775 476268044 476432838 476121063 476619606 476593475 478570328 480407104
1086.9D80407104O49491N70335J474114K310486J730346J189728O2447R57832J020851
$$ 480407104 481056595 481626930 483101044 485411530 487141876 488331604 488394051 489351883 490372734
1095.6D90372734Q98705J695556J289292J501960J377488K082824K229424J137695
$$ 490372734 491271439 492966995 494256287 495758247 497135735 499218559 501447983 502585678
1103.3E02585678O16036Q25309M80919k61383Q02384J017417Q91304R18847N3939L66555
$$ 502585678 503201714 504027023 504507942 504246559 505048943 506066360 506957664 507876511 507930450 508297005
1112.9E08297005R00879R6016n76325l27606k41470K03743J04599P23037J190148m44107
$$ 508297005 509197884 509293900 508717575 508389969 508148499 508352242 508456841 509179878 510370026 509925919
1122.6E09925919l52135J77841K44713o5193L58238J554413Q87642J117782J558419
$$ 509925919 509573784 509751625 509996338 509931145 510289383 511843796 512731438 513849220 515407639
1131.2E15407639J488075J597748J383819J296654Q44994L76663P41157J614189J251030
$$ 515407639 516895714 518493462 519877281 521173935 522018929 522395592 523136749 524750938 526001968
1139.9E26001968N07927R59893J766243J217842K98233Q26912Q75816L77235J77269
$$ 526001968 526509895 527469788 529236031 530453873 530752106 531579018 532454834 532832069 533009338
1148.6E33009338J16921k38342k69433K97547k19116K92816Q19588M52346K57721j126938
$$ 533009338 533126259 532887917 532618484 532916031 532696915 532989731 533809319 534261665 534519386 533392448
1158.3E33392448j355743r95941q50487l32374m85230k55318O74477J477852J524849
$$ 533392448 532036705 531040764 530190277 529857903 529372673 529117355 529791832 531269684 532794533
1166.9E32794533J509552R93576O88972R00574R77898J532211J822510J909866J755066
$$ 532794533 534304085 535297661 535986633 536887207 537865105 539397316 541219826 543129692 544884758
1175.6E44884758J861687J838951J363182J483650R50508J047058J506195P01332R32694
$$ 544884758 546746445 548585396 549948578 551432228 552382736 553429794 554935989 555637321 556570015
1184.3E56570015J191597O60629K01302M30488O62804N5580K21291j65406p97271m55475
$$ 556570015 557761612 558422241 558623543 559054031 559716835 559772415 559993706 559828300 559031029 558575554
1193.9E58575554j88713n38216n89943j18255o94504j015167r04313j021728j203461
$$ 558575554 558386841 557848625 557258682 557140427 556445923 555430756 554526443 553504715 552301254
1202.6E52301254r93156o50063p33604n20935r17931n56793K59476P2441k05498m50172
$$ 552301254 551308098 550658035 549924431 549403496 548485565 547928772 548188248 548260689 548055191 547605019
1212.3E47605019l02048l75786l14751k77977K51961Q86116m8179j32332P1144o2027
$$ 547605019 547302971 546927185 546612434 546334457 546586418 547472534 547424355 547292023 547363167 547301140
1221.9E47301140o2065m69933k18277k50664m3869j18446j008568o88629j16463p5225
$$ 547301140 547239075 546769142 546550865 546300201 546256332 546137886 545129318 544440689 544324226 544249001
1231.5E44249001m57192r51614r17321l94630Q2550n19981p83921k47993m6692N5695
$$ 544249001 543791809 542840195 541922874 541528244 541610794 541090813 540306892 540058899 540012207 540067902
1241.2E40067902l11356m43649o13022o65703m1275k50092n62133l87802j31302l4371
$$ 540067902 539756546 539312897 538699875 538034172 537992897 537742805 537180672 536792870 536661568 536627197
1250.8E36627197j35727m04739m13818o4850j53046L0823k37160k19192k0867n23910
$$ 536627197 536491470 536086731 535672913 535608063 535455017 535485840 535248680 535029488 535008621 534484711
1260.5E34484711J02501L49235L93181M56123J73188L17840P06558P98264J54686N24788
$$ 534484711 534587212 534936447 535329628 535785751 535958939 536276779 536983337 537781601 537936287 538461075
1270.1E38461075O29310L28980Q49152P99865Q77686R48562Q27828P12356R55163J235160
$$ 538461075 539090385 539419365 540268517 541068382 541946068 542894630 543722458 544434814 545389977 546625137
1279.8E46625137O31562N13420R75342J337356J341095J065636J388321J296425Q58879
$$ 546625137 547256699 547770119 548745461 550082817 551423912 552489548 553877869 555174294 556033173
1288.4E56033173J165351J013070N95245O95915R08852O17218M92554P40547O33583
$$ 556033173 557198524 558211594 558806839 559502754 560411606 561028824 561521378 562261925 562895508
1297.1E62895508N92346P11441P60994L65791K72751j5487n18609M7684N34248M63067
$$ 562895508 563487854 564199295 564960289 565326080 565598831 565583344 565064735 565112419 565646667 566109734
1306.8E66109734j5870Q2779R1248j41182K1896k46391M03557L32718o22521m76112
$$ 566109734 566093864 566176643 566267891 566126709 566148605 565902214 566305771 566638489 566015968 565539856
1316.4E65539856k9411O9656O4468O91262J067848J056023O47544R0371J3809K37655
$$ 565539856 565510445 565580101 565644569 566335831 567403679 568459702 569107246 569197617 569211426 569449081
1326E69449081N26276L29819k1019m50402j20697J67466J35193K49290l66249m28314
$$ 569449081 569975357 570305176 570284157 569833755 569713058 569880524 570015717 570265007 569898758 569470444
1335.7E69470444j70708j29051l24631j91040j81580P1869Q68340N44777N63621M17900
$$ 569470444 569299736 569170685 568846054 568655014 568473434 568545303 569413643 569958420 570522041 570939941
1345.3E70939941L44658M83780k50587j85318m40254j32905R7542K632J54419k9678
$$ 570939941 571284599 571768379 571517792 571332474 570892220 570759315 570856857 570859489 571013908 570984230
1355E70984230L55263n6572l41759n84106k29645j9150n89943p15637j525192L62205
$$ 570984230 571339493 571282921 570941162 570357056 570127411 570108261 569518318 568802681 567277489 567639694
1364.6E67639694N20287k95906J5945m43344n94521l85398k53830l66097o72340j254006
$$ 567639694 568159981 567864075 567880020 567436676 566842155 566456757 566202927 565836830 565164490 563910484
1374.3E63910484o96830N92269P11098K23084l23525J75019m67301j084366j258507
$$ 563910484 563213654 563805923 564517021 564740105 564416580 564591599 564124298 563039932 561781425
1382.9E61781425j737556j091537j92337J13182k046929j151542N6114o11725p92122
$$ 561781425 560043869 558952332 558759995 558873177 556826248 555674706 555730820 555119095 554326973
1391.6E54326973r72405o06765j789322k027245r38911j070099r10149k908783j353416
$$ 554326973 553354568 552747803 550958481 548931236 547992325 546922226 546012077 543103294 541749878
1400.3E41749878J3809p56073o29043n49775j827011j893463j094665j300431j013183
$$ 541749878 541763687 541007614 540378571 539828796 538001785 536108322 535013657 533713226 532700043
1409E32700043j042786o99768j98441l56407l06358l04184J0262l62130o33354n99174
$$ 532700043 531657257 530957489 530759048 530402641 530096283 529792099 529802361 529440231 528806877 528207703
1418.6E28207703l382950M62684J469689O77299O43845j6060Q85658J001282J02921
$$ 528207703 524824753 525287437 526757126 527434425 528078270 528062210 528947868 529949150 530052071
1427.3E30052071M93126L70178o79817K56309J504936O12831M49601J674766J172867
$$ 530052071 530545197 530915375 530235558 530491867 531996803 532609634 533059235 534734001 535906868
1436E35906868r05800Q38432J810227N32379J23100M40140L35198P97042O14930J059074
$$ 535906868 535001068 535839500 537649727 538182106 538305206 538745346 539080544 539877586 540492516 541551590
1445.6E41551590J099205N04837k16064R27658J185951l74413m9705O49261J187020
$$ 541551590 542650795 543155632 542939568 543867226 545053177 544678764 544629059 545278320 546465340
1454.3E46465340J109886M52308o89315j060791K765464J344491J329002J069565Q46557
$$ 546465340 547575226 548027534 547338219 546277428 549042892 550387383 551716385 552785950 553632507
1463E53632507J330109p53784O73523K013130K533150K035102J896248K583275J443787
$$ 553632507 554962616 554208832 554882355 556895485 559428635 561463737 563359985 565943260 567387047
1471.7E67387047K23541J024170L452530K788772M07143J447640K257652J984024J708107
$$ 567387047 567610588 568634758 572087288 574876060 575283203 576730843 578988495 580972519 582680626
1480.3E82680626J076126J263313J596375J111831O12145P47032K53601p705J536216
$$ 582680626 583756752 585020065 586616440 587728271 588340416 589087448 589341049 589333344 590869560
1489E90869560p4577q73909Q35075M80881m37698o52542q04520n268211M73403q97102
$$ 590869560 590794983 589921074 590756149 591237030 590799332 590146790 589342270 584074059 584547462 583650360
1498.7E83650360l579903O46706k33612j090469p81250P94410j40419p735519j884232
$$ 583650360 580070457 580717163 580483551 579393082 578611832 579406242 579265823 571530304 569646072
1507.3E69646072J424714J410369j57623J264229l35655j459084Q27065k10457l54729
$$ 569646072 571070786 572481155 572323532 573587761 573252106 571793022 572620087 572409630 572054901
1516E72054901k482071k771568K329521K119942j934548l013115K261544K000961K213669
$$ 572054901 569572830 566801262 569130783 571250725 569316177 566303062 568564606 570565567 572779236
1524.7E72779236k17362j59835R07402N4092N74455O74973J138077J513023n39436
$$ 572779236 572561874 572402039 573309441 573363533 573937988 574612961 575751038 577264061 576724625
1533.4E76724625j749421K526818J679916J136055J983872l746796m154778L865929
$$ 576724625 574975204 577502022 579181938 580317993 582301865 578555069 574400291 578266220
1541.1E78266220J205711L30658K330056J042328j447564J660843J144829J291542
$$ 578266220 579471931 579802589 582132645 583174973 581727409 583388252 584533081 585824623
1548.8E85824623O2485j002999J199494M83246J093673k601699l43438K941285L404464
$$ 585824623 585887108 584884109 586083603 586566849 587660522 585058823 584715385 587656670 591061134
1557.5E91061134l95851j3793945K911491K398415J577949m10499r46770j907120j737365
$$ 591061134 590665283 576871338 579782829 582181244 583759193 583348694 582401924 580494804 578757439
1566.2E78757439j91689q99811k98614o244087j038742o40793k699585j725807j430321
$$ 578757439 578565750 577665939 577367325 571123238 570084496 569443703 566744118 565018311 563587990
1574.9E63587990p25022r956131r89265j095505k194175k245331l700409k552834m144745
$$ 563587990 562862968 552906837 551917572 550822067 548627892 546382561 542682152 540129318 535984573
1583.5E35984573k923126m093094l421592l084870l786545k040596l763466k370529
$$ 535984573 533061447 528968353 525546761 522461891 518675346 516634750 512871284 510500755
1591.2E10500755m168167k565040k862893m011879k701377m444275j978455l596001
$$ 510500755 506332588 503767548 500904655 496892776 494191399 489747124 487768669 484172668
1599D84172668j966857k857590k796211j520462l222352j189346l385467j710663k958718
$$ 484172668 482205811 479348221 476552010 475031548 471809196 470619850 467234383 465523720 462565002
1607.6D62565002j386146j425629l105583J79100k108116l86772j754112L55949m98657
$$ 462565002 461178856 459753227 456647644 456826744 454718628 454331856 452577744 452933693 452435036
1616.3D52435036o972199K398339n25856M47578j722870J067085M56162k687340J692238
$$ 452435036 445462837 447861176 447335320 447782898 446060028 447127113 447583275 444895935 446588173
1625D46588173R0752K147369m75349N71365K10037M57955J331520P286K065582O47011
$$ 446588173 446678925 448826294 448350945 448922310 449132347 449590302 450921822 450929108 452994690 453641701
1634.6D53641701O90803n11551K574768J556054J008606J903648L36647K060242L87993
$$ 453641701 454332504 453820953 456395721 457951775 458960381 460864029 461200676 463260918 463648911
1643.3D63648911K152977K263298n41535R41086j537170K495040J339074K987365K195969
$$ 463648911 465801888 468065186 467523651 468464737 466927567 469422607 470761681 473749046 475945015
1652D75945015m271278k103386J526527L622322J042900J717644R25484J310348J605873
$$ 475945015 471673737 469570351 471096878 474719200 475762100 477479744 478405228 479715576 481321449
1660.7D81321449J190911J251182m48952L288079K070694J831627J708030K152825
$$ 481321449 482512360 483763542 483314590 486602669 488673363 490504990 492213020 494365845
1668.4D94365845K288551M47655L919067J691246L335724L216477J805267J694145
$$ 494365845 496654396 497102051 501021118 502712364 506048088 509264565 511069832 512763977
1676.1E12763977K654991L693390K296600L214150J966057M027710N246467J028099
$$ 512763977 515418968 519112358 521408958 524623108 526589165 530616875 535863342 536891441
1683.8E36891441R41201K709045N529633L904342K936859L300553K908630L773079
$$ 536891441 537832642 540541687 546071320 549975662 552912521 556213074 559121704 562894783
1691.5E62894783L458977L685760L904801M175872p4386M574394N860977N196343J040535
$$ 562894783 566353760 570039520 573944321 578120193 578045807 582620201 588481178 593677521 594718056
1700.2E94718056k545243P757149M930267L036652K242394K680435K090912K552185
$$ 594718056 592172813 599929962 604860229 607896881 610139275 612819710 614910622 617462807
1707.9F17462807M008827K700119J493378J631546K138824K999535J192054K18773
$$ 617462807 621471634 624171753 625665131 627296677 629435501 632435036 633627090 633845863
1715.6F33845863K881279J743889l158912L525085L270416J860047J583786P36618
$$ 633845863 636727142 638471031 635312119 638837204 642107620 643967667 645551453 646288071
1723.4F46288071M96139J409760J360550J018142J425248J781692j00479L47061L640137
$$ 646288071 646784210 648193970 649554520 650572662 651997910 653779602 653679123 654026184 657666321
1732F57666321L948974j375351n183029L709870L585281J362152K141800J008911q39462
$$ 657666321 661615295 660239944 655056915 658766785 662352066 663714218 665856018 666864929 666025467
1740.7F66025467L118896K461930P13882J059494K657318K531586J526108J244354
$$ 666025467 669144363 671606293 672320175 673379669 676036987 678568573 680094681 681339035
1748.4F81339035J186981M095383J058273J31760M063415K820893K705993K537613
$$ 681339035 682526016 686621399 687679672 687811432 691874847 694695740 697401733 699939346
1756.2F99939346m2343J142578K476578K137070K217331m85993N46799L173447J707000
$$ 699939346 699897003 701039581 703516159 705653229 707870560 707384567 707931366 711104813 712811813
1764.8G12811813R21173J554718J619797j615829J531219L680496O87638j707611q55484
$$ 712811813 713732986 715287704 716907501 715291672 716822891 720503387 721191025 719483414 718627930
1773.5G18627930L730468J782685r83505J537246R40552J632233N10864r49707J032486
$$ 718627930 722358398 724141083 723157578 724694824 725635376 727267609 727778473 726828766 727861252
1782.2G27861252J681518J541062m04511k70920J129075J034317P79724J748810J119918
$$ 727861252 729542770 731083832 730679321 730408401 731537476 732571793 733351517 735100327 736220245
1790.9G36220245M93622j567535r41239L013688P62786o06155R16290J574707M84772
$$ 736220245 736713867 735146332 734205093 737218781 737981567 737375412 738291702 739866409 740351181
1799.5G40351181j128998J777268o5155K27890J492767L95432J050949N46798j62582
$$ 740351181 739222183 740999451 740934296 741162186 742654953 743050385 744101334 744648132 744485550
1808.2G44485550M36706P30439q77457R01718J424256L91464R30557J61209P96585
$$ 744485550 744922256 745652695 744775238 745676956 747101212 747492676 748423233 748584442 749381027
1816.9G49381027k48718M7150P39975r1095Q63266n5619J122284J087876k316132J66550
$$ 749381027 749132309 749179459 749919434 749828339 750691605 750635986 751758270 752846146 750530014 750696564
1826.5G50696564K308883K287217k27509m048004M10004K382507M01764O8741O36825
$$ 750696564 753005447 755292664 755065155 751017151 751427155 753809662 754211426 754280167 754916992
1835.2G54916992J019058K75498p12357J330872L43780k4871J66702J209793P94830
$$ 754916992 755936050 756211548 755499191 756830063 757173843 757148972 757315674 758525467 759320297
1843.9G59320297m962997J776352K317428O09207O5461K74810Q56324k38343L59497
$$ 759320297 754357300 756133652 758451080 759060287 759125748 759400558 760256882 760018539 760378036
1852.6G60378036m6081r7504k34832O6680Q62961Q6594N08194J65558N63888n1040
$$ 760378036 760331955 760234451 759999619 760066299 760929260 761015854 761524048 761689606 762253494 762202454
1862.2G62202454k57111Q1787j86310O60477k43073M14811n59388n66558J167678N48478
$$ 762202454 761945343 762027130 761840820 762501297 762258224 762673035 762113647 761547089 762714767 763263245
1871.9G63263245O52008J53808K03171m66995k92511J221L4790N37338J30462P46766
$$ 763263245 763915253 764069061 764272232 763805237 763512726 763513947 763548737 764086075 764216537 764963303
1881.5G64963303K20031K65122Q8959J33438J53503q77228Q33664P6676j501694M77066
$$ 764963303 765183334 765448456 765537415 765670853 765824356 764947128 765780792 765857468 764355774 764832840
1891.2G64832840O48727K23694P18460J8082j153793M66232K90375j4496j22223m08020
$$ 764832840 765481567 765705261 766423721 766441803 765288010 765754242 766044617 766030121 765907898 765499878
1900.8G65499878K11487L20129O11725k6855L50265M24652p8583k17971l69416k26059
$$ 765499878 765711365 766031494 766643219 766616364 766966629 767391281 767312698 767094727 766725311 766499252
1910.4G66499252k62298P04345r9029L07846N73349L71246J486588k038956j549835
$$ 766499252 766236954 766941299 766842270 767150116 767723465 768094711 769581299 767542343 765992508
1919.1G65992508O97632M18014O00739q88062n67169Q02689J068268J65634k61994
$$ 765992508 766690140 767108154 767708893 766820831 766253662 767056351 768124619 768290253 768028259
1927.8G68028259m15344l03574K03324N6991k65274n61065O04171L06549J77231K88544
$$ 768028259 767612915 767309341 767512665 767569656 767304382 766743317 767347488 767654037 767831268 768119812
1937.5G68119812l58505L11050l9520P30514l66745k127304M01078O30951O2179l05633
$$ 768119812 767761307 768072357 768032837 768763351 768396606 766269302 766670380 767301331 767363510 767057877
1947.1G67057877j1826K15759K8992j42136j9302k51541m96826M4403k33460K29035
$$ 767057877 767046051 767261810 767290802 767148666 767129364 766877823 766380997 766425400 766191940 766420975
1956.7G66420975J71661R2316L26919j14517K8458l71933j97983m14658r9487M38614
$$ 766420975 766592636 766684952 767011871 766897354 766925812 766553879 766355896 765941238 765841751 766280365
1966.4G66280365m44717m70124J98517N65338q8272L97263J04599p03812j37634l13950
$$ 766280365 765835648 765365524 765564041 766129379 766041107 766438370 766542969 765839157 765701523 765387573
1976G65387573j31302m8446M07943J89896K24457N37643o6299R3536q29544p01294
$$ 765387573 765256271 765207825 765615768 765805664 766030121 766567764 766501465 766595001 765765457 765064163
1985.7G65064163M4327M5090l61252m56314R74426K79465j050415l3417P99332J76544
$$ 765064163 765108490 765153580 764792328 764336014 765310440 765589905 764539490 764506073 765305405 765481949
1995.3G65481949l72772n06745o57654m8904q8043K37732p8736l7918P85065Q2779
$$ 765481949 765109177 764602432 763944778 763895874 763807831 764045563 763966827 763928909 764713974 764796753
2005G64796753k34451l24936l54233o72455m16031j50375k99378L32795M04281L15399
$$ 764796753 764562302 764237366 763883133 763210678 762794647 762644272 762344894 762677689 763081970 763397369
2014.6G63397369K6017J18713m80652p11365k87704m02145K1896l42407L33328M35791
$$ 763397369 763423386 763542099 763061447 762350082 762062378 761660233 761682129 761339722 761673050 762108841
2024.2G62108841J44882N35431j85547K5635k29034o22178q77685n46494n0659l47061
$$ 762108841 762253723 762789154 762603607 762629242 762400208 761778030 760900345 760353851 760303192 759956131
2033.9G59956131Q9722L81241Q15429M32663j9531k91367m42123m78516r13696j85394
$$ 759956131 760045853 760427094 761242523 761675186 761655655 761364288 760922165 760443649 759529953 759344559
2043.5G59344559k05002K43072N52140K59399L74527R2926K98157k93808l02124m71268
$$ 759344559 759139557 759382629 759934769 760194168 760568695 760661621 760959778 760665970 760363846 759892578
2053.2G59892578o32782k77557m44412o6605J24512R63745P77817K04544k72904p04498
$$ 759892578 759259796 758982239 758537827 758471222 758595734 759559479 760337296 760541840 760268936 759564438
2062.8G59564438m01459q30841j04065l8605r7885J35422J98746N47943J18866M42123
$$ 759564438 759162979 758332138 758228073 758189468 758091583 758227005 758425751 758973694 759092560 759534683
2072.5G59534683L8223j55487l61785p49512o35910n01785L67813J60217N08728L79181
$$ 759534683 759572906 759417419 759055634 758306122 757670212 757168427 757536240 757696457 758205185 758584366
2082.1G58584366J52283K51922n37720l14636o61087n17425l06015j24970K10724K91443
$$ 758584366 758736649 758988571 758450851 758136215 757475128 756957703 756651688 756526718 756737442 757028885
2091.7G57028885O45904L82O4468J43662J10321m61273q06656m26636n92422J5487
$$ 757028885 757674789 757675171 757739639 757883301 757993622 757532349 756725693 756299057 755706635 755722122
2101.4G55722122l5400M72488L92990J6938L25393k30179K3194m80423n88227n96008
$$ 755722122 755686722 756159210 756552200 756569138 756894531 756664352 756687546 756207123 755618896 755022888
2111G55022888l94363K35977o9656M68139L71323L31573N2567m22211l80707n96695
$$ 755022888 754628525 754864502 754794846 755262985 755634308 755965881 756018448 755596237 755215530 754618835
2120.7G54618835l64151k55584J24893K4338J36490K47497P1335L49426K41471j59150
$$ 754618835 754254684 753999100 754123993 754148331 754284821 754532318 754603653 754953079 755194550 755035400
2130.3G55035400p70950l14560j73874Q7738L26157k67868K8229K47268O35376O8436
$$ 755035400 754264450 753949890 753776016 753863754 754189911 753922043 753950272 754197540 754832916 754901352
2140G54901352l92609l44085l96424o0653l01285J85013K08435M42352L58581j64947
$$ 754901352 754508743 754164658 753768234 753707581 753406296 753591309 753799744 754242096 754600677 754435730
2149.6G54435730P4615k76718J15357j62659n28717l01590j26495Q9340O7902L51562
$$ 754435730 754510345 754233627 754348984 754186325 753657608 753356018 753229523 753318863 753386765 753738327
2159.3G53738327J9760K28501L891j15815L47824R0866N9433l06472m6692k9450j72805
$$ 753738327 753758087 753986588 753990479 753874664 754222488 754313354 754372787 754066315 754019623 753990173 753817368
2169.9G53817368J11770J94626p9422m35028J76010K16904J13525l92380j87530M05884
$$ 753817368 753929138 754123764 754044342 753609314 753785324 754002228 754115753 753723373 753535843 753941727
2179.5G53941727j12610J20086k38266r4375J88675K01645K02942m73633q4839J44653
$$ 753941727 753829117 753949203 753710937 753616562 753805237 754006882 754209824 753736191 753651352 753796005
2189.1G53796005M0589j53275J34735K85034j0452j21612k92283L86811K79388J44654
$$ 753796005 753836594 753683319 753818054 754103088 754092636 753971024 753678741 754065552 754344940 754489594
2198.8G54489594j29166k54364P4234j62735J05591m81644j99280K81754K06070K33688
$$ 754489594 754360428 754106064 754180298 754017563 754123154 753641510 753442230 753723984 753930054 754163742
2208.4G54163742k46735J41144N6763O332J04447M01916K12326l53241j02310k96783
$$ 754163742 753917007 754058151 754114914 754121246 754225693 754627609 754839935 754486694 754384384 754087601
2218.1G54087601j10627l17382J33667L67202J94169L45993m30832K15606J61744j97602
$$ 754087601 753976974 753659592 753793259 754160461 754354630 754700623 754269791 754485397 754647141 754449539
2227.7G54449539k29492m71878L9825Q4992K55050m4250J27258j25122l29666J57166
$$ 754449539 754220047 753748169 753787994 753872986 754128036 754083786 754211044 754085922 753756256 753913422
2237.4G53913422j3810O6452n17425k13547J04904K27280K86255j65253L64075r2774
$$ 753913422 753899612 753966064 753448639 753235092 753339996 753567276 753853531 753688278 754052353 753959579
2247G53959579m81720l33023N6611N4245k21634l205j05285N23529L24783j1673k99072
$$ 753959579 753477859 753144836 753201447 753255692 753034058 753030853 752925568 753449097 753773880 753762207 753463135
2257.6G53463135l63617L16696j16348l95661k69622N188l32642K42004Q36029J56861
$$ 753463135 753099518 753416214 753299866 752904205 752634583 752639771 752307129 752549133 753385162 753542023
2267.3G53542023k2202n05142O4697l8605l80630M8294k0981r4604m53263J48850q9722
$$ 753542023 753519821 753014679 753079376 753040771 752660141 752708435 752687454 752592850 752139587 752288437 752198715
2277.9G52198715j22757K56729j49154l07541m15116J84021j39160j46179j30615J09787
$$ 752198715 752075958 752332687 752183533 751875992 751460876 751644897 751505737 751359558 751228943 751338730
2287.5G51338730N58395k59247J06583j7319J8311j18027l99017j51673m62646L32413
$$ 751338730 751897125 751637878 751744461 751727142 751745453 751627426 751228409 751076736 750614090 750946503
2297.2G50946503J9684J01623L12576k25906k69318n17196J43890k40097k75040K71607
$$ 750946503 750966187 751067810 751380386 751154480 750885162 750367966 750511856 750271759 749996719 750268326
2306.8G50268326M22592J55029o47278j98288k99530r8648j08490j57852L54614p5759
$$ 750268326 750690918 750845947 750198669 750000381 749700851 749602203 749493713 749335861 749690475 749614716
2316.4G49614716J75247L19748j48087k48337M67224n8975q52356n81131k67257O00967
$$ 749614716 749789963 750109711 749961624 749713287 750180511 750121536 749269180 748688049 748420792 749021759
2326.1G49021759K10953N43976K9525j330032k63519M69360K07367o47888q38013l87802
$$ 749021759 749232712 749776688 749806213 748476181 748212662 748682022 748889389 748241501 747403488 747015686
2335.7G47015686K67105L59421J65405o40716r98917M05273J88599K18048k31170o33164
$$ 747015686 747282791 747642212 747807617 747166901 746167984 746573257 746761856 746979904 746748734 746115570
2345.4G46115570n03006j043014j69068Q51822J490479Q01696o790n22766j109161
$$ 746115570 745612564 744569550 744400482 745252304 746742783 747544479 747537689 747014923 745905762
2354.1G45905762j050415l70102J591263J53579p75299k16369N19332M09012q33435
$$ 745905762 744855347 744485245 746076508 746230087 745454788 745238419 745757751 746166763 745333328
2362.7G45333328N14374p28607k38953L2501j273269k48490L4867j53046k20718K77404
$$ 745333328 745847702 745119095 744880142 744912643 743639374 743390884 743425751 743272705 743051987 743329391
2372.4G43329391m38995n00870l57284o78482l1128l91159l96729N1651m8218m67605
$$ 743329391 742890396 742389526 742032242 741353760 741322632 740931473 740534744 740586395 740538177 740070572
2382G40070572j22299J81122k46964j58844l91693k98767k58331J6098L52859m27628
$$ 740070572 739948273 740129395 739882431 739723587 739331894 739033127 738774796 738790894 739143753 738716125
2391.7G38716125n31539j37711J96533k98538p12585k25525n494k00881l04337K13013
$$ 738716125 738184586 738046875 738243408 737944870 737232285 737006760 737001266 736800385 736496048 736709061
2401.3G36709061l2959r7580K0904m16488n01709l11203Q4610l28293m42581j99814
$$ 736709061 736676102 736578522 736599426 736182938 735681229 735370026 735454636 735126343 734683762 734483948
2410.9G34483948J73568K94114l12500l30277o48193m01535p9575l16467k41242k16369
$$ 734483948 734657516 734951630 734639130 734308853 733660660 733259125 733179550 732863083 732621841 732405472
2420.6G32405472j49765j59607j39160n87769j63421J42517m25797m89197o13861K4185
$$ 732405472 732255707 732096100 731956940 731369171 731205750 731348267 730922470 730433273 729819412 729843597
2430.2G29843597J27335l66745l21884Q6365O5231m52194k17514m18701l23945k20337
$$ 729843597 729970932 729604187 729282303 729368668 729433899 728981705 728764191 728345490 728021545 727801208
2439.9G27801208n08956m23508k65350L1280l42407k85568k8992J79367J89209j22376
$$ 727801208 727292252 726868744 726603394 726634674 726292267 726006699 725977707 726157074 726346283 726223907
2449.5G26223907k88772q00476l32413k55203o50788n63278k85034M8676q1330J08185
$$ 726223907 725935135 725134659 724802246 724547043 723896255 723332977 723047943 723096619 723015289 723123474
2459.2G23123474k72446l26461m42734p12433k7008k71454l90472k31400m00848k89536
$$ 723123474 722851028 722524567 722081833 721369400 721342392 721070938 720680466 720449066 720048218 719758682
2468.8G19758682p3852j68534k91519j89895l56827m19769n38941j78146k82822n68390
$$ 719758682 719684830 719516296 719224777 719034882 718678055 718258286 717719345 717541199 717258377 716689987
2478.5G16689987k23541p3242M90112p4768o81458l98712l50647n12008o67191k96173
$$ 716689987 716466446 716393204 716883316 716808548 716127090 715728378 715377731 714865723 714198532 713902359
2488.1G13902359l67126j65482j34583j0986K08893o08597q03375n20859N5237j57547
$$ 713902359 713535233 713369751 713235168 713224182 713433075 712824478 712021103 711500244 711555481 711397934
2497.7G11397934o36749l74222l19443k67944l12882k4185j93024k95562m35562n96009
$$ 711397934 710761185 710386963 710067520 709799576 709486694 709462509 709269485 708973923 708538361 707942352
2507.4G07942352j52130p71103q84704L280L09143j49154l8300K24075k83889m65241
$$ 707942352 707790222 707019119 706134415 706137695 706446838 706297684 706259384 706483459 706199570 705734329
2517G05734329o75583o28891q41217n08041J2512k49100J85395O1264j49613j91192
$$ 705734329 705058746 704429855 703588638 703080597 703093109 702844009 703029404 703090668 702941055 702749863
2526.7G02749863m70734n05524l46832m82483n60531J97143k76489n34668q2550o2638
$$ 702749863 702279129 701773605 701426773 700944290 700383759 700580902 700304413 699769745 699687195 699624557
2536.3F99624557k5558k99759l88718p80563o2256K08893o28281n13610l36838J18103
$$ 699624557 699598999 699299240 698910522 698129959 698067703 698276596 697648315 697134705 696797867 696915970
2546F96915970o6757l02201l93524l39203L6469l12577m34875n52368l80631k64434
$$ 696915970 696849213 696547012 696153488 695814285 695850754 695538177 695103302 694550934 694170303 693905869
2555.6F93905869l4714j41602n69763J55716j43967o47659l50723k60315j79444o9732
$$ 693905869 693871155 693729553 693159790 693315506 693171539 692523880 692173157 691912842 691733398 691663666
2565.2F91663666k16294n72433l93677j71203J68686l5630l00064l93677o94809k92434
$$ 691663666 691447372 690874939 690481262 690310059 690478745 690443115 690143051 689749374 689054565 688762131
2574.9F88762131l52021j96685k50321m03900O867j32981j52740m02909m50515m16870
$$ 688762131 688410110 688213425 687963104 687559204 687566071 687433090 687280350 686877441 686426926 686010056
2584.5F86010056l24479l01971m08249k0904k03171j10779q3542l82919n04380l15856
$$ 686010056 685685577 685383606 684975357 684954453 684751282 684640503 684556961 684174042 683669662 683353806
2594.2F83353806l8300m20151l65448m31442k05689K6246k55280L2425P248k75192
$$ 683353806 683315506 682895355 682529907 682098465 681892776 681919022 681663742 681696167 681703415 681428223
2603.8F81428223o46592n52444m36478m27322j49231m24423j86310J41449j57089k68708
$$ 681428223 680781631 680229187 679792709 679365387 679216156 678791733 678605423 678746872 678589783 678321075
2613.5F78321075k44369m72488m46778m27551m89655j86157n09415n57708o7063K27890
$$ 678321075 678076706 677604218 677157440 676729889 676240234 676054077 675544662 674986954 674919891 675147781
2623.1F75147781j91269n91125n3558j87302l64761p45697p28989k31094m48990M2572
$$ 675147781 674956512 674365387 674311829 674124527 673759766 673014069 672285080 672053986 671604996 671647568
2632.8F71647568k12479m52423N2567l43552n20859j30310j76926p56454m96826j90582
$$ 671647568 671435089 670982666 671035233 670691681 670170822 670040512 669863586 669107132 668610306 668419724
2642.4F68419724l82386l52478j79291P1564k85568m20532k41318j82419k08435l73535
$$ 668419724 668037338 667684860 667505569 667577133 667291565 666871033 666629715 666447296 666238861 665865326
2652F65865326k00958l13111o21185m36172r0790j82953k42386j02692j85928l39890
$$ 665865326 665664368 665351257 664730072 664293900 664203110 664020157 663777771 663675079 663489151 663149261
2661.7F63149261l25851q2321l50113n48859k50015j23444k04010n3100L37448k27051
$$ 663149261 662823410 662741089 662390976 661842117 661592102 661468658 661264648 661211548 661548996 661321945
2671.3F61321945o03332M196j35651m83475L5325j47095o94733r4909n4703k56577
$$ 661321945 660718613 660722809 660587158 660103683 660139008 659991913 659297180 659202271 659147568 658890991
2681F58890991K1210j05820m26330o64292l75290k87933l37982j73798j30157n3330
$$ 658890991 658912201 658806381 658380051 657715759 657340469 657052536 656714554 656540756 656410599 656357269
2690.6F56357269k54516l45917R7656K08893k23618j45492l14102m47693k31934m57153
$$ 656357269 656102753 655756836 655854492 656063385 655839767 655694275 655380173 654932480 654700546 654243393
2700.3F54243393k71530k41013k8534p1716k19803J05591l71246j40610J74408j29242
$$ 654243393 653971863 653730850 653702316 653630600 653410797 653516388 653145142 653004532 653178940 653049698
2709.9F53049698m57611m47617J06354k65274m88892m8065K41623j93024p58895m55552
$$ 653049698 652592087 652144470 652250824 651985550 651496658 651448593 651690216 651497192 650738297 650282745
2719.5F50282745r8953j35651n53054l37830K72064L61405k52533m09775K03476j0452
$$ 650282745 650183792 650048141 649495087 649157257 649429321 649790726 649538193 649128418 649331894 649321442
2729.2F49321442j84632m87976m26788j17035m05960k04926j91879N3635J15280N1041
$$ 649321442 649136810 648648834 648222046 648105011 647699051 647494125 647302246 647355881 647471161 647522202
2738.8F47522202K57797J27258j00021q59223p37381l9367Q7204j89438l75748j10702
$$ 647522202 647779999 647907257 647807236 646948013 646210632 646171265 646258469 646069031 645693283 645582581
2748.5F45582581k12021J42517K98385k45437l39432k32391l17459m47922m19617n01404
$$ 645582581 645370560 645513077 645811462 645566025 645226593 644994202 644676743 644228821 643809204 643307800
2758.1F43307800J4878O53152K76871k08969j97220l9673r3765o06232p78732k29874
$$ 643307800 643322678 643975830 644252701 644043732 643846512 643806839 643713074 643106842 642328110 642098236
2767.8F42098236k98309k37274l1815j46484p2708j60065K34222j98211p03431n70411
$$ 642098236 641799927 641562653 641530838 641384354 641311646 641151581 641385803 641187592 640484161 639913750
2777.4F39913750r42498n11169q9684n6190j82991j94168J00250J26648K5253l06167
$$ 639913750 638971252 638460083 638370399 638314209 638131218 637937050 638037300 638163948 638189201 637883034
2787F37883034k54021l85132m74930l86161l48854l32947p18498k78473J7814m1351
$$ 637883034 637629013 637243881 636768951 636382790 636033936 635700989 634982491 634704018 634721832 634680481
2796.7F34680481m33846p59315k66762n56145l04451q1596n93223n21546k83394j43356
$$ 634680481 634246635 633487320 633220558 632664413 632359962 632278366 631685143 631163597 630880203 630736847
2806.3F30736847n17235l63235Q9454k44293r55238j199188m62380o5346m24804o25878
$$ 630736847 630219612 629856377 629945831 629701538 628746300 627547112 627084732 627019386 626594582 625968704
2816F25968704m30145l65181k42767j59111o55594o81610l52745o04477n85823k03858
$$ 625968704 625538559 625173378 624930611 624771500 624115906 623434296 623081551 622477074 621891251 621687393
2825.6F21687393o62460r90639n11093k19917j22261l04985o03447o20880o22406q07801
$$ 621687393 621024933 620034294 619523201 619303284 619181023 618876038 618272591 617651711 617029305 616221504
2835.3F16221504p06482o11686r04122j010246r72939o34155o90422j196175j070213
$$ 616221504 615515022 614903336 613999214 612988968 612016029 611381874 610691452 609495277 608425064
2843.9F08425064q30841j289558j721421j279411j367378j795960j437988p20444m40368
$$ 608425064 607594223 606304665 604583244 603303833 601936455 600140495 598702507 597982063 597541695
2852.6E97541695j043244r36165j01585O8016k36626R804K15912l58849m05922k75459
$$ 597541695 596498451 595562286 595460701 595528717 595292091 595301895 595517807 595158958 594753036 594477577
2862.3E94477577j77460Q7281o0425n96581p60192m57611q59261q23288j76964n2833
$$ 594477577 594300117 594387398 594326973 593730392 592970200 592512589 591653328 590830040 590653076 590600243
2871.9E90600243k80495o88362o07186j52053k54975r11865o77681j15395j92604n04951
$$ 590600243 590319748 589631386 589024200 588872147 588617172 587705307 587027626 586912231 586719627 586214676
2881.6E86214676p21054l97263m61426m11872m71230r52530o89621o88171q86803m43916
$$ 586214676 585493622 585096359 584634933 584223061 583751831 582799301 582109680 581421509 580534706 580090790
2891.2E80090790k3232l95164n38712o05049q49571o21681r11446p48177n27000o39229
$$ 580090790 580067558 579672394 579133682 578528633 577679062 577057381 576145935 575397758 574870758 574231529
2900.8E74231529l56521l32261l15742m68216o00853o16074k52418m44832j118698
$$ 574231529 573875008 573542747 573227005 572758789 572157936 571541862 571289444 570844612 569725914
2909.5E69725914j102028j130180p87735p69043q17414j097145j474876o68221o08291
$$ 569725914 568623886 567493706 566705971 565936928 565119514 564022369 562547493 561879272 561270981
2918.2E61270981j400223j711960j113930p68432m40979k16141o11000j12267m1770
$$ 561270981 559870758 558158798 557044868 556276436 555835457 555619316 555008316 554896049 554854279
2926.9E54854279j1025l07999k66609N02815n4016o2828L79830R29603M31862K7809
$$ 554854279 554843254 554535255 554268646 554771461 554717445 554654617 555034447 555964050 556395912 556423721
2936.5E56423721Q22640J67999J22986N32417J063004J178817P2098O9390K59323O32438
$$ 556423721 557246361 557414360 557537346 558069763 559132767 560311584 560383682 560453072 560712395 561344833
2946.2E61344833J021195O82678K02751Q9760N25970O94047M67567k51312l51868K87743
$$ 561344833 562366028 563048706 563251457 563341217 563867187 564561234 565028801 564777489 564425621 564713364
2955.8E64713364O84280N71594J16272L20015P36580N89676J08223K32620M43764M05693
$$ 564713364 565397644 565969238 566085510 566405525 567142105 567731781 567840004 568072624 568516388 568922081
2965.5E68922081P25174P21054L46985K0447L41034P80372O68221L82271L28941M47159
$$ 568922081 569647255 570368309 570715294 570735741 571076775 571857147 572525368 572907639 573236580 573683739
2975.1E73683739L34205K76375K24495K89459Q3733K57988O73714J46942M1008K08397
$$ 573683739 574017944 574294319 574518814 574808273 574892006 575149994 575823708 575970650 576011658 576220055
2984.7E76220055K71644J17073o9084O7558J03569K29454K0829K35939L55377N4893
$$ 576220055 576491699 576608772 576539688 576607246 576710815 576940269 576961098 577197037 577552414 577607307
2994.4E77607307k09198l96041K1858k83127l73421j09901l46909k63939J28022J55258
$$ 577607307 577398109 577002068 577023926 576740799 576367378 576257477 575910568 575646629 575774651 575929909
3004E75929909q50067p55120Q3657L72009K42462q28934r14116l78456l41110j76735
$$ 575929909 575079842 574324722 574408379 574780388 575022850 574193916 573279800 572901344 572560234 572383499
3013.7E72383499l58734p27577n18837m7951r6970k64053m68216p38182p44095m52003
$$ 572383499 572024765 571297188 570778351 570730400 570633430 570369377 569901161 569162979 568418884 567966881
3023.3E67966881l32489o27976n83000l10097k64625l45268l80211m72031n63850o72264
$$ 567966881 567634392 567006416 566423416 566113319 565848694 565503426 565123215 564651184 564087334 563415070
3033E63415070p97997n93834n24025l68309p6866l93448r79423p65038j58768m34990
$$ 563415070 562617073 562023239 561499214 561130905 561054039 560660591 559681168 558916130 558757362 558322372
3042.6E58322372q04596m48036k16179q67309r11141l85589p20864o59713m83170o94427
$$ 558322372 557517776 557069740 556853561 555986252 555075111 554689522 553968658 553308945 552825775 552131348
3052.2E52131348p09992o05011n32112j54762M1427q55903j040726o40831m33273k59476
$$ 552131348 551421356 550816345 550284233 550129471 550170898 549314995 548274269 547633438 547200165 546940689
3061.9E46940689k42500k61994n73616l25584o24924p71217l96004p58095l76701j81084
$$ 546940689 546698189 546436195 545862579 545536995 544912071 544140854 543744850 542986755 542610054 542428970
3071.5E42428970k31399o68755j015243k11563j43128n61142o00357j12724l71323
$$ 542428970 542197571 541528816 540513573 540302010 540158882 539597740 538997383 538884659 538513336
3080.2E38513336q18214m17366n28145m44794l93715l98559k22817m30107o13479l53852
$$ 538513336 537695122 537277756 536749611 536304817 535911102 535512543 535289726 534859619 534246140 533892288
3089.9E33892288k58407p91245o52656j69754l0213o53572j110840l34091j34583l89900
$$ 533892288 533633881 532842636 532189980 532020226 531990013 531336441 530225601 529891510 529756927 529367027
3099.5E29367027n72319l87764n51643j026497n36575k65427k58675m29077n20286
$$ 529367027 528794708 528406944 527855301 526828804 526292229 526026802 525768127 525339050 524818764
3108.2E24818764m01650p48443r45588n23757m4785l42484o10198o86074m94652j14021
$$ 524818764 524417114 523668671 522723083 522199326 522154541 521812057 521201859 520515785 520021133 519907112
3117.8E19907112l31726n80521p49015m74358l17726r75304j088333j69487J34163
$$ 519907112 519575386 518994865 518245850 517771492 517453766 516478462 515390129 515220642 515354805
3126.5E15354805m90150p25518q44497k12288m8104p89451q08983q46253p53288p09686
$$ 515354805 514864655 514139137 513294640 513082352 513034248 512244797 511435814 510589561 509836273 509126587
3136.1E09126587k74658K00653k08397p23763r02938m88167q17948j009788p90138
$$ 509126587 508851929 509052582 508844185 508120422 507217484 506729317 505911369 504901581 504111443
3144.8E04111443r85718l85285k1896k57950m10576k98309n80940r31740o03218n39131
$$ 504111443 503125725 502740440 502718544 502460594 502050018 501751709 501170769 500239029 499635811 499096680
3154.5D99096680o08750r15794p00302m56696q52279p62101q05816m15192k54669r13201
$$ 499096680 498487930 497572136 496871834 496415138 495562859 494800758 493994942 493579750 493325081 492411880
3164.1D92411880o88781j51863l05863q14895p86972m68026o88438o14166j46027n66292
$$ 492411880 491723099 491571236 491265373 490450478 489663506 489195480 488507042 487892876 487746849 487180557
3173.8D87180557j043968o40717j62239m30374j232605p33299k96211r78699p55157
$$ 487180557 486136589 485495872 485333633 484903259 483670654 482937355 482641144 481662445 480907288
3182.4D80907288k86904m18281o39611o36558n94521o32133n08538o14967m69398l36533
$$ 480907288 480620384 480202103 479562492 478925934 478331413 477699280 477190742 476575775 476106377 475769844
3192.1D75769844q42476o00281M8523n27343q97141n23262o83021n69535n00183p14226
$$ 475769844 474927368 474327087 474375610 473848267 472951126 472427864 471744843 471175308 470675125 469960899
3201.7D69960899l51562m36516p64427k00653R422l52745l72772p64198p24831m0398
$$ 469960899 469609337 469172821 468408394 468207741 468217163 467864418 467491646 466727448 466002617 465962219
3211.4D65962219j62544p78122j102562n42831l34511n99594j52855j32179p41616
$$ 465962219 465799675 465021553 463918991 463376160 463041649 462442055 462289200 462157021 461415405
3220D61415405r43641r21784q94966k29225J40571m33464o28852o78864m98619L6736
$$ 461415405 460471764 459549980 458655014 458425789 458566360 458132896 457504044 456825180 456326561 456363297
3229.7D56363297l30773r84306n18151O7673k47154m76074o42815q10738m67720l34777
$$ 456363297 456032524 455048218 454530067 454597740 454350586 453874512 453231697 452420959 451953239 451618462
3239.3D51618462l46680P324k8992l69834m72527r28955j024819m55665m48456q08945
$$ 451618462 451271782 451279106 451250114 450880280 450407753 449478798 448453979 447998314 447549858 446740913
3249D46740913o92253o1569J71700l58010m57649k670l26271n79415n25398n58548
$$ 446740913 446048660 445987091 446158791 445800781 445343132 445340462 445014191 444434776 443909378 443350830
3258.6D43350830j32408n96809p37725L8071k32620n76248p57142o19850J92299K00691
$$ 443350830 443218422 442621613 441883888 441921959 441689339 441113091 440355949 439736099 439928398 440129089
3268.3D40129089o66961m81186K86255m7951p00455j208725o93779j4992j40876k27928
$$ 440129089 439462128 438980942 439267197 439219246 438518791 437310066 436616287 436601295 436460419 436232491
3277.9D36232491o53306l03306J62582k94418n55038l18528K07253q3351l33023l30887
$$ 436232491 435579185 435275879 435438461 435144043 434589005 434270477 434477730 434394379 434061356 433730469
3287.5D33730469n09911k61078n97381p05071j46408R346J00365k19574o58264m54445
$$ 433730469 433220558 432959480 432362099 431657028 431510620 431519966 431620331 431400757 430742493 430288048
3297.2D30288048j75019j78070o14967n17845m7417l63235k11792k58713n47638l21236
$$ 430288048 430113029 429934959 429319992 428802147 428754730 428391495 428179703 427920990 427373352 427052116
3306.8D27052116m94957l83491m05426j41754j37215j160660q34884p6752l90549p48596
$$ 427052116 426557159 426173668 425768242 425626488 425489273 424328613 423493729 423416977 423026428 422277832
3316.5D22277832l72887n1765k73323p59354r96170q1978l9596q06389o16150l14636
$$ 422277832 421904945 421853180 421579857 420820503 419824333 419742355 419702759 418896370 418280220 417965584
3326.1D17965584m91295p18041n21850q80356o73904L1471k48947l61977n56755p31010
$$ 417965584 417474289 416756248 416234398 415354042 414680138 414711609 414462662 414100685 413543930 412812920
3335.8D12812920q39425o95991m19579m50019o447m88396r54018o78634q27370l31840
$$ 412812920 411973495 411277504 410857925 410407906 410401459 409913063 408959045 408280411 407453041 407121201
3345.4D07121201j78185o78291q29926p74994k55127P4463l35197r89037p83157k37694
$$ 407121201 406943016 406264725 405434799 404659805 404404678 404479141 404143944 403154907 402371750 402134056
3355.1D02134056o49261o54793o08788n38063J50490l57628o20804n52635o89163J18751
$$ 402134056 401484795 400830002 400221214 399683151 399833641 399476013 398855209 398302574 397613411 397732162
3364.7C97732162r2201o42814k81792l26843o47736n92079m94995m84658n06134p80296
$$ 397732162 397639961 396997147 396715355 396388512 395740776 395148697 394653702 394169044 393662910 392882614
3374.3C92882614l78837r0104k89154l42445n07507k63787l79715l76587k84500n70907
$$ 392882614 392503777 392413673 392124519 391782074 391274567 391010780 390631065 390254478 389969978 389399071
3384C89399071l36495k06985j98975m3449K87170j93786n64309K02675l07808r97543
$$ 389399071 389062576 388855591 388656616 388613167 388900337 388706551 388142242 388344917 388037109 387039566
3393.6C87039566l82500j49994j61018j37672m70238j13373L40462j98593l74337k96821
$$ 387039566 386657066 386507072 386346054 386208382 385738144 385624771 385965233 385766640 385392303 385095482
3403.3C85095482k09580j50909k92816k51656m0207P3929k68822p0953J11961k5978
$$ 385095482 384885902 384734993 384442177 384190521 384150314 384224243 383955421 383884468 383996429 383970451
3412.9C83970451k08053k42005L90587J7281k08664L46336K20299k22206j27945J30005
$$ 383970451 383762398 383520393 383910980 383928261 383719597 384065933 384286232 384064026 383936081 384066086
3422.6C84066086k80838n6954J77842K51388M51546R6626J15624l2425k41013J99967
$$ 384066086 383785248 383728294 383906136 384157524 384609070 384705696 384821320 384788895 384547882 384747849
3432.2C84747849O63833O1112l30277L56941L29132K77176M29192J25923Q0910N36194
$$ 384747849 385411682 385472794 385142517 385499458 385828590 386105766 386534958 386660881 386741791 387277985
3441.8C87277985K28042j30386K05078L22266N27839L8643P98569Q71963j14898O50634
$$ 387277985 387506027 387375641 387580719 387902985 388430824 388469467 389268036 390139999 390025101 390675735
3451.5C90675735M80996L64189N44662L98712K63901L79982J285362L45688J44844
$$ 390675735 391156731 391520920 392065582 392464294 392728195 393108177 394393539 394739227 394884071
3460.2C94884071O63109K37961N00412O35910N33714M49791J054001J096649P33834
$$ 394884071 395547180 395785141 396285553 396921463 397455177 397904968 398958969 400055618 400789452
3468.8D00789452R0255j04217Q73031P81212J103936Q17222N27458J180420P62635
$$ 400789452 400879707 400775490 401648521 402429733 403533669 404350891 404878349 406058769 406821404
3477.5D06821404K85377j4496P29752J058845K01493J66359J152992J437797O80275
$$ 406821404 407106781 407092285 407822037 408880882 409082375 409248734 410401726 411839523 412519798
3486.2D12519798P05414M27895N10368R54933R15489O16913M92935R77517L68652P38487
$$ 412519798 413225212 413653107 414163475 415118408 416033897 416650810 417143745 418121262 418489914 419228401
3495.8D19228401J525345P97462M69666R11560J035156O81877J401215L66745j26915
$$ 419228401 420753746 421551208 422020874 422932434 423967590 424649467 426050682 426417427 426290512
3504.5D26290512J482124J123238J236115J457328J13602p8545J297646J463585J306152
$$ 426290512 427772636 428895874 430131989 431589317 431702919 431624374 432922020 434385605 435691757
3513.2D35691757P05719j12190O81534J117706J056709Q46405J286431J562347J039620
$$ 435691757 436397476 436285286 436966820 438084526 439141235 439987640 441274071 442836418 443876038
3521.9D43876038Q71963j45149P86247J492424O55365P47910J010208J177521J186866
$$ 443876038 444748001 444602852 445389099 446881523 447536888 448284798 449295006 450472527 451659393
3530.6D51659393J204110P64732J047706J289711J393815Q99925j88751J620979J776886
$$ 451659393 452863503 453628235 454675941 455965652 457359467 458259392 458070641 459691620 461468506
3539.2D61468506Q71849J307754J150551R67827R34334P12624J143226J615029K2048
$$ 461468506 462340355 463648109 464798660 465766487 466700821 467413445 468556671 470171700 470193748
3547.9D70193748J415291K237358J355133J437264R8038J762924J399155J179389J831322
$$ 470193748 471609039 473846397 475201530 476638794 476736832 478499756 479898911 481078300 482909622
3556.6D82909622K58064J819840J651230P20176Q33817J919479J706810Q27866L882751
$$ 482909622 483167686 484987526 486638756 487358932 488192749 490112228 491819038 492646904 496529655
3565.3D96529655J340485l59726R4452J15547L355484J410980J151352J948204K180405
$$ 496529655 497870140 497510414 497604866 497720413 501075897 502486877 503638229 505586433 507766838
3574E07766838J331711J155014J701164K29263K408982K002640J118278J794434J698608
$$ 507766838 509098549 510253563 511954727 512183990 514592972 516595612 517713890 519508324 521206932
3582.6E21206932J531944P97387M316024J970520j681022K016372L73307K420845J992759
$$ 521206932 522738876 523536263 527852287 529822807 528141785 530158157 530531464 532952309 534945068
3591.3E34945068K654038J044197M29420M144783j96571J499519K671395O72340K505112
$$ 534945068 537599106 538643303 539072723 543217506 543020935 544520454 547191849 547864189 550369301
3600E50369301J127014J479416J737900J481552K244949L098297K745743q64029K224846
$$ 550369301 551496315 552975731 554713631 556195183 558440132 561538429 564284172 563420143 565644989
3608.7E65644989J8272M29917O595115J213875j034126M030418K10495L199883L654861
$$ 565644989 565663261 566093178 572688293 573902168 572868042 576898460 577108955 580308838 583963699
3617.4E83963699K21978J490707J319466J800956J644326J881065K470932K593079
$$ 583963699 584185677 585676384 586995850 588796806 590441132 592322197 594793129 597386208
3625.1E97386208J912345K271195O337814K42539r024239L683052M746132N256996
$$ 597386208 599298553 601569748 607907562 608150101 599125862 602808914 607555046 612812042
3632.8F12812042J628952r80110K320213K659760K051659J170883J469040K147674
$$ 612812042 614440994 613460884 615781097 618440857 620492516 621663399 623132439 625280113
3640.5F25280113K800408J728057J089402K675476L733101N405082n38787k187882
$$ 625280113 628080521 629808578 630897980 633573456 637306557 642711639 642172852 639984970
3648.2F39984970M904862j426697k361145N00717M769974L902511L665467N721511
$$ 639984970 644889832 643463135 641101990 641602707 646372681 650275192 653940659 659662170
3655.9F59662170n730972L16315M968414J885147J605454R91211K567978J113510P12280
$$ 659662170 653931198 654247513 659215927 661101074 662706528 663697739 666265717 667379227 668091507
3664.6F68091507J959534J166458M227829K446365o39725k1667o365967L285675Q182373
$$ 668091507 670051041 671217499 675445328 677891693 677251968 677230301 670864334 674150009 682332382
3673.3F82332382Q451462n56946j7509308L121949P145004M041824j894607L19671
$$ 682332382 690783844 690226898 672717590 675839539 682984543 687026367 685131760 685451431
3681F85451431K180558J862869K003555j54800K57492M142151O016540q093490l627549
$$ 685451431 687631989 689494858 691498413 691343613 691601105 695743256 701759796 693666306 690038757
3689.7F90038757P923966m422913o8359M592666M34800J608123o7978q52890J431275
$$ 690038757 697962723 693539810 693471451 698064117 698498917 700107040 700039062 699186172 700617447
3698.4G00617447R61151K811356L025970n598297k027969M763641J309891O103K45743
$$ 700617447 701578598 704389954 707415924 701817627 699789658 704553299 705863190 705869293 706115036
3707G06115036K678604M152374p297973K682571L986588j1553574M076004L417816
$$ 706115036 708793640 712946014 705648041 708330612 712317200 700763626 704839630 708257446
3714.8G08257446m3945J028366K273865J870575k776642N80749N621720k637329m903412
$$ 708257446 708213501 709241867 711515732 713386307 710609665 711190414 716812134 714174805 709271393
3723.4G09271393M156875J904755j52054l354492j77002L779755J309280N652008j410217
$$ 709271393 713428268 715333023 715180969 711826477 711649475 715429230 716738510 722390518 720980301
3732.1G20980301p977600P674408J769485j0221939j198730K168960N5695K128677
$$ 720980301 713002701 720677109 722446594 712224655 711025925 713194885 713250580 715379257
3739.8G15379257L553620k885361K768020J0847397j0385208j4543152J0438004O019440
$$ 715379257 718932877 716047516 718815536 729662933 719277725 704734573 715172577 721192017
3747.5G21192017M943084m574051q924484R804840q190689o022644O888504M363022
$$ 721192017 726135101 721561050 712636566 722441406 714250717 708228073 715116577 719479599
3755.3G19479599K794342m636002K247544N314331p103195j362305L932953R95560
$$ 719479599 722273941 717637939 719885483 725199814 718096619 716734314 720667267 721662827
3763G21662827j79902L287659j594620m560318L227463M778137k65197q912964Q59070
$$ 721662827 721482925 724770584 723175964 718615646 721843109 726621246 726356049 717443085 718302155
3771.7G18302155L252105R03626Q04748o74820N26886N62592K639923Q61053o926803
$$ 718302155 721554260 722457886 723262634 722587814 723114700 723677292 726317215 727178268 720251465
3780.3G20251465J188888J616974N70526K296601k617722j965256J491089J207810
$$ 720251465 721440353 723057327 723627853 725924454 723306732 721341476 722832565 724040375
3788G24040375M52041o64596l02353N84717O02035l32184J180649L155747k808228
$$ 724040375 724492416 723827820 723525467 724110184 724712219 724380035 725560684 728716431 725908203
3796.7G25908203l917999J760635L536225N729446m665756j0839005L049088K913971
$$ 725908203 721990204 723750839 727287064 733016510 728350754 717511749 720560837 723474808
3804.4G23474808M531631N041428q462448m266053L568421J412964J87988N77011Q7814
$$ 723474808 728006439 733047867 724585419 720319366 723887787 725300751 725488739 726065750 726153564
3813.1G26153564J305619N128860j534118j2598114M438781N944443L305206j174087
$$ 726153564 727459183 732588043 731053925 718455811 722894592 728839035 732144241 730970154
3820.8G30970154j4607010J886597N045166J860427K173539N99823l390351N951J430741
$$ 730970154 716363144 718249741 723294907 725155334 727328873 727928696 724538345 724544296 725975037
3829.5G25975037L141555J842347p694626K928924O757660o130447n31006P747574
$$ 725975037 729116592 730958939 723264313 726193237 732950897 726820450 726289444 734037018
3837.2G34037018q334351m455871P604217n169983p83615O148758k391586l106079
$$ 734037018 725702667 721246796 728851013 723681030 722897415 729046173 726654587 723548508
3844.9G23548508K214126P61795K2126J640701n74799J616669N429916m604721p39288
$$ 723548508 725762634 726524429 726546555 728187256 727612457 729229126 734659042 730054321 729315033
3853.6G29315033j3940887J461944J0650787K0600k670975J474381J927414K252731
$$ 729315033 715374146 716836090 727486877 727507477 724836502 726310883 728238297 730491028
3861.3G30491028m447632m5090N299149o026611m131623L554001L995972N823974p029342
$$ 730491028 726043396 725998306 731297455 725270844 721139221 724693222 728689194 734513168 727483826
3870G27483826j0000763L491974O194839M360275q667907l69492L415222L6469K330932
$$ 727483826 717483063 720975037 727169876 731530151 722862244 722492752 725907974 725944443 728275375
3878.7G28275375M424134n242615p245941N424652J741028J998901L831482j2998886
$$ 728275375 732699509 727456894 720210953 725635605 727376633 729375534 733207016 720208130
3886.4G20208130J417313L842697J198043M536133j483993p773209J017838K591171
$$ 720208130 721625443 725468140 726666183 731202316 729718323 721945114 722962952 725554123
3894.1G25554123q91037J512985J383438K120438J238174q959274M603348K135544
$$ 725554123 724663086 726176071 727559509 729679947 730918121 721958847 726562195 728697739
3901.8G28697739n143586L322068l451386j768875O06995J276016J620483q4228R83352
$$ 728697739 723554153 726876221 723424835 721655960 722262955 723538971 725159454 725075226 726058578
3910.5G26058578j31912k29797l88565l50800J663285K297515k362213l090591L563614
$$ 726058578 725926666 725696869 725308304 724957504 726620789 728918304 726556091 723465500 727029114
3919.2G27029114o98014m055709J914215J536102J310959j120300l147736P45010J653061
$$ 727029114 726331100 722275391 724189606 725725708 727036667 725916367 722768631 723513641 725166702
3927.9G25166702J702347r64737j219330J825943k455215j735535J336289l65448Q87832
$$ 725166702 726869049 725904312 724684982 726510925 724055710 722320175 723656464 723291016 724178848
3936.6G24178848Q45413m88204J56326M9591J082382N88684l592224p72476J836929
$$ 724178848 725024261 724536057 724692383 724741974 725824356 726413040 722820816 722048340 723885269
3945.2G23885269J131439J063385j839599q1940N34668k071533J899261O10123j627197
$$ 723885269 725016708 726080093 724240494 724158554 724693222 722621689 724520950 725131073 723503876
3953.9G23503876M03137P00073o7062j185379J85470K42386M88892M90951j472778
$$ 723503876 723907013 724607086 724540024 723354645 723540115 723782501 724271393 724762344 723289566
3962.6G23289566p1259J00861k18277J52130k01187M17709J4801q47396J78909Q13446
$$ 723289566 723218307 723319168 723100891 723253021 723051834 723469543 723484344 722636948 722815857 723629303
3972.2G23629303q5373N9586L20434j83639j86844K7160l68118k9526N18189j50147
$$ 723629303 723543930 723603516 723923950 723740311 723553467 723580627 723212509 723182983 723701172 723551025
3981.9G23551025N41611J45187l97949L67737l68805o62308m93164N77774Q29697m38156
$$ 723551025 724092636 724237823 723839874 724207611 723838806 723176498 722683334 723261108 724090805 723652649
3991.5G23652649o45371P5150P30438j07422l24249m18243j31226O08673K99072
$$ 723652649 723007278 723082428 723812866 723705444 723381195 722962952 722831726 723440399 723739471
4000.2G23739471
$$ 723739471
##END=$$ End of the data block
