##TITLE=Diatomacea 2 $$ Begin of the data block
##JCAMP-DX=5.00 $$ ACD/SpecManager v 10.08
##SPECTROMETER/DATA SYSTEM=Alpha
##DATE=16 Dec 2016 08:03:44
##DATA TYPE=INFRARED SPECTRUM
##DATA CLASS=XYDATA
##ORIGIN=
##OWNER=
##NPOINTS=1765
##FIRSTX=399.77209473
##LASTX=3997.72216797
##MAXX=3997.72216797
##MINX=399.77209473
##MAXY=0.81530112
##MINY=0.19859909
##XFACTOR=1.0000000000
##YFACTOR=1.000000000000000e-9
##FIRSTY=0.65046352
##DELTAX=2.03965425
##XUNITS=1/CM
##YUNITS=ARBITRARY UNITS
##XYDATA=(X++(Y..Y))
399.8F50463521k170681k789438l158152l173113l896713m344762m775762n092502
$$ 650463521 648292840 645503402 642345250 639172137 635275424 630930662 626154900 621062398
416.1F21062398n734205p131875o850004o754339p774412q165121q723081r358048
$$ 621062398 615328193 608196318 601346314 594591975 586817563 578652442 569929361 560571313
432.4E60571313r673119j0646343j1483848j2527406j4027119j3388634j0817706q787900
$$ 560571313 550898194 540251851 528768003 516240597 502213478 488824844 478007138 469219238
448.7D69219238q926958j1040300j3114959j5950293j9324928k0519823k0896047k0472855
$$ 469219238 460292280 449251980 436137021 420186728 400861800 380341977 359445930 338973075
465C38973075j8396884j4554888q912265l236622P13438K691567L459662L664136L602981
$$ 338973075 320576191 306021303 297109038 293872416 294585854 297277421 300737083 304401219 308004200
483.4C08004200L570647M744589P634222J0505200J1911452J1649638J0407239R201378
$$ 308004200 311574847 316319436 323953658 334458858 346370310 358019948 368427187 377628565
499.7C77628565Q244693P265657O612420O240636O016195O159336O363004P078707
$$ 377628565 385873258 393138915 399751335 405991971 412008166 418167502 424530506 431609213
516D31609213Q097679Q968800J0185987J1894435J4463573J7544300K0200789K1906375
$$ 431609213 439706892 448675692 458861679 470756114 485219687 502763987 522964776 544871151
532.3E44871151K1550894J9705117J8953145J9051969J8488466J7056346J4548898
$$ 544871151 566422045 586127162 605080307 624132276 642620742 659677088 674225986
546.6F74225986J2108922J0309398Q597315P572233O728947N810202N509495M822314
$$ 674225986 686334908 696644306 705241621 712813854 719542801 725353003 730862498 735684812
562.9G35684812M264534M250884L758728L559411L297150K778590K869963K473474
$$ 735684812 739949346 744200230 747958958 751518369 754815519 757594109 760464072 762937546
579.3G62937546J973927J981854J413465J239002J083195K38418o3538q94428k212941
$$ 762937546 764911473 766893327 768306792 769545794 770628989 770867407 770803869 769909441 767696500
597.6G67696500l300488n412221p834137j0438561j3851821j6202689j6800105j4963508
$$ 767696500 764396012 758983791 751149654 740711093 726859272 710656583 693856478 678892970
613.9F78892970r912252l253281L821373R643435J2814581J4243901J4147043J2620747
$$ 678892970 668980718 665727437 669548810 679192245 692006826 706250727 720397770 733018517
630.3G33018517J1232734R653509Q038819P056713N760133M791498M302860L427982
$$ 733018517 744251251 753904760 761943579 769000292 774760425 779551923 783854783 787282765
646.6G87282765L029883K627671J932323J883745J529932J141369J171947P59065L81172
$$ 787282765 790312648 792940319 794872642 796756387 798286319 799427688 800599635 801358700 801739872
664.9H01739872o7056L2187J131177P93695J12713K05457R3102m0293k682l20375l35097
$$ 801739872 801672816 801705003 802836180 803629875 803742588 803948045 804041147 804000854 803998172 803677797 803342700
687.4H03342700k84851m86791l97861n70655p85887n88775o93023p67648p10666r24409
$$ 803342700 803057849 802571058 802173197 801602542 800816655 800227880 799534857 798767209 798056543 797132134
707.8G97132134q76963q46982j049101r85205j145840j337290j099407j169146j353025
$$ 797132134 796255171 795408189 794359088 793373883 792228043 790890753 789791346 788622200 787269175
726.1G87269175j399934j611591j571655j618028j956164j946092k071023k405703
$$ 787269175 785869241 784257650 782685995 781067967 779111803 777165711 775094688 772688985
742.4G72688985k500117k811372l123045l177941l352583l368020l427982l824711
$$ 772688985 770188868 767377496 764254451 761076510 757723927 754355907 750927925 747103214
758.8G47103214m091859m590571n435586o376206p919372r823679j1735976j3752043
$$ 747103214 743011355 738420784 732985198 726608992 718689620 708865941 697129965 683377922
775.1F83377922j5239001j6314685j7419815j8206835j8756509j8218159j5233279
$$ 683377922 668138921 651824236 634404421 616197586 597441077 579222918 563989639
789.3E63989639r982705l368974L566623J0007918J6204238K1889508K5995433K7775705
$$ 563989639 554006934 550637960 554204583 564212501 580416739 602306247 628301680 656077385
805.7F56077385K6517093K3012340J8965602J5029729J1970400R919346Q159995P037401
$$ 656077385 682594478 705606818 724572420 739602149 751572549 761491895 769651890 776689291
822G76689291O305695N527377N122065M559994L792167L278732K628803K190471J958311
$$ 776689291 782994986 788522363 793644428 798204422 801996589 805275321 807904124 810094595 812052906
840.3H12052906J418054J074016O78301P7843k10285p03394j184702j298785j687944
$$ 812052906 813470960 814544976 815223277 815301120 815090835 814387441 813202739 811903954 810216010
858.7H10216010j967669k063036k359867k436459k620995k943277k931953l072917
$$ 810216010 808248341 806185305 803825438 801388979 798767984 795824707 792892754 789819837
875G89819837l166557l031313l206194l278792l282666l586054l678977l735304l891706
$$ 789819837 786653280 783621967 780415773 777136981 773854315 770268261 766589284 762853980 758962274
893.4G58962274l824234l869713l927827l878057m029095m078150m119634m341722
$$ 758962274 755138040 751268327 747340500 743462443 739433348 735355198 731235564 726893842
909.7G26893842m356503m424989m581035m540741m643917m750073m746258m888416
$$ 726893842 722537339 718112350 713531315 708990574 704346657 699596584 694850326 689961910
926F89961910m892528m893184n096972n156040n238414n371212n355061n448937n500019
$$ 689961910 685069382 680176198 675079226 669923186 664684772 659313560 653958499 648509562 643009543
944.4F43009543n399584n402923n337536n256832n226910m959047m730821m735112
$$ 643009543 637609959 632207036 626869500 621612668 616385758 611426711 606695890 601960778
960.7F01960778m817426n043268n209088n256355n380452n447030n544841n737543
$$ 601960778 597143352 592100084 586890996 581634641 576254189 570807159 565262318 559524775
977E59524775n805910n894661n989134n954981o005764o045342n979299n981744n970537
$$ 559524775 553718865 547824204 541835070 535880089 529874325 523828983 517849684 511867940 505897403
995.4E05897403o023675o212473o372691o583154o811410o944328p042170p026315
$$ 505897403 499873728 493661255 487288564 480705410 473894000 466949672 459907502 452881187
1011.7D52881187o989062p092803p157326p160574p205040p311314p489473p506579
$$ 452881187 445892125 438799322 431641996 424481422 417276382 409965068 402475595 394969016
1028C94969016p264971p012010o801486o610632o538987o507158o484122o531208o766320
$$ 394969016 387704045 380692035 373890549 367279917 360740930 354233772 347749650 341218442 334452122
1046.3C34452122p346123q040071q542418q909732r156555r238631r351193r609610
$$ 334452122 327105999 319065928 310523510 301613778 292457223 283218592 273867399 264257789
1062.7B64257789r926379r975612r443805q363187o947741n518600m335240l420234
$$ 264257789 254331410 244355798 234911993 226548806 219601065 214082465 209747225 206326991
1079B06326991k753362k303496j764223r06825K76253J651019K927571L956408M719987
$$ 206326991 203573629 201270133 199505910 198599085 198875338 200526357 203453928 207410336 212130323
1097.3B12130323N199879N445198N539938N475492N310625N088597M779473M428238
$$ 212130323 217330202 222775400 228315338 233790830 239101455 244190052 248969525 253397763
1113.7B53397763M075914L720761L381729L055215K742022K490461K313554K284825
$$ 253397763 257473677 261194438 264576167 267631382 270373404 272863865 275177419 277462244
1130B77462244K308369K216994K114386K068490K046048K060026K072007K065718K134114
$$ 277462244 279770613 281987607 284101993 286170483 288216531 290276557 292348564 294414282 296548396
1148.3B96548396K259732K371579K460271K538324K642065K739519K811610K925754
$$ 296548396 298808128 301179707 303639978 306178302 308820367 311559886 314371496 317297250
1164.6C17297250L061086L190756L383815L604025L854811M160643M456490M749954
$$ 317297250 320358336 323549092 326932907 330536932 334391743 338552386 343008876 347758830
1181C47758830M971057M983902M704118L922492K495110O81430r94772j893848j668811
$$ 347758830 352729887 357713789 362417907 366340399 368835509 369516939 368522167 366628319 364959508
1199.3C64959508o46710O63906J892924K826155L497600L956020M212678M389852M513025
$$ 364959508 364312798 364976704 366869628 369695783 373193383 377149403 381362081 385751933 390264958
1217.7C90264958M555226M576563M525274M402876M301638M191905M051864L899217
$$ 390264958 394820184 399396747 403922021 408324897 412626535 416818440 420870304 424769521
1234D24769521L714859L579706L508359L409982L356040L357798L403782L526181L633589
$$ 424769521 428484380 432064086 435572445 438982427 442338467 445696265 449100047 452626228 456259817
1252.4D56259817L732622L878772L995240M113465M211784M200935M206329M196257
$$ 456259817 459992439 463871211 467866451 471979916 476191700 480392635 484598964 488795221
1268.7D88795221M157185M171551M108429L995478L917098L771603L653467L598690
$$ 488795221 492952406 497123957 501232386 505227864 509144962 512916565 516570032 520168722
1285E20168722L472387L364683L246069L104806L035485K889097K714753K635718K501130
$$ 520168722 523641109 527005792 530251861 533356667 536392152 539281249 541996002 544631720 547132850
1303.3E47132850K386093K344429K247095K203167K133429K037704K094448K111733
$$ 547132850 549518943 551863372 554110467 556313634 558447063 560484767 562579215 564690948
1319.7E64690948K080321K121210K069890K007127J982570J897693J930892J902998
$$ 564690948 566771269 568892479 570962369 572969496 574952066 576849759 578780651 580683649
1336E80683649J728594J700938J691818J689374J752079J679838J625716J642585J565874
$$ 580683649 582412243 584113181 585804999 587494373 589246452 590926290 592552006 594194591 595760465
1354.3E95760465J569152J570403J496852J469791J331090J219750J233220J184762
$$ 595760465 597329617 598900020 600396872 601866663 603197753 604417503 605650723 606835485
1370.7F06835485J194953J178444R68277P43211K97546J42276J220763K523005K573311
$$ 606835485 608030438 609208882 610177159 610920370 611217916 611360192 612580955 615103960 617677271
1389F17677271J961768J573503J347482J172424J016438J016557J063168R87530R52541
$$ 617677271 619639039 621212542 622560024 623732448 624748886 625765443 626828611 627816141 628768682
1407.4F28768682R67801R68099J017809J047730J010597Q17537O05405O56247P06553
$$ 628768682 629736483 630704582 631722391 632770121 633780718 634598255 635203660 635859907 636566460
1425.7F36566460O97971P46786P70390Q69632R47058P25269O52314Q32855Q92640Q95440
$$ 636566460 637264431 638011217 638781607 639651239 640598297 641323566 641975880 642808735 643701375 644596815
1446.1F44596815Q13961O93381Q04245J002133R57907N25176L84033P13467R42946
$$ 644596815 645410776 646104157 646908402 647910535 648868442 649393618 649777651 650491118 651434064
1464.5F51434064Q95202J026630J285673J210391Q44240O66082O93918P84635Q45909
$$ 651434064 652329266 653355896 654641569 655851960 656696200 657362282 658056200 658840835 659686744
1482.8F59686744R36032J047372R03964O03974N86391P33137O79135M73023N23150
$$ 659686744 660622776 661670148 662574112 663178086 663764477 664497614 665176749 665649772 666172922
1501.2F66172922Q72433J104593O43432J44005K79009N48304P36773P56502P07805
$$ 666172922 667045355 668149948 668793380 668937385 669216394 669764698 670501471 671257973 671965778
1519.6F71965778N41210L07560L14534L51250M54307O43789N69105N55456Q75175P94292
$$ 671965778 672506988 672814548 673129082 673480332 673934639 674578428 675147533 675702989 676578164 677372456
1539.9F77372456J81019M7088J47044K97785M23431M75765O93261R99093O78897l88801
$$ 677372456 677553475 677600563 677747607 678045392 678468823 678944588 679637849 680636942 681315839 680927038
1560.3F80927038l93808O3896K97189K27452p9155l4035P0274l12149n95451n24878
$$ 680927038 680533230 680597126 680894315 681121767 681042612 681008577 681078851 680766702 680171251 679646373
1580.7F79646373n20349o47962q21769r21846j059830j189887j315654j505017j587987
$$ 679646373 679126024 678478062 677656293 676734447 675674617 674484730 673169076 671664059 670076072
1599.1F70076072j650989j807988j896679k011895k220810k232372k040446k173603
$$ 670076072 668425083 666617095 664720416 662708521 660487711 658255339 656214893 654041290
1615.4F54041290k550780k041519j424790j453340j421511j144588q30948j48893O80030
$$ 654041290 651490510 649448991 648024201 646570861 645149350 644004762 643173814 643024921 643704951
1633.8F43704951R79662Q41617J076937J543045K009392K440631K403260K183616K542436
$$ 643704951 644684613 645526230 646603167 648146212 650155604 652596235 654999495 657183111 659725547
1652.1F59725547K543628J786709J784325K155602K359986K190709K057910K196014
$$ 659725547 662269175 664055884 665840209 667995811 670355797 672546506 674604416 676800430
1668.4F76800430K075076J796603J750589J654684J624644J784742J844466J558721
$$ 676800430 678875506 680672109 682422698 684077382 685702026 687486768 689331234 690889955
1684.8F90889955J066863J007319J154422J211226J240790J168013J030862Q28147
$$ 690889955 691956818 692964137 694118559 695329785 696570575 697738588 698769450 699597597
1701.1F99597597O44267N94020N20110M70042N95689P91192P69496L96490N5492J27196
$$ 699597597 700241864 700835884 701355994 701826036 702421725 703212917 703982413 704378903 704434395 704561591
1721.5G04561591K99335L58343L93987N45203O17981L43084O1751J57654K15352J83940
$$ 704561591 704860926 705219269 705613256 706158459 706776440 707119524 707181275 707338929 707554281 707738221
1741.9G07738221K28822L52561M08590J90556N544J18255K25485K49028K33054J22070
$$ 707738221 707967043 708319604 708728194 708918750 708924294 709042549 709268034 709517062 709750116 709872186
1762.3G09872186J26779K73288L95476L90590J00493p7724O4253J87159K34842K06888
$$ 709872186 709998965 710272253 710667729 711058319 711158812 711081088 711145341 711332500 711567342 711774230
1782.7G11774230J42992J81436L22342L62217J74344M8101J75118K61069J94311J59025
$$ 711774230 711917222 712098658 712421000 712783217 712957561 713005662 713180780 713441849 713636160 713795185
1803.1G13795185J75655K04444K44677J83046J20103J59919J55807J50204K13027K53856
$$ 713795185 713970840 714175284 714419961 714603007 714723110 714883029 715038836 715189040 715402067 715655923
1823.5G15655923K50518K14815Q3804l6954k742O3777P4625J00672J74165N8651j93060
$$ 715655923 715906441 716121256 716205060 716168106 716165364 716229141 716303766 716404438 716578603 716637254 716444194
1845.9G16444194k30908k31206k93673l48985m63664o13034p45416q59856q24869p35521
$$ 716444194 716213286 715982080 715688407 715339422 714875758 714262724 713517308 712657452 711832583 711097062
1866.3G11097062q67784r86934q25167o24418m76182l53217k41160j09315l0398O4253
$$ 711097062 710229278 709242344 708417177 707792759 707316577 706963360 706722200 706612885 706582487 706646740
1886.7G06646740J63258J71244K26795K93970L02434L92974M99904N42760N89490N86569
$$ 706646740 706809998 706981242 707208037 707502007 707804441 708197415 708697319 709240079 709829569 710416138
1907.1G10416138N65648N74291N60343N58496N03123L84211L47793L05474K38717K35319
$$ 710416138 710981786 711556077 712116420 712674916 713178039 713562250 713910043 714215517 714454234 714689553
1927.5G14689553K07960J83523J85430J40548J24097J49965J18315N7340J3411o378
$$ 714689553 714897513 715081036 715266466 715407014 715531111 715681076 715799391 715856731 715870142 715863764
1947.9G15863764Q583k682k7239m2856p0155n3227m1067q7679j28209j72019k09928
$$ 715863764 715872347 715869665 715842426 715799570 715729415 715676188 715635121 715547442 715419233 715247214 715037286
1970.3G15037286j97530k05338k14993j69397j67668k03669j99020j87516j51575j11997
$$ 715037286 714839756 714634418 714419425 714250028 714082360 713878691 713679671 713492155 713340580 713228583
1990.7G13228583j46031j68860j64330j50383j02043r1970r6798p9989r5248r6143
$$ 713228583 713082552 712913692 712749362 712598979 712496936 712404966 712308168 712228179 712132931 712036788
2011.1G12036788m2021k1994p6950j87695l25322n95092n05805N15222J219153Q45850
$$ 712036788 711994767 711972773 711895823 711708128 711382806 710787714 710281909 710797131 712016284 712862134
2031.5G12862134M54485L83318L15130K74479K93791K92182K63095K25663J99080K15471
$$ 712862134 713316619 713699937 714015067 714289546 714583337 714875519 715138614 715364277 715563357 715778828
2051.9G15778828K15888J99675K05219J89185J59919J47284J19388J07407J23918J33157
$$ 715778828 715994716 716194391 716399610 716588795 716748714 716895998 717015386 717122793 717246711 717379868
2072.3G17379868J36733J24335J16468J20878R6977P9930J00553J06334J15097J19030
$$ 717379868 717516601 717640936 717757404 717878282 717975259 718055189 718155742 718262076 718377173 718496203
2092.7G18496203Q3030N9724O2227O8903P5042O1214N8651P6294O4254O4611P4506
$$ 718496203 718579233 718638957 718701184 718770087 718845129 718906343 718964994 719041288 719105542 719170153 719244659
2115.1G19244659N5373O0916O4492M4882M9293N2035M6134M7743K8313K4139M7565
$$ 719244659 719300032 719360948 719425440 719470322 719519615 719571650 719617784 719665527 719693840 719717979 719765544
2137.6G19765544M4644M1067M8399L6240K4140J4782Q344L7909N1260K4319K8789N1737
$$ 719765544 719810188 719851255 719899654 719935894 719960034 719974816 719983160 720021069 720072329 720096648 720125437 720177174
2162G20177174L6656l1411q0586J9849J49131J19149M4465K1279K9564N0664L2783
$$ 720177174 720213830 720182419 720101833 720121682 720270813 720389962 720434427 720455706 720485270 720535934 720568717
2184.5G20568717R655P093j9073j2219L4928M2498K9624Q821n543J3530P332j1563
$$ 720568717 720578372 720585465 720566392 720554173 720589101 720631599 720661223 720670044 720664501 720678031 720685363 720673800
2209G20673800l100j4961j0371J5438l58k086l278l5882k3127p927j7345k265p630
$$ 720673800 720670700 720655739 720645368 720660806 720660448 720658362 720655084 720619202 720596075 720588148 720570803 720568538 720560908
2235.5G20560908k8014l1173l8922l2663l8863o4849n3347l6954l1948k5332n4539
$$ 720560908 720532894 720501721 720462799 720430136 720391273 720326424 720273077 720236123 720204175 720178843 720124304
2257.9G20124304o4969k9623l3021n2870o3717o2525k1875k1696l8982j0609k7061
$$ 720124304 720059335 720029712 719996691 719943821 719880104 719817579 719795704 719774008 719735026 719724417 719697356
2280.3G19697356n4538l8207m5299l9756m5479r2149q3863p7486j16051j24633j29878
$$ 719697356 719642818 719604611 719559312 719519556 719474077 719381928 719298065 719220579 719104528 718979895 718850017
2302.8G18850017j42515j56880j91152j78754j49906j63972j80662k40743k83182k13801
$$ 718850017 718707502 718550622 718359470 718180716 718030810 717866838 717686176 717445433 717162251 716948450
2323.2G16948450j79470k15471k22206j99199j36077j42753k34664j97053j03116k1398
$$ 716948450 716768980 716553509 716331303 716132104 715996027 715853274 715618610 715421557 715318441 715297043
2343.6G15297043K41042M10735J69277k52247n28574m93168l19958k11835p6771Q6367
$$ 715297043 715538085 715948820 716118097 715865850 715337276 714844108 714524150 714312315 714235544 714321911
2364G14321911J98961K74896K81334L12329L59952L43978L46899L51251K80022J90675
$$ 714321911 714520872 714795768 715077102 715389431 715749383 716093361 716440260 716791511 717071533 717262208
2384.4G17262208J16945M5478j252m4822o9440n2511n7757o4254o0320o9380m8935
$$ 717262208 717379153 717424631 717423379 717378557 717309117 717256606 717198849 717134595 717074275 717004895 716955960
2406.8G16955960n2571p8440o7771p4088p5996n7340q4579j06633q8572p0095m5896
$$ 716955960 716903389 716824949 716757178 716683090 716607094 716549754 716465175 716358542 716269970 716199875 716153979
2429.2G16153979n6088r1254p9394o7830o8068m8936n4478q1361r7632r4772p2836
$$ 716153979 716097891 716006637 715927243 715859413 715791345 715742409 715687931 715606570 715508938 715414166 715341330
2451.7G15341330o0440p2240r5904j08302r4294p7069q2076q4996o7890p4863r9957
$$ 715341330 715280890 715208650 715112746 715004444 714910150 714833081 714751005 714666009 714598119 714523256 714423299
2474.1G14423299q5354o1095q1241j06454r8765q4817p7307p5639r1076j04188q6308
$$ 714423299 714337945 714276850 714195609 714089155 713990390 713905573 713828266 713752627 713661551 713557363 713471055
2496.5G13471055n7042p0750j17183j22488j02043r9897r2805r4115j16885j21057
$$ 713471055 713414013 713343263 713226080 713103592 713001549 712901652 712808847 712714732 712597847 712476790
2516.9G12476790j10567r8049p9274p9930q8394r7275j05977r2447r8884j17957j04189
$$ 712476790 712366223 712268174 712188900 712108970 712020576 711923301 711817324 711724877 711625993 711508036 711403847
2539.4G11403847r7215j01090r8884r6142p9334q5294j10448j01566r0838q2194p6533
$$ 711403847 711306632 711205542 711106658 711010516 710931182 710845888 710735440 710633874 710543036 710460842 710384309
2561.8G10384309j18077j31487r2328r5129j14143j14381j01686p0393r3400j41442
$$ 710384309 710266232 710134745 710042417 709947288 709833145 709718764 709617078 709546685 709453285 709311843
2582.2G09311843j29461j09554j04725j07169j17183r7811r1911j07288r4354j15037
$$ 709311843 709182382 709072828 708968103 708860934 708743751 708645940 708554029 708446741 708352387 708237350
2602.6G08237350j49429j26242j04785j10150j24454j35303j02281p9930j10030j18316
$$ 708237350 708087921 707961679 707856894 707746744 707622290 707486987 707384706 707304776 707194746 707076430
2623G07076430j10387j03891r5487j24216j44780j44303j59025j33931r8289j18374
$$ 707076430 706966043 706862152 706766665 706642449 706497669 706353366 706194341 706060410 705962121 705843747
2643.4G05843747j35124j29640Tj35660j53304j42455j12593j17123j11997r9480j26541
$$ 705843747 705708623 705578983 705449343 705313683 705160379 705017924 704905331 704788208 704676211 704576731 704450190
2665.8G04450190j42693j35363j35064j21593j17779j27852j25587j39654j44362j34111
$$ 704450190 704307497 704172134 704037070 703915477 703797698 703669846 703544259 703404605 703260243 703126132
2686.2G03126132j33991j24812j23143j23382j24395j64091j78755j41263j35183j34289
$$ 703126132 702992141 702867329 702744186 702620804 702496409 702332318 702153563 702012300 701877117 701742828
2706.6G01742828j22547j38164j35064j20282j21296j16229j32084j41263j17003j39058
$$ 701742828 701620281 701482117 701347053 701226771 701105475 700989246 700857162 700715899 700598896 700459838
2727G00459838j67787j44601j39058j37567j29640j33634j17719j26422j33574j06573
$$ 700459838 700292051 700147450 700008392 699870825 699741185 699607551 699489832 699363410 699229836 699123263
2747.4F99123263j24752j42932j41502j68859j66953j42813j34289j20342j45793j78516
$$ 699123263 698998511 698855579 698714077 698545218 698378265 698235452 698101163 697980821 697835028 697656512
2767.8F97656512j43289j20879j27494j34706j78993k00093j70410j47163j28389j31845
$$ 697656512 697513223 697392344 697264850 697130144 696951151 696751058 696580648 696433485 696305096 696173251
2788.2F96173251j72258j86324j76787j59204j41621j90019k32637k03610j83582j87576
$$ 696173251 696000993 695814669 695637882 695478678 695337057 695147038 694914401 694710791 694527209 694339633
2808.6F94339633k08616k25008j93596j86264k24829k37644k27093k04444j90020k13563
$$ 694339633 694131017 693906009 693712413 693526149 693301320 693063676 692836583 692632139 692442119 692228556
2829F92228556k26736k15710k08318k13325k89500l92496m29630m60387m86731m76420
$$ 692228556 692001820 691786110 691577792 691364467 691074967 690682471 690252841 689792454 689305723 688829303
2849.4F88829303m40061l47376k36988j37687n4777o6697j24038j37746j59323j72675
$$ 688829303 688389242 688041866 687804878 687667191 687612414 687545717 687421679 687283933 687124610 686951935
2869.8F86951935j36256j39892k05934k44200k34902k27869k53141k63750k53260k63334
$$ 686951935 686815679 686675787 686469853 686225653 685990751 685762882 685509741 685245991 684992731 684729397
2890.2F84729397k47836k24531k62260k98917k82943k69831k73287k55823k27332k24948
$$ 684729397 684481561 684257030 683994770 683695853 683412910 683143079 682869792 682613969 682386637 682161689
2910.6F82161689k67744l60251m44948m44830l83615k92659j68085k5749O7889Q1659
$$ 682161689 681893945 681533694 681088746 680643916 680260301 679967642 679799557 679773808 679841697 679923356
2931F79923356R4294R7871O0618M6611P9632J27851R3341o3121j50025q8811q3804
$$ 679923356 680017650 680115521 680176139 680222750 680302382 680430233 680523574 680460453 680310428 680221617 680137813
2953.4F80137813j69754k07782j81019j25825q6487r2208r9123p4029l1888j8954m8340
$$ 680137813 679968059 679760277 679579258 679453433 679366946 679274738 679175615 679101586 679069698 679050744 679002404
2975.8F79002404n0008l5346p5519j19686j21713r5605k3961j9610j47224k01583j72496
$$ 679002404 678952396 678917050 678841531 678721845 678600132 678504527 678480566 678460956 678313732 678112149 677939653
2998.3F77939653j93238k16365k33113k14816j09553k7716r4473k65778l54170l21031
$$ 677939653 677746415 677530050 677296937 677082121 676972568 676944852 676850379 676584601 676230431 675909400
3018.7F75909400k88725k74777k88248l29435k85089j94013j79649k67625l64124k88547
$$ 675909400 675620675 675345898 675057650 674728215 674443126 674249113 674069464 673801839 673437715 673149168
3039F73149168j57535k17735l72529m01497l07262k67506l24070l60549l76105l88205
$$ 673149168 672991633 672773898 672401369 671999872 671692610 671425104 671101034 670740485 670364380 669976175
3059.4F69976175l37362k61665k41995l08811m21822m70043l91483k38955j71363k72930
$$ 669976175 669638813 669377148 669135153 668826342 668404520 667934477 667542994 667304039 667132676 666859746
3079.8F66859746m02391m57764m83215m46379l96788m39763m87447m44412l63231l72052
$$ 666859746 666457355 665999591 665516376 665069997 664673209 664233446 663745999 663301587 662938356 662566304
3100.2F62566304m59671m69804l96072l90828m74155m65036l35514k90334m00544n83291
$$ 662566304 662106633 661636829 661240757 660849929 660375774 659910738 659575224 659284890 658884346 658301055
3120.6F58301055p01367o51956n51641n27859n51820n70237n39005m65631m77970o06895
$$ 658301055 657599688 656947732 656396091 655868232 655316412 654746175 654207170 653741539 653263569 652656674
3141F52656674o79850o45578n78821n06341m97937o26564p72715p92623p60913p45952
$$ 652656674 651976824 651331246 650752425 650246084 649748147 649121583 648348868 647556245 646795332 646049380
3161.4F46049380p22885p07447p26998p54297p69913p77006p78199q00967q21769q21471
$$ 646049380 645326495 644619048 643892050 643137753 642367840 641590834 640812635 640011668 639189899 638368428
3181.8F38368428q31545q33690q31306q70883q96335q87990r25660r59039r24587q97884
$$ 638368428 637536883 636703193 635871887 635001004 634104669 633216679 632291019 631331980 630407393 629509509
3202.2F29509509r25541r61721r58622r26792r17375r23634r26733r35555r36329r39727
$$ 629509509 628583968 627622247 626663625 625736833 624819458 623895824 622969091 622033536 621097207 620157480
3222.6F20157480r48667r44019r17017q47221q18491r48071j042426r71078q84176
$$ 620157480 619208813 618264794 617347777 616500556 615682065 614733994 613691568 612720490 611836314
3241F11836314q10265p60377q13961r12905q90433p68602p34627q06213q42214q02636
$$ 611836314 611026049 610265672 609451711 608538806 607648373 606879771 606145144 605338931 604496717 603694081
3261.4F03694081p62283p33674o67155n76734o50883q76904r55939q94844q70586q69334
$$ 603694081 602931798 602198124 601530969 600954235 600303352 599426448 598470509 597575665 596705079 595835745
3281.8E95835745q51988q52645q50737q04424q09312r46164j096487j141966j102090
$$ 595835745 594983757 594131112 593280375 592475951 591666639 590720475 589623988 588482022 587379932
3300.1E87379932r89735q75950r69886j260937j472175j474917j378774j346350j389205
$$ 587379932 586390197 585514247 584544361 583283424 581811249 580336332 578957558 577611208 576222003
3318.5E76222003j403511j378655j413584j550079j669168j679957j633346j574338
$$ 576222003 574818492 573439837 572026253 570476174 568807006 567127049 565493703 563919365
3334.8E63919365j535296j628697j787960j827181j830280j813054j705169j767576
$$ 563919365 562384069 560755372 558967412 557140231 555309951 553496897 551791728 550024152
3351.1E50024152k001405k033412j895249j843274j911282j928449j755953j621187
$$ 550024152 548022747 545989335 544094086 542250812 540339530 538411081 536655128 535033941
3367.4E35033941j765847k003372k027630j852215j697659j640857j629233j590371
$$ 535033941 533268094 531264722 529237092 527384877 525687218 524046361 522417128 520826757
3383.7E20826757j502812j325905j106382j166939j457692j457572j130521r92536
$$ 520826757 519323945 517998040 516891658 515724719 514267027 512809455 511678934 510686398
3400E10686398j282275j528442j357257j108170j036942j049340j081824j042605r25421
$$ 510686398 509404123 507875681 506518424 505410254 504373312 503323972 502242148 501199543 500274122
3418.4E00274122q65579q49336p46072n68360m68135m91023m50104l21359l68505n41210
$$ 500274122 499408543 498559207 497813135 497244775 496776640 496285617 495835513 495514154 495145649 494604439
3438.8D94604439n12720k86162p7873M351K3902N7399P0959J26183K76715L91811L49253
$$ 494604439 494091719 493805557 493727684 493732035 493755937 493813336 493884295 494010478 494287193 494679004 495028257
3461.2D95028257L41505N64099P26074N28424K49774K77132N14000P15643P11382N57929
$$ 495028257 495369762 495933861 496659935 497188359 497438133 497715265 498229265 498944908 499656290 500214219
3481.6E00214219N72920P25508P25150O69777P55072Q49545Q62121Q57890Q84295R14812
$$ 500214219 500787139 501512647 502237797 502907574 503662646 504512191 505374312 506232202 507116497 508031309
3502E08031309Q66890Q09788Q59320R61364J059353TR72212R84967J117467J237333
$$ 508031309 508898199 509707987 510567307 511528671 512588024 513647377 514619589 515604556 516722023 517959356
3522.4E17959356J172602J039565J075089J164019J203060J259268J238703J139641
$$ 517959356 519131958 520171523 521246612 522410631 523613691 524872959 526111662 527251303
3538.7E27251303J206994J381517J376211J193285J120508J182795J204133J214385
$$ 527251303 528458297 529839814 531216025 532409310 533529818 534712613 535916746 537131131
3555.1E37131131J302361J430094J462222J392543J398265J504779J490712J384020
$$ 537131131 538433492 539863586 541325808 542718351 544116616 545621395 547112107 548496127
3571.4E48496127J392782J499832J605868J712859J787602J802505J758277J661181
$$ 548496127 549888909 551388741 552994609 554707468 556495070 558297575 560055852 561717033
3587.7E61717033J613796J650930J732826J788914J811445J810431J786292J785099
$$ 561717033 563330829 564981759 566714585 568503499 570314944 572125375 573911667 575696766
3604E75696766J801074J821458J795233J788556J829565J759052J703978J747846J672626
$$ 575696766 577497840 579319298 581114531 582903087 584732652 586491704 588195682 589943528 591616154
3622.4E91616154J584112J564682J600087J577913J422167J374960J376271J355291
$$ 591616154 593200266 594764948 596365035 597942948 599365115 600740075 602116346 603471637
3638.7F03471637J356363J355290J357794J360476J301110J070798Q03351P60853R00388
$$ 603471637 604828000 606183290 607541084 608901560 610202670 611273468 612076819 612837672 613738060
3657F13738060Q84771O99580O07550O70195O92308O22391N97537M53830J74880R0599
$$ 613738060 614622831 615322411 615929961 616600156 617292464 617914855 618512392 618966222 619141102 619231701
3677.4F19231701K02238L21508M60207N97179O10054K95758j0908Q3387K63393L09587
$$ 619231701 619433939 619755447 620215654 620812833 621422887 621718645 621707737 621791124 622054517 622364104
3697.8F22364104K54631J95682K09153K42769K20895Q1420p2062p4804n6445o9678
$$ 622364104 622618735 622814417 623023570 623266339 623487234 623568654 623496592 623421788 623365343 623295665
3718.2F23295665m1247o6220k11120k42531p3910R4533J26421n1319j86384l3498J13547
$$ 623295665 623254418 623188198 622977078 622734547 622660637 622755170 622881591 622830272 622643888 622610390 622723937
3740.7F22723937P0334P7188K01463J05739j34528k09927q9348l1829q5771q7022n2512
$$ 622723937 622794271 622871459 623072922 623178661 623044133 622834206 622744858 622713029 622627258 622540236 622487724
3763.1F22487724n5552q6248j67250k05517j25587N126P1049l0578k05576k58088j78874
$$ 622487724 622432172 622345924 622178674 621973157 621847570 621852696 621923745 621893167 621687591 621429503 621250629
3785.5F21250629j24216j35421r7156m2021j3352J3292p2360j96338k40445l18289
$$ 621250629 621126413 620990992 620893836 620851815 620838463 620851755 620779395 620583057 620342612 620024323
3805.9F20024323k93672j13487k2650j15633j49011l4809j51694k81215j99199j66654
$$ 620024323 619730651 619617164 619594514 619478881 619329870 619295061 619143367 618862152 618662953 618496299
3826.3F18496299j68801j27732k0743L4333j25289k93434k72155k31087k07424j25289
$$ 618496299 618327498 618199766 618179023 618213356 618088067 617794633 617522478 617291391 617083967 616958678
3846.7F16958678j133o0200l78490l73661q2493k5213p8797j57774j77741j74940k22265
$$ 616958678 616957545 616897345 616518855 616145194 616062701 616037488 615958691 615800917 615623176 615448236 615225971
3869.1F15225971k07663j90615j64450j29282j69039j17183p3909j88888k42114k15649
$$ 615225971 615018308 614827693 614663243 614533961 614364922 614247739 614173830 613984942 613742828 613527179
3889.5F13527179k14219j60575o7353k5213o3360j99378l47971l23773k04384j62482
$$ 613527179 613312960 613152385 613085032 613059819 612996459 612797081 612449110 612125337 611920953 611758471
3909.9F11758471j23024p3374r6917j56760j70708j47164j40309j44362j56343j78099
$$ 611758471 611635447 611562073 611465156 611308396 611137688 610990524 610850215 610705853 610549510 610371411
3930.3F10371411k10166k26140j86920j20759j17123j58728j56283j65701k17318k29300
$$ 610371411 610161245 609935105 609748185 609627426 609510303 609351575 609195292 609029591 608812273 608582973
3950.7F08582973j80482j37687j28150j38402j74940k05397j79053j35719j21952j02937
$$ 608582973 608402491 608264804 608136654 607998252 607823312 607617915 607438862 607303143 607181191 607078254
3971.1F07078254j03116j40548j67429j71542j51456j40845j71960j70648j46270j83820
$$ 607078254 606975138 606834590 606667161 606495619 606344163 606203318 606031358 605860710 605714440 605530620
3991.5F05530620k11716j86384j74522
$$ 605530620 605318904 605132520 604957998
3997.6F04957998
$$ 604957998
##END=$$ End of the data block
