##TITLE=Diatomacea 1 $$ Begin of the data block
##JCAMP-DX=5.00 $$ ACD/SpecManager v 10.08
##SPECTROMETER/DATA SYSTEM=Alpha
##DATE=16 Dec 2016 08:03:44
##DATA TYPE=INFRARED SPECTRUM
##DATA CLASS=XYDATA
##ORIGIN=
##OWNER=
##NPOINTS=1765
##FIRSTX=399.77209473
##LASTX=3997.72216797
##MAXX=3997.72216797
##MINX=399.77209473
##MAXY=0.84448874
##MINY=0.32937419
##XFACTOR=1.0000000000
##YFACTOR=1.000000000000000e-9
##FIRSTY=0.70257103
##DELTAX=2.03965425
##XUNITS=1/CM
##YUNITS=ARBITRARY UNITS
##XYDATA=(X++(Y..Y))
399.8 702571034 701478958 699976444 698272884 696188569 693413258 690282643 687087893 683684826
416.1 683684826 679595113 675095558 670903325 666329086 661016285 655500948 649753809 643424094
432.4 643424094 636424303 628651023 620066583 610385537 599481881 588825464 580263376 573787689
448.7 573787689 567857385 560839295 552173674 541135550 527115583 511240065 494043946 476191133
465 476191133 458943218 444009900 433396041 428113669 427551746 429703087 433128566 437042207
481.4 437042207 440879107 444692791 449325353 455908865 464913666 475252062 485102594 493817568
497.7 493817568 501582265 508642972 514844894 520252407 525285780 530219018 535252333 540403843
514 540403843 546114981 552721381 560176730 568417907 578015029 589920163 604163468 620071352
530.3 620071352 636492670 651927710 665513933 677895606 689987063 701660395 712149858
544.6 712149858 721159339 728916645 735527039 741141617 745815516 749874949 753526151 756789327
560.9 756789327 759737372 762450576 764981091 767251790 769340158 771243751 773092449 774823785
577.2 774823785 776380777 777788699 778952360 779916286 780744612 781502485 782039464 782277346 782107413
595.6 782107413 781400383 779891908 777180672 773048162 767214298 759569347 750407219 740768850 732308388
613.9 732308388 726762772 725531936 728876591 735756874 744620621 754187644 763510644 771971464
630.3 771971464 779396474 785793126 791289628 795928478 799896061 803312659 806242764 808730304
646.6 808730304 810890675 812867165 814601004 816169322 817563653 818887472 820201516 821362019
662.9 821362019 821563601 820215106 820072472 822295010 823967218 824638188 825040638 825451434 825870216
681.2 825870216 826234400 826522589 826773584 826880753 826943815 827019513 827051520 826956034 826775670 826659322
701.6 826659322 826532602 826284111 825841427 825358450 824923635 824501395 824023485 823332667 822551131 821890414
722 821890414 821330845 820656836 819842160 818954647 817985773 816919327 815733194 814473987 813112259
740.4 813112259 811653674 810067475 808343291 806471169 804410458 802205265 799879014 797514915
756.7 797514915 795036495 792303860 789203405 785562754 781172574 775760949 769058108 760850668
773 760850668 751264095 740631819 729293227 717501402 705297172 692792058 680592299 670050859
789.3 670050859 662939250 660613954 663447022 671170831 683429480 699587822 718449533 738147974
805.7 738147974 756685913 772674918 785640299 795869946 803940833 810457230 815868080 820528865
822 820528865 824629128 828252316 831433594 834171653 836503685 838463783 840154290 841628075 842868209
840.3 842868209 843762994 844271660 844488740 844459593 844180405 843584895 842711627 841647148 840438247 839039326
860.7 839039326 837463200 835811138 834033847 832141936 830171943 828119278 826002061 823888123
877.1 823888123 821798861 819685280 817512095 815190196 812742174 810220838 807661057 805039644
893.4 805039644 802350581 799720645 797150314 794528067 791778564 788980544 786173820 783307552
909.7 783307552 780367494 777355671 774348378 771340132 768256128 765064418 761850655 758652091
926 758652091 755397558 752060294 748621404 745141983 741636276 738064229 734394431 730638385 726866126
944.4 726866126 723123968 719433367 715728521 712009668 708328068 704765558 701358020 697964430
960.7 697964430 694468975 690839589 687090814 683218956 679256976 675202072 671027660 666779339
977 666779339 662420273 657926917 653355837 648776770 644172788 639537156 634920597 630308807 625671923
995.4 625671923 620951414 616118968 611126602 605929613 600494862 594822347 589030683 583184183
1011.7 583184183 577323973 571431398 565453947 559415996 553340614 547154069 540775001 534323990
1028 534323990 527958333 521715462 515572727 509534180 503569603 497592390 491557866 485405385 478939831
1046.3 478939831 471865356 464045763 455566913 446597099 437308192 427803278 418044597 407867342
1062.7 407867342 397204220 386333525 375824302 366291225 358111590 351334393 345786333 341183901
1079 341183901 337292165 333966017 331277460 329586089 329374194 330938965 334204108 338854343 344518214
1097.3 344518214 350844473 357497722 364212632 370771348 377038002 382953525 388460398 393536061
1113.7 393536061 398187339 402407169 406187594 409577340 412637949 415406197 417963356 420495093
1130 420495093 423098534 425642669 428048521 430383414 432672292 434922814 437172443 439440876 441769958
1148.3 441769958 444217145 446759790 449356645 452046096 454835474 457713038 460693747 463802189
1164.6 463802189 467105478 470663339 474500328 478640974 483130842 487941265 493024617 498340786
1181 498340786 503713071 508846521 513363481 516765118 518544674 518559694 517234921 515481353 514322340
1199.3 514322340 514401317 515861154 518478394 521930754 525954664 530359685 534998536 539757013 544571877
1217.7 544571877 549364269 554075599 558680177 563145697 567439079 571542442 575444639 579133034
1234 579133034 582638800 585991621 589232743 592409551 595513105 598569572 601639807 604769349 607979596
1252.4 607979596 611259341 614606917 618006647 621453166 624929607 628383756 631777823 635139048
1268.7 635139048 638533115 641926289 645273268 648563862 651770473 654849410 657808959 660687923
1285 660687923 663457632 666095853 668589354 670983016 673293650 675495327 677588761 679556489 681428313
1303.3 681428313 683228850 684967697 686616719 688188434 689740658 691285193 692843378 694417477
1319.7 694417477 695991993 697536469 699060440 700559020 701999009 703389704 704733253 706018686
1336 706018686 707234740 708467066 709760427 711059809 712330043 713529468 714687705 715820074 716938436
1354.3 716938436 718049228 719115376 720129073 721071243 721958816 722779036 723527491 724204957 724797964
1372.7 724797964 725314140 725743949 725913823 725401878 724696755 725370765 727863550 730590522 732375801
1391.1 732375801 733527839 734409869 735197783 735957205 736709833 737446725 738181353 738920391 739617348
1409.4 739617348 740318120 741022229 741708696 742325664 742870986 743392766 743861198 744309127 744740725 745184362
1429.8 745184362 745673597 746179402 746714532 747319877 747958839 748559833 749147177 749698222 750203073 750709414
1450.2 750709414 751191497 751604021 751865864 752169490 752709389 753352225 754035056 754802644 755638778 756416321
1470.6 756416321 757198751 758031547 758831739 759556353 760230720 760910571 761560321 762171984 762746036 763310194
1491 763310194 763817668 764227748 764610589 765034974 765509188 765940428 766259551 766636372 767198384 767740309
1511.4 767740309 768198907 768601120 768965840 769290805 769583344 769952834 770363331 770736933 771111667 771430492
1531.8 771430492 771697521 771983385 772175908 772272050 772518098 772860050 773136199 773362100 773526549 773636520
1552.2 773636520 773711205 773690522 773469329 773329318 773440480 773442805 773298442 773005545 772604465 772240996
1572.6 772240996 771677315 770811319 770009816 769173086 768036544 766656041 765052438 763189733 761080801
1590.9 761080801 758760571 756249785 753563225 750715494 747704625 744549215 741295934 737885177
1607.3 737885177 734257877 730551124 726913214 723029077 719156861 716519535 714600623 712624371
1623.6 712624371 710825264 709287822 708112240 707770467 708459675 710196555 712462783 714839458 717530668
1641.9 717530668 720601916 724409282 728749335 732484162 736511230 741740525 745998561 749419212
1658.2 749419212 752874613 756449819 759828925 762653232 765238762 767836809 770129323 772221744
1674.6 772221744 774300575 776123703 777656078 778992951 780429721 781888366 783101439 784169853
1690.9 784169853 785059452 785758078 786363423 787046611 788022518 789009750 789728045 790349603 790947914 791485190
1711.3 791485190 791953743 792318225 792652011 793126643 793645680 794059217 794395328 794700384 795016229 795278549
1731.7 795278549 795451283 795719564 796031892 796303928 796630263 796977639 797290802 797577262 797814846 798066854
1752.1 798066854 798340201 798578501 798787475 798957646 799112022 799334645 799587250 799773693 799840331 799902976
1772.5 799902976 800161421 800476670 800707996 800891399 801079273 801278055 801481068 801672399 801791131 801908255
1792.9 801908255 802107811 802311480 802493095 802702904 802939713 803151846 803328693 803472340 803606331 803775728
1813.3 803775728 803959429 804118395 804260015 804406643 804532111 804638088 804734290 804803908 804917693 805044889
1833.7 805044889 805111825 805170417 805255651 805283844 805210412 805174768 805162251 805057347 804868162 804622769 804303706
1856.1 804303706 803880095 803362310 802780926 802189648 801567912 800910592 800354838 799946606 799593329 799288511
1876.5 799288511 799089670 798963130 798872769 798847139 798907280 799015045 799166560 799379706 799630046 799911380
1896.9 799911380 800214171 800548553 800912619 801294327 801705658 802135468 802555621 802942336 803291619 803595543
1917.3 803595543 803867161 804115772 804315627 804483533 804644406 804792106 804895639 804959953 805026948 805095434
1937.7 805095434 805154383 805198491 805230439 805237889 805206478 805160344 805123568 805102944 805071473 805019736 804951549 804861486
1962.2 804861486 804756522 804640591 804516315 804369867 804220378 804087281 803946912 803789318 803630888 803488314
1982.6 803488314 803361714 803254783 803138494 803005815 802888989 802783012 802677572 802578747 802493274 802428603
2003 802428603 802386582 802345991 802296758 802252054 802208960 802168846 802099407 801908135 801558495 801015735 800614059
2025.4 800614059 801040471 802047789 802816570 803250849 803575575 803872943 804164529 804422200 804633975
2043.7 804633975 804831624 805030286 805226862 805434048 805645645 805846334 806043148 806229949 806394219 806544483
2064.1 806544483 806684673 806812882 806929767 807063162 807225645 807400167 807573974 807730317 807891190 808092237
2084.5 808092237 808296323 808461189 808622181 808798730 808956504 809083939 809215963 809373677 809528172 809673071
2104.9 809673071 809825420 809971869 810093760 810207784 810346603 810492635 810618877 810738087 810859680 810991704
2125.3 810991704 811126471 811251879 811376810 811510801 811654150 811781168 811873019 811947823 812045097 812156558
2145.7 812156558 812258840 812365115 812464833 812551856 812645435 812762141 812895119 813016772 813091874 813093722 813049436
2168.2 813049436 813108087 813352406 813609183 813759029 813854516 813957751 814077318 814177692 814257681 814324975
2188.6 814324975 814393640 814474583 814559937 814643264 814723134 814805269 814879954 814952135 815022230 815090775 815156519
2211 815156519 815218449 815289557 815349877 815396428 815424562 815456986 815520942 815579534 815626442 815667570 815709412 815755427
2235.5 815755427 815808535 815853953 815872967 815899134 815934300 815951228 815940440 815938354 815966189 815995336 815988421 815941095
2259.9 815941095 815919578 815931082 815939665 815944433 815971136 816018224 816058993 816107035 816161335 816224337 816287935 816308022
2284.4 816308022 816253185 816142738 816002309 815838516 815678596 815511882 815321624 815098822 814806402 814421952
2304.8 814421952 813945532 813415170 812913001 812499106 812079012 811461151 810613751 809750617 809117615 808662057
2325.2 808662057 808133364 807511926 807019830 806693494 806318104 805866480 805505216 805377781 805766165 807097852
2345.6 807097852 808630705 808879316 807556808 805630922 804087698 803134620 802773535 802959442 803577185
2364 803577185 804563284 805845380 807297170 808833241 810407996 811971307 813479006 814836562 815914929
2382.3 815914929 816679299 817166746 817430556 817543626 817584455 817613006 817637026 817640722 817634583 817637265 817646801
2404.7 817646801 817649484 817638695 817631841 817642212 817643344 817620695 817593753 817564249 817544460 817556024 817574441 817585289
2429.2 817585289 817606509 817619145 817605197 817587018 817575395 817569554 817565084 817561328 817565262 817567706 817554235 817533672
2453.7 817533672 817533672 817530394 817506671 817498982 817494869 817476869 817471683 817477345 817469478 817442536 817409515 817390680 817380667
2480.2 817380667 817369103 817370594 817375302 817359746 817327857 817287803 817251146 817238152 817243218 817239344 817233324 817226589 817200065
2506.7 817200065 817166328 817132592 817099452 817078948 817049325 817014039 817024946 817053556 817035496 816991448 816960692
2529.2 816960692 816941798 816918910 816888630 816860259 816843987 816832125 816808164 816778302 816743791 816707432 816688240
2551.6 816688240 816679776 816660345 816634476 816619873 816603005 816574216 816546857 816529930 816514552 816490591 816478372 816480219
2576.1 816480219 816469371 816439033 816401482 816364467 816330016 816307366 816285074 816240549 816191316 816176176 816181600 816156387
2600.5 816156387 816108644 816080034 816063583 816033304 815985143 815929115 815886140 815851450 815807998 815779507 815778553 815773129
2625 815773129 815750420 815714955 815663040 815618515 815599442 815564990 815490246 815414131 815368235 815334022 815280497 815207839
2649.5 815207839 815146983 815116823 815096259 815064251 815035641 815023243 815006971 814969420 814917922 814859569 814807057
2671.9 814807057 814765573 814723909 814697146 814690709 814678311 814635277 814561784 814487278 814436257 814398408 814360023 814327061
2696.4 814327061 814295590 814257026 814206898 814154446 814119637 814073205 814003825 813952506 813913524 813858330 813801765
2718.8 813801765 813779712 813787401 813777804 813720763 813634098 813564181 813524961 813493371 813459277 813415289 813363671 813325047
2743.3 813325047 813319206 813325822 813272834 813156843 813059509 813006639 812953413 812873065 812790513 812737405 812707901 812668264
2767.8 812668264 812619567 812599778 812602699 812559724 812428296 812281489 812191606 812140822 812123895 812126040 812069297
2790.2 812069297 811935723 811817586 811747968 811655462 811503947 811352015 811242104 811150610 811064422 810931146
2810.6 810931146 810741365 810560942 810413480 810305178 810216427 810118198 810001314 809884071 809769809 809655726
2831 809655726 809549272 809439719 809330940 809121251 808728993 808272779 807842195 807402849 806948006 806561768
2851.4 806561768 806311607 806207597 806258023 806385517 806432128 806382954 806326330 806276441 806246579 806269825 806259274
2873.8 806259274 806102991 805900693 805772066 805664241 805526018 805371404 805218399 805048525 804877460 804744422
2894.2 804744422 804606259 804414988 804212570 804037154 803858042 803643525 803402662 803192496 802962422 802553892
2914.6 802553892 802001417 801473677 801079035 800879002 800876260 801047266 801318169 801542461 801692128 801862597
2935 801862597 802063107 802300513 802627504 802972138 803180099 803194821 803128421 803102493 803081870 803007543 802938759
2957.5 802938759 802939951 803002298 803070605 803118408 803185940 803297043 803485811 803709388 803847432 803944111 804041207
2979.9 804041207 804034591 803901792 803773046 803729594 803790987 803888500 803868055 803771913 803655684 803502381 803374648
3002.3 803374648 803280711 803212166 803244531 803386092 803467929 803359270 803109229 802838445 802589774 802385867
3022.7 802385867 802233696 802049220 801887870 801818252 801752150 801588058 801354229 801208794 801149726 801027238
3043.1 801027238 800764859 800435841 800184488 800012410 799808025 799561203 799292624 799002349 798762798 798600256
3063.5 798600256 798477948 798269451 797908127 797549665 797318041 797259331 797281027 797134995 796791911 796423793
3083.9 796423793 796069145 795738161 795440197 795061707 794608772 794224799 793962598 793704867 793338418 792956054
3104.3 792956054 792687953 792473137 792123377 791735649 791546345 791415334 791098535 790555835 789884865 789258420
3124.7 789258420 788778424 788382113 787943840 787443697 786972761 786606431 786232889 785658717 784942329 784288526
3145.1 784288526 783764660 783354819 782974899 782405853 781603217 780792236 780085087 779426873 778749287 777995944
3165.5 777995944 777191341 776408434 775625169 774803460 773949564 773074210 772209048 771325707 770380497 769411981
3185.9 769411981 768468916 767516732 766503930 765444875 764349282 763218343 762090743 760988235 759906173
3204.3 759906173 758836925 757747173 756651223 755574763 754466116 753323376 752181709 751024067
3220.6 751024067 749840260 748649061 747460485 746282935 745145857 744013488 742787421 741496921
3236.9 741496921 740249813 739039958 737876892 736830056 735795796 734648943 733519435 732558072
3253.2 732558072 731679380 730742753 729772210 728849590 727999151 727189064 726430297 725739419 724948883 723974764
3273.6 723974764 722960293 721981287 721001625 719986677 718945980 717892170 716824293 715777934 714696169
3292 714696169 713440180 711995006 710422099 708846748 707413912 706092358 704606712 702728212 700581133
3310.3 700581133 698415875 696290195 694086790 691800892 689553738 687357426 685091734 682574987
3326.6 682574987 679813385 677017033 674285948 671606183 668918252 666040957 662908375 659660637
3342.9 659660637 656356990 653062940 649862885 646523237 642840147 639038622 635361016 631787717
3359.3 631787717 628146708 624433219 620889127 617482960 613865912 609950960 606071651 602514625
3375.6 602514625 599238396 596118629 593090951 590183794 587497711 585104704 582980514 580817282
3391.9 580817282 578385293 576038778 574149370 572447836 570399165 568067968 565961659 564176500
3408.2 564176500 562503099 560849428 559199750 557618082 556242704 555036485 553904891 552938402
3424.5 552938402 552233279 551734447 551305234 551013529 550932348 550809205 550551951 550462365 550708175 551203728
3444.9 551203728 551836908 552496195 553226531 554142833 555220127 556416214 557709694 558995008 560320020
3463.3 560320020 561929882 563733637 565240502 566345394 567504466 568965375 570632756 572286963
3479.6 572286963 573771358 575277030 576943815 578573227 580132067 581795216 583562255 585330665
3495.9 585330665 587033868 588762999 590604067 592372119 593982995 595688581 597646773 599734843
3512.2 599734843 601732433 603602350 605511546 607579410 609808922 611970723 613941610 615962207
3528.5 615962207 618127584 620344222 622646809 624947667 627114713 629348755 631785512 634254813
3544.9 634254813 636531770 638659537 640869915 643209219 645592988 648055434 650614321 653152168
3561.2 653152168 655584574 658086836 660943329 663910985 666678965 669395924 672240496 675293565
3577.5 675293565 678551972 681835055 685011446 688204110 691544890 694871545 698046625 701298296
3593.8 701298296 704721630 708184183 711640000 715035856 718263209 721387029 724677205 728064239
3610.1 728064239 731317282 734423459 737301767 740205824 743290365 746048689 748303235 750363708
3626.4 750363708 752875447 755702376 757998645 760003150 761981606 763844609 765602350 767193854
3642.8 767193854 768493593 769705474 771309137 773028851 774160624 775045097 776225388 777360678
3659.1 777360678 778112233 778679669 779188514 779561818 779961765 780416310 780564785 780736744 781228065 781721413
3679.5 781721413 782237649 782769918 783276737 784033835 785039246 785874128 786526203 787098110 787550867
3697.8 787550867 787912667 788309991 788719356 788981199 789132655 789374530 789879978 790363610 790517509 790470958
3718.2 790470958 790403008 790401518 790485024 790613174 790663302 790604293 790648758 790977240 791484416 791791379 791594267
3740.7 791594267 791202784 791331530 791656137 791615844 791706264 792054236 792207301 792160869 792206109 792385936
3761 792385936 792464554 792446256 792381763 792320549 792397261 792501807 792502403 792469501 792482197 792479575 792437434 792436779 792458773
3787.6 792458773 792440295 792358935 792233109 792178810 792119503 791936100 791917861 791959226 791862130 791937530 792078197
3810 792078197 791967273 791698694 791610122 791595399 791514635 791647434 791765034 791729569 791680098 791569471 791449964
3832.4 791449964 791358888 791238010 791193962 791235864 791272104 791336417 791325450 791080594 790609300 790361166 790741920
3854.9 790741920 791061819 791038036 790868282 790717244 790681720 790552199 790388048 790442228 790535867 790584385
3875.3 790584385 790536821 790437639 790473402 790514112 790528417 790480614 790290594 790209353 790250063 790176809 790062726
3897.7 790062726 790013015 789968848 789975047 790050924 790060937 790010035 789949179 789839506 789766073 789811671 789840877
3920.1 789840877 789758503 789683223 789690256 789687693 789671659 789703250 789744139 789759934 789741874 789671898 789607227 789578378
3944.6 789578378 789537847 789506376 789478958 789431393 789408922 789424956 789436936 789411604 789360523 789299369 789253294
3967 789253294 789250433 789256692 789262652 789299309 789312899 789262116 789234877 789256096 789242566 789193869 789153576 789125919
3991.5 789125919 789117277 789120197 789076746
3997.6 789076746
##END=$$ End of the data block
