##TITLE=$$ Begin of the data block
##JCAMP-DX=5.00 $$ ACD/SpecManager v 10.08
##SPECTROMETER/DATA SYSTEM=16PC
##DATE=Mon Sep 23 15:51:20 2013
##DATA TYPE=INFRARED SPECTRUM
##DATA CLASS=XYDATA
##ORIGIN=
##OWNER=
##NPOINTS=3601
##FIRSTX=400.00000000
##LASTX=4000.00000000
##MAXX=4000.00000000
##MINX=400.00000000
##MAXY=43.27914810
##MINY=21.43239975
##XFACTOR=1.0000000000
##YFACTOR=0.000000100000000
##FIRSTY=35.86378098
##DELTAX=1.00000000
##XUNITS=1/CM
##YUNITS=TRANSMITTANCE
##XYDATA=(X++(Y..Y))
400 358637810 346987724 345192184 346421967 352348785 365677338 376478920 371171722 363416443
408 363416443 365057716 367958794 367650261 364972343 357616653 350557556 346631279 349941483 372713814
417 372713814 393417358 389552345 376249771 358771553 344225388 345063705 350513916 352846603
425 352846603 355384598 359254608 363315582 368228683 369711647 360101929 350201607 351165314 354270706
434 354270706 353023071 351893196 355107803 356903534 350754509 343174438 339586716 336735229 331654053
443 331654053 328892479 332931290 341007004 353785744 365457535 369252930 368713379 364133377 358484039
452 358484039 354539146 353184204 357982635 363672714 365608940 365504990 363394241 359669456 354299088
461 354299088 348587761 343217392 340022316 341983337 346342545 351623077 356961746 361469994 363744278
470 363744278 361413231 356488724 348193893 342521667 347723007 356244583 362553368 368835678 376523743
479 376523743 382343750 382197609 379987259 378151665 376979828 378227692 379932175 379984131 380573997
488 380573997 384126663 387828369 389765244 389660606 385497322 380579948 378527870 376378784 370488663
497 370488663 366520157 371224899 377692451 380614510 381935349 381954918 380295525 376073112 371106148
506 371106148 366199493 363508224 366646996 372040977 377618790 382483253 385113716 385309219 381654015
515 381654015 376271973 370116463 365280609 365165253 366800079 368380051 369810104 370252380 370128403
524 370128403 369637718 368608017 366703262 364612350 362642288 361601830 362749100 365041962 368430367
533 368430367 371193390 371502647 369629631 364130478 358319778 355098000 354260445 357091179 362023354
542 362023354 369042625 374774933 374758949 372241516 368853073 364980927 361414680 358575363 356930733
551 356930733 357128868 360859146 365462074 368767242 370995522 371676216 370711823 367091179 363084793
560 363084793 360853920 359714508 359877815 360816498 362432480 363648186 363221664 361545792 358315239
569 358315239 354380608 349812279 346645126 347992401 350686302 352053642 353722343 357229004 360172501
578 360172501 360273361 358701706 355330238 351769447 349570274 348783493 350229263 353147964 357363930
587 357363930 361945381 366488457 369233360 367089043 363644371 361861954 360527039 358984222 358517151
596 358517151 360956192 364002686 366115799 366849670 364510307 361297836 359229813 357156982 353554230
605 353554230 351563950 355357666 360320816 362960815 364083290 362579803 360696564 361022720 361417313
614 361417313 360070000 358576546 357507706 358125458 362696877 368776321 375301361 380388718 381313553
623 381313553 379537582 374466896 369540215 368640671 369837990 372751961 376612892 381193619 384483337
632 384483337 383958588 380929947 374780426 368769150 366428375 366321106 368465424 372025261 376629829
641 376629829 380898476 383133659 383911858 383472672 381128311 374941597 368896713 366610527 367244949
650 367244949 372088928 378377190 384449005 388277054 385931740 381457100 377841492 374320030 370383263
659 370383263 368253479 370888481 375571251 379095535 385884514 405989418 419318695 400761375
667 400761375 375427017 360759964 354644051 365223885 379161110 383314857 385234108 389177322
675 389177322 391873360 390868912 387965927 383610001 379415512 377144089 376797180 379546661 383641014
684 383641014 388255844 391780128 391719589 389899750 387218475 383964539 380320778 377500076 376864662
693 376864662 378148804 382469635 387039413 389172058 389676819 388219109 385543098 382126808 378430367
702 378430367 374525528 372054329 373475571 376410255 379658699 382142067 382382622 380376358 374172211
711 374172211 368132591 366543770 367680054 371597290 377235641 384214401 390549431 393838882 394953003
720 394953003 393597832 390861740 387372017 384216537 382619858 382798195 386040688 390350800 394343872
729 394343872 397471428 398513069 398100128 396240463 393583298 390206833 387831192 388866196 391318092
738 391318092 394007187 396901627 399919052 402027130 402034302 400335083 396032791 391806831 390186081
747 390186081 390724182 394619713 399466286 403595200 405988693 404182434 400844574 397849808 395112038
756 395112038 393138885 392022858 392029533 393145561 395948410 398930321 400823822 401483765 400106430
765 400106430 397397766 393208008 389299164 387441864 387458572 390423775 394351730 397684326 400209427
774 400209427 401035767 400641937 398917923 396737823 394798737 393521309 393671265 394909134 397320747
783 397320747 400393486 404286156 407067528 406467667 403658142 398081779 392654877 390367050 390438805
792 390438805 393833618 398310165 402108688 404745331 404977798 403321991 399330368 394648552 390265236
801 390265236 387702484 389622688 393591881 398528595 403036575 405140877 405494919 403955002 400935898
810 400935898 395864716 391559601 391130447 393127899 397742996 403162460 408196945 411164055 408970833
819 408970833 404659729 399738083 395714760 395419350 396394005 396905174 397607346 398521423 399812241
828 399812241 402306786 404039154 402898560 400143127 395780563 391451607 388842583 387824554 389375458
837 389375458 391858330 394079933 395686150 395880928 394795189 391905060 388376236 384858131 382375259
846 382375259 382517815 384238243 387564659 390859604 392485619 392467270 389719009 385932922 382382164
855 382382164 379236946 376788864 375945091 378569832 382081757 384577522 385883789 384994507 382503738
864 382503738 377907028 373491287 371903419 371555557 371938248 372461548 372208595 371651421 371043930 370123367
874 370123367 368524094 366808891 365145683 364353638 365528831 368008118 371751328 375983238 379848938
883 379848938 383545151 387346039 390161743 390587807 389839630 388270149 387062073 387972107 389628410
892 389628410 391344795 392818451 393516541 393440704 392189484 390436630 388668785 387044449 385651817
901 385651817 385185013 386849899 389197121 391357193 392796021 392523537 391038437 388223419 384936562
910 384936562 381768951 379402161 379035950 379705887 380940666 382460823 383979340 385044327 385153770
919 385153770 384171486 381119957 378018379 376711845 376744041 378718147 381300926 383500099 384895782
928 384895782 384496460 383025169 380582809 378044357 376302490 375403175 375743866 377161026 380142670
937 380142670 383130074 384574432 384930840 383790245 382193336 381133308 380342712 379710922 379759560
946 379759560 381260376 383352051 385726204 387491951 387488861 386216393 383415222 380201569 377577286
955 377577286 375626068 374949226 374995461 375649948 376201859 375889549 374749184 372279167 369331589 366581917
965 366581917 364057770 362029305 360443573 359358063 358709793 358747253 358593216 357466698 355325470
974 355325470 351420898 347089539 343474617 340405960 338083725 336537361 336070557 336059570 336166382
983 336166382 335834732 334163666 331846237 329047699 326449890 324814568 324065437 324608803 325756302
992 325756302 327055435 328204880 328855515 328695755 326953888 324660797 322492142 320739021 320086250
1001 320086250 320028534 320330620 320866089 321668854 322021713 320965042 319258461 317040672 315211525
1010 315211525 314999104 315554142 316498985 317644348 318707237 319589615 320241470 320235977 318713188 316919556
1020 316919556 315806389 315399170 316549778 317728043 317087650 316425800 317294121 318579674 319926491
1029 319926491 320615044 319199791 317501793 316978931 317272911 318836441 320693970 321819077 322817078
1038 322817078 324146729 325218658 325543633 325279694 324130554 322969208 322583199 322931747 324465981
1047 324465981 326497574 328557510 330437660 331845284 332563400 332016945 330984344 329750786 329218140
1056 329218140 330807915 333246460 335822334 338270416 340005417 341273308 342234116 342559090 341637611
1065 341637611 340471497 339849701 339797974 340883713 342270622 343430519 344002953 343368759 341772537
1074 341772537 338915329 335807343 333240280 331569214 331748009 332768440 333973656 335260162 336451759
1083 336451759 337106934 336510429 335307350 333652725 332299232 332205544 332907448 334383965 336264114
1092 336264114 338380814 340097885 340616951 340257416 338855972 337059746 335283279 334060669 334286919
1101 334286919 335290680 336899757 338510971 339499969 339756737 338697891 337119331 335545769 334205399
1110 334205399 333535194 333430061 333990822 335036507 336602211 338140717 339073181 339527588 339365234
1119 339365234 338804245 337791901 336999893 337189674 338038445 339682579 341505775 343027115 343976021
1128 343976021 343655090 342863083 342103958 341563721 341617126 342200775 343504410 345143089 346994858 348457565
1138 348457565 348737259 348285904 347183685 345751762 344210625 342940102 342449417 342569351 343524475
1147 343524475 344642410 345347404 345571060 344955215 343791237 341907959 340332260 340249290 341011047
1156 341011047 342569351 344307671 345550766 346424103 346858253 346758842 345860252 344605217 343161583
1165 343161583 342088470 342028847 342895737 345097542 347789764 350387115 352518082 353357086 353681564
1174 353681564 354052315 354290733 354206543 354394455 355591278 357177010 358821411 360391159 361686935
1183 361686935 362573166 362748871 362507820 361855507 361355057 361653328 362502098 364141693 365751266 366455803
1193 366455803 366656532 366535187 365874519 364285469 362465134 360868912 359830856 360054970 360884438
1202 360884438 362017136 363091240 363621483 363672714 363040924 362045517 360850334 359714966 358961563
1211 358961563 358565559 358637810 359090576 360013733 360982666 361639481 361870537 361263275 360353470 359427223
1221 359427223 358820915 359178085 359860916 360451698 360933762 361132126 361102829 360905151 360351562 359066734
1231 359066734 357671013 356621246 356030960 356288910 357023697 358165512 359198341 359465103 359319229
1240 359319229 358948936 358189583 356535187 355196457 355605850 356591949 357350121 358212967 359505882
1249 359505882 360442162 360040665 359206429 358443031 357973099 358370552 359081726 359889259 360355835 359751205
1259 359751205 358733902 357728233 356703758 355760117 354931107 354125748 353816032 354678154 356008072
1268 356008072 357402573 358633041 359235764 359509468 359657516 359500160 358804474 357930679 357101440 356493225
1278 356493225 356333008 356688995 357926140 359379768 360611191 361305008 360828171 359691391 357954025
1287 357954025 356334686 355681915 355662575 356344223 357371559 358666420 359463692 358568420 357191086
1296 357191086 356299896 355424156 354141235 353274841 353738327 354838867 356338959 357784271 358703384
1305 358703384 358906746 357603798 356124420 355903625 355833511 354921570 354254723 354739418 355922470 358147621
1315 358147621 359928856 359480629 358044624 356003761 354146729 353682518 353733063 353753586 353950500 354390373
1325 354390373 354948044 355696182 356104355 355523834 354381332 352569580 351040611 350822906 351579437
1334 351579437 353954773 356029510 355884323 354161987 349866867 345994720 346297035 347508659 347057114
1343 347057114 346615791 347307663 348209152 348662148 348989258 349398842 349573593 349359970 348472366 346147079
1353 346147079 343663445 341964951 341293793 342564812 344701538 347992897 349253883 343485603 336418610
1362 336418610 332302818 330581665 333727608 336903343 334132919 331303825 333572617 337154846 340897789
1371 340897789 342061539 335070610 327279091 325586777 325777779 325774918 326058388 326306572 326845169 327761421
1381 327761421 329446068 333628426 336379051 333051682 327523232 321151962 316846123 319140663 324511299
1390 324511299 332876930 338440666 331742783 323688507 324861526 326765289 322862167 317855606 313469162
1399 313469162 312102795 319937935 327351799 324000854 318227291 315422783 314094772 315488815 316778908
1408 316778908 314631233 311814537 309767723 309145451 311526070 315574417 322465668 326247215 318804512
1417 318804512 307797909 296604385 289957275 298475742 307876816 302901745 297097435 301951180
1425 301951180 308381557 310674667 310214996 304493675 299476624 301530609 306944370 317172527 323082428
1434 323082428 310575962 296001911 293267479 295597553 302448044 309032917 308284035 306502342
1442 306502342 308824310 311674843 313418617 313371658 308181534 304214706 309332371 315696239 314856758
1451 314856758 316508770 334983597 347918739 329253922 304413795 291484356 286421299 293447018
1459 293447018 305844784 321051369 330828171 320492249 306813011 303225040 305049171 313284149
1467 313284149 324328918 337929726 345041504 329980125 312406769 310645828 313021660 312840939
1475 312840939 313478470 316565037 320637703 325274696 328983307 328410149 328712463 336235046 344058990
1484 344058990 346547356 346198311 344118576 338843346 325181503 315418015 324403763 339249611
1492 339249611 353817940 362702866 353862305 341064682 335376015 332860947 332280159 336608887
1500 336608887 350010872 367680779 393567314 405571938 368375778 325586090 315483818 318728218
1508 318728218 331595650 345513115 346078148 347052345 363816490 377109985 364474297 350884209
1516 350884209 360891113 373305550 373625031 366338959 344458084 327914734 344577332 363647232
1524 363647232 355781097 344480972 346173782 352741013 363606224 372569084 371912231 365608673
1532 365608673 348725548 340262642 368727188 400663834 409954796 403090973 367863159 334252853
1540 334252853 338091621 349615822 345774651 342258224 350044975 360219002 367515793 371958237
1548 371958237 369383812 367081413 373897552 380995255 377150040 378368835 411704559 432791481
1556 432791481 387065430 332173119 312792053 313264847 341725845 371474762 369655151 362869987
1564 362869987 371972809 381354103 381204834 374976654 356880646 344826698 363108864 386782417
1572 386782417 399705429 399762878 368952980 338791351 343166122 356957664 365380058 371317863
1580 371317863 371183395 369604568 371064186 372408638 371238708 369772415 369907608 370203743 369306107
1589 369306107 368853798 370946884 372845650 371763458 369941483 368741760 368011246 368380547 368860474
1598 368860474 368561516 367814560 366258392 365077019 365828285 367028465 367915649 367879868 365564804
1607 365564804 362447968 358610611 356884460 360912323 368339310 383107681 389966965 365006676
1615 365006676 338145981 336217155 344569931 361563187 374998093 366438866 352953186 346072922
1623 346072922 343968163 352636566 360127678 350967407 341723671 346791496 357212067 371057281
1631 371057281 381627083 381403427 370908966 339272995 313156128 325917015 346590996 350399475
1639 350399475 352142563 359921455 369052429 381392479 385419121 360763779 335819702 334935913
1647 334935913 349873314 394416580 426840782 392724762 343939056 315685501 303546181 323002090
1655 323002090 349555511 359629135 365942230 376801491 381863823 367297401 351871948 352722168
1663 352722168 360920181 376806259 389710655 385929565 374904633 356641541 345741043 367720833
1671 367720833 389835129 379071007 361744156 354007721 353334656 366431465 381749878 386004944
1679 386004944 391110191 416283607 426326294 369765511 314638615 330539932 361323853 368121643
1687 368121643 368695984 365379562 365591507 383147469 401188622 405842781 401964417 383318672
1695 383318672 369299393 391495705 407084961 363806000 321562042 338629227 367627373 376793633
1703 376793633 377550583 366841545 356339684 360287895 367919464 372010460 376171837 382310410
1711 382310410 388313065 394424896 395477524 384145508 367144585 344353447 328957787 341726532
1719 341726532 359786034 363920441 363924255 362280617 361706238 367863426 374396553 374984970 375183334
1728 375183334 379354248 384751091 395795822 395343056 351165543 312927246 336749802 371031265
1736 371031265 376348038 372283707 363238335 355338593 359565506 365754852 364839783 364507675 372467766
1745 372467766 379584084 377669334 371584396 361938248 353296280 350660553 353329887 366518974
1753 366518974 377481003 369152298 359696884 366049995 374833336 378074417 376490822 363372078
1761 363372078 353028297 363455772 376884460 378401527 377428513 379049072 381362457 387030373
1769 387030373 387449036 368067513 349385757 352244377 361068954 366034508 370729904 376929054
1777 376929054 380251656 373323441 366900444 373534203 380463600 375567665 369476089 369756470 373472214
1786 373472214 381995926 389964600 393061409 389517555 370231628 352881660 357555389 367919464
1794 367919464 373254547 376805534 378540764 377568474 371206741 364794960 363597412 365154037 369536171
1803 369536171 374411087 377106438 378710518 379886856 379235268 374126892 368909607 367551079 368560333
1812 368560333 372924080 377176514 377120018 375936279 375490417 375534058 376296539 378207436 383748779
1821 383748779 386990547 378826866 371264954 377337227 384862442 385030518 380758743 368617287 358835220
1830 358835220 364767303 373606186 375089188 374934692 375857353 376603127 375565300 376514435 385501137
1839 385501137 394075851 395707130 390690575 371635437 355066299 360998154 371567726 373010635
1847 373010635 373042107 375739326 378249168 378622284 378222466 377801666 377245674 376643410 376134148 375821342
1857 375821342 375898361 376755486 377905121 378628235 380008469 383719215 387271881 389559517 388108482
1866 388108482 376793861 365462799 363632927 366164207 372331848 378405800 379257202 378357658 377537727
1875 377537727 376589050 375848045 375507584 375911484 376941681 379119415 380868912 379644165 378874550
1884 378874550 383228073 386442909 381725540 375339050 370917320 369554062 376201630 382916946 381210785
1893 381210785 377671471 376659393 376367569 376519928 376881828 377080688 377251854 377247086 377543449 378867874
1903 378867874 380320778 381420593 381637573 379860878 377350578 374547958 372797737 374032021 376927376
1912 376927376 381759872 385659943 385252953 382328262 375847092 370918045 375254402 380003204 376462708
1921 376462708 371889114 371403923 372706413 375832787 378892441 379475822 379174461 378875504 378282547
1930 378282547 377156258 376209488 376284828 376750221 376930237 377796631 380803337 383825531 385700226
1939 385700226 384993553 377513657 370371094 371384125 374237061 374253273 374332886 376527557 378705025
1948 378705025 378934402 378660927 379093170 379009972 376903305 374840012 374887466 375535507 375744820 376166840
1958 376166840 377347717 378561974 379152298 379457474 379977951 379568558 376278877 373022308 372493286
1967 372493286 373397102 375859489 378312111 378859520 378606339 378005524 377113800 376035461 375078430
1976 375078430 374657631 374555359 374631424 375068436 376125565 377433052 379004707 379945755 378740540
1985 378740540 377263069 377353668 377594452 377143402 376111526 373542557 371793976 374063950 376874466
1994 376874466 377317429 376879463 376000633 374910583 373857956 373225708 373757591 374619713 375095596 375575562
2004 375575562 376519203 377000084 375760307 374250870 373674393 373516083 373577118 374109993 375811081 377146492
2014 377146492 376249084 374811897 374049187 373528481 373291016 373126755 372720947 372426529 372550240 372912178
2024 372912178 373510590 374114037 374486694 374637833 374472122 374066849 373364449 372673492 372284660 372191925
2034 372191925 372564316 373164902 373945007 374508362 374315987 373744507 372931976 372053871 371243973 370763054
2044 370763054 370993118 371704559 373043289 374263992 374570847 374260674 373202095 371883392 370702286
2053 370702286 369797935 369463921 369632721 370475044 371568222 372559547 373406410 374167938 374183884 372255783
2063 372255783 370056877 368989944 368667374 369379501 370494118 371453781 372323532 373101463 373430481
2072 373430481 372733345 371667862 370638123 369824638 369533539 369788895 370969772 372315903 373178024
2081 373178024 373601189 373268127 372616272 372007141 371351242 370582123 369990349 369882126 370140800 370895386
2091 370895386 371715546 372217903 372388115 372038841 371302834 370097389 368879318 367968330 367692490 368839989
2101 368839989 370348434 371368637 372047424 372201691 371970673 371323814 370587349 370117645 369790077 369503250
2111 369503250 369541626 370342026 371344337 372241249 372708092 372077484 371069183 370168457 369408836 368957062
2121 368957062 368897209 369553566 370369415 370866318 371132622 371052971 370756874 370349159 369786491 368917236
2131 368917236 368170738 367976685 368180046 368901749 369742622 370347023 370704422 370672455 370289078 369344482
2141 369344482 368436813 368197937 368316193 368697166 369320641 370277405 371137161 371536484 371365051 370127678
2151 370127678 368614197 367380371 366630096 366949310 367746811 368666420 369586945 370371094 370708694 370011826
2161 370011826 368973236 368055344 367359886 367190361 367402573 368043175 368839493 369558334 370126953 370448608
2171 370448608 370360870 369472733 368372688 367480278 366910934 367063980 367503662 367941132 368332863 368524551
2181 368524551 368557930 368472328 368118515 367115746 366198044 366108170 366437912 367121468 367871780 368335266
2191 368335266 368642807 368836174 368827362 368510971 367980499 367160339 366451988 366313477 366498222 366953354
2201 366953354 367554169 368224869 368764648 368932495 368769875 368126144 367336044 366605988 366169701 366492500
2211 366492500 367083321 367620926 368059158 368258972 368176231 367567062 366891403 366581917 366474152 366551170
2221 366551170 366802673 367290497 367779236 368033905 368114243 367952576 367694130 367501984 367254982 366832504
2231 366832504 366393585 365969887 365822792 366406937 367171059 367723923 368038902 367874146 367480774 366979828
2241 366979828 366516838 366233597 366260757 366939774 367776871 368396988 368783493 368771553 368427734 367621651
2251 367621651 366777878 366276512 366117249 366539955 367202530 367877960 368460884 368790855 368804932 368263245
2261 368263245 367532730 366861343 366364975 366369476 366492500 366387138 366270065 366256256 366301041 366445312 366547089
2272 366547089 366520386 366238594 365347137 364443550 364037514 364037018 364590874 365485916 366698761 367807159
2282 367807159 368315697 368418694 368016014 367492905 367205124 367140541 367494125 368000031 368468513 368865013
2292 368865013 369099388 369147530 368784676 368520279 368950348 369590034 370006561 370637436 371858368 373419266
2302 373419266 375517845 377183456 377145309 376498222 376023064 375388870 374370117 373430023 372694740 372949142
2312 372949142 375489960 378907700 382554054 385440369 386270523 385318298 381730309 377589951 374747276
2321 374747276 373047600 373305550 374460945 376207809 377094498 375039825 371625443 366931686 363379707
2330 363379707 364574432 367043266 368406754 368987083 367691269 366382599 367933044 368221283 363131752
2339 363131752 355515709 347117195 337139854 321884384 311803818 317932358 334825745 365353088
2347 365353088 395606270 410762558 416433563 410616875 401331177 397793274 394404411 387872925
2355 387872925 380491714 373483200 366767426 360710373 355194092 350139160 345793495 342804680 339892616
2364 339892616 335284958 331104507 329339523 328619461 328214188 328191032 328500748 328762054 328244934 327945938
2374 327945938 328904877 330260277 331135750 332614670 335881004 339753380 343453636 346954117 349949608
2383 349949608 352493286 354539146 356076965 356970062 357548714 358141403 358613739 358891983 359120598
2392 359120598 359467278 359786263 360061646 360069504 359365005 358594894 358329315 358352432 358717918 359185448
2402 359185448 359544296 359758377 359669914 359433174 359124908 358818512 358610878 358507881 358563423 358730087
2412 358730087 359026909 359306793 359423141 359390717 359140854 358777046 358339310 357947350 357732315 357698441
2422 357698441 357985497 358315697 358398895 358411789 358495483 358464737 358136902 357643356 356954117 356370468 356231689
2433 356231689 356392136 356944580 357509613 357693901 357631912 357261658 356778641 356359482 355997543 355761528
2443 355761528 355602036 355501633 355430832 355340729 355270386 355298042 355254173 354923706 354518166 354158401 353899727
2454 353899727 353853951 353970299 354274025 354647141 355030785 355271835 355116844 354805450 354527473 354175797
2464 354175797 353651047 353117943 352638969 352418900 352850685 353431473 353830109 353921432 353261719 352473259
2474 352473259 352105370 351930847 351920128 352028618 352199554 352439880 352890968 353091240 352396240 351494789
2484 351494789 350947380 350492249 349999199 349631081 349555740 349626312 349776497 349929810 349997520 349948158 349705696
2495 349705696 349312057 348722916 348118782 347673645 347360611 347178688 347221832 347775955 348263016 348071327
2505 348071327 347586136 346922874 346278191 345890770 345749130 345971603 346404800 347053299 347560158 347435951
2515 347435951 347081413 346761246 346391678 345948715 345515747 345092316 344903717 345317116 345903168 346391449
2525 346391449 346670380 346367607 345993271 346011391 346186638 346501846 346765976 346647491 346549759 346989403
2535 346989403 347292404 346709747 345982552 345700760 345566750 345496178 345437279 345237007 345111618 345289230
2545 345289230 345580330 345922012 346159210 346044312 345788956 345564346 345242004 344582062 344089050 344389191
2555 344389191 344876518 345097542 345219841 345259438 345214615 345081329 344881516 344570885 344343185 344418030
2565 344418030 344671021 345156670 345554810 345476379 345180054 344732056 344320068 344252090 344230194 343940506
2575 343940506 343737831 343946457 344342003 344902039 345341682 345285416 344981689 344488602 343999634 343743095
2585 343743095 343668709 343841553 344143639 344594727 344844818 344311218 343712082 343761215 343885880 343573570
2595 343573570 343354225 343791008 344271164 344229469 344084511 344146729 344175110 343992462 343717804 343346100
2605 343346100 343071213 343199501 343386421 343362579 343207130 342784653 342466583 342774162 343122253 342995415
2615 342995415 342705498 342403870 342053185 341632614 341242294 340936890 340829849 341211548 341602554 341478806
2625 341478806 341262093 341218948 341289062 341614723 341851959 341570358 341167908 340876350 340760956 341124306
2635 341124306 341485023 341365356 341054687 340584030 340249786 340504646 340908279 341141205 341291656 341333618
2645 341333618 341289291 341171494 340979347 340648880 340380173 340484161 340564270 340172043 339771500 339774132 339889069
2656 339889069 339910965 339992294 340283165 340583801 340748291 340761909 340500336 340145111 339858284 339570999
2666 339570999 339205971 338948021 339016190 339227676 339560013 339749107 339383621 338878860 338519096 338283997
2676 338283997 338297844 338408470 338466415 338584671 338929901 339190979 339039574 338692665 338196526 337731590
2686 337731590 337514153 337481728 337703705 337999802 338199844 338342667 338408470 338400612 338310242 338151932 337922592
2697 337922592 337666016 337394485 337197304 337214966 337304115 337329140 337406616 337714920 337930679 337655067 337291718
2708 337291718 337193718 337113876 336872330 336618881 336438904 336342316 336417198 336513290 336518059 336405983 335987549
2719 335987549 335639496 335839996 336092224 335953941 335736771 335612068 335557213 335650215 335760345 335758438 335715065
2730 335715065 335642815 335583458 335630188 335638504 335391273 335197220 335420609 335674057 335618248 335471153 335339775
2741 335339775 335217247 335176697 335081558 334686279 334388962 334677925 335036278 335048904 334898224 334596405
2751 334596405 334238052 333926430 333645592 333380699 333228607 333309898 333537827 334010124 334293594 333713760
2761 333713760 333092461 333208084 333514214 333674202 333833923 334126701 334250679 333762169 333218803 333134651
2771 333134651 333193550 333326340 333303680 332647324 332033615 332119713 332484016 333008995 333438148 333381653 333122025
2782 333122025 332814713 332449188 332062950 331664581 331183205 330891609 331175575 331624260 331969261 332168579
2792 332168579 332026978 331734886 331382523 331074715 330981026 330996742 331128120 331211319 330978622 330745239
2802 330745239 330817947 330953827 331051598 330991516 330465317 329935303 329908829 329940338 329601746 329344254 329708557
2813 329708557 329995651 329476357 328781357 328293571 328024139 328200836 328553696 328949699 329205284 329015961
2823 329015961 328610420 328039627 327529182 327384224 327413330 327610970 327723274 327380409 326924095 326578598
2833 326578598 326322556 326286545 326238403 325944901 325537910 325012207 324543724 324414749 324299316 323962936
2843 323962936 323412170 322479706 321450233 320547333 319783688 319294453 318934441 318561783 318300972 318263283
2853 318263283 318344345 318548431 318658104 318382034 317942848 317412148 316949844 316786995 316779861 316910019
2863 316910019 317030907 316981087 316785088 316310158 315866947 315849781 315871716 315633049 315264931 314727783
2873 314727783 314231148 314069271 313945999 313613167 313220978 312794914 312458267 312412491 312446117 312356720
2883 312356720 312316895 312476883 312699547 312924385 313072205 313005219 312836876 312645187 312396526 312043190
2893 312043190 311702728 311507702 311365604 311261654 311092854 310706615 310236454 309689751 309291840 309437523
2903 309437523 309622040 309372425 308986664 308594227 308224907 308028698 307770958 307226410 306516418 305597534
2913 305597534 304737091 304257164 303946495 303694248 303519249 303431282 303344498 303181877 302926292 302441368
2923 302441368 302005997 301925888 301983833 302136421 302166214 301648865 301160812 301305771 301577091 301573753 301579475
2934 301579475 301709404 302067280 302911758 303889503 304742336 305440426 305799007 306021214 306250343 306480408
2944 306480408 306752682 307068100 307408562 307870636 308628311 309431076 310122967 310592175 310553551 310369968
2954 310369968 310312271 310367813 310708275 311048279 311129093 311040649 310724735 310364952 310133209 310004005 309969673
2965 309969673 310148468 310769806 311491241 312029114 312435627 312583923 312727451 313092957 313633690 314533005
2975 314533005 315324783 315494308 315369129 314973831 314702511 315177689 315737495 315747738 315746078 316200733
2985 316200733 316683044 316844940 316911926 316964874 317086697 317468643 317866802 318051567 318169594 318311691
2995 318311691 318414688 318443527 318402061 318237076 318084240 318058968 318165779 318518162 318903694 319119225
3005 319119225 319248676 319379082 319294453 318673859 317918053 317322254 316881409 316727638 316741714 316844215
3015 316844215 317045937 317379475 317697296 317892075 317873230 317419529 316815147 316210518 315785637 315853596
3025 315853596 316164494 316755524 317077637 316303024 315303326 314760933 314414253 314262867 314206123 314043274
3035 314043274 314071884 314737091 315393925 315434685 315190086 314695835 314226379 314246902 314218750 313580284 312863121
3046 312863121 312367916 312223206 312891235 313668022 313942432 313894749 313394318 312761307 312286148 311927319
3056 311927319 311750183 311724434 311915874 312100410 312127113 311840286 310844421 309706917 308778286 308310986
3066 308310986 308963299 309868584 310302258 310494900 310397873 310120811 309782257 309304008 308531761 307811012
3076 307811012 307528496 307405243 307270279 307183990 307180634 307165623 307031155 306849957 306676140 306455135 306129227
3087 306129227 305758247 305298805 305000076 305336475 305585384 304851303 304124355 304357300 304765701 304870129
3097 304870129 304706345 303984413 303201675 302847862 302654266 302492371 302431583 302547932 302689552 302770138
3107 302770138 302665710 302115669 301443329 300894737 300440788 300189247 299975395 299578190 299272060 299374809
3117 299374809 299534569 299486637 299285412 298867226 298321495 297650814 297049999 296693077 296644688 297194958
3127 297194958 297839394 298218727 298187485 297210217 296095848 295616627 295346737 295070877 294928322 295102348
3137 295102348 295242081 294923553 294547081 294514885 294394264 293741226 292990208 292403221 292050838 292206535
3147 292206535 292521248 292774429 292851677 292508125 291913261 291056633 290232658 289736023 289554119 289904823
3157 289904823 290390244 290720463 290786743 290228119 289510956 289026737 288639069 288396358 288133621 287568817
3167 287568817 287099113 287115097 287353039 287783623 288091183 287861347 287359715 286637783 285923004 285453796
3177 285453796 285247803 285596848 285915375 285557747 284994850 284479618 284016838 283779373 283512840 282877445
3187 282877445 282299042 282243252 282248726 281867752 281522751 281664848 281759491 281255951 280651569 280281544 280081272
3198 280081272 280237198 280328522 279815445 279237976 279099464 278969288 278434982 277945290 277965317 278030872
3208 278030872 277785301 277369270 276682854 276087761 276058197 276155949 276118755 275892982 275210857 274452209
3218 274452209 273943176 273576965 273358574 273278236 273391495 273506393 273361683 273221016 273428192 273481369
3228 273481369 272780895 271962643 271566391 271280518 270939102 270642052 270412922 270313034 270546436 270704746
3238 270704746 270296574 269774208 269555321 269251347 268407593 267636776 267609825 267695904 267274628 266983261
3248 266983261 267572632 268081188 267444134 266720047 266913643 267121315 266548634 265870323 265596161 265423775
3258 265423775 265192757 264984608 264869919 264720688 264332542 264003754 264015198 264212132 264644394 264976978
3268 264976978 264809380 264384747 263720989 263091087 262850761 262766609 262796879 262720108 262166252 261539230
3278 261539230 261115303 260906944 261079311 261446953 261941433 262377014 262521973 262445221 262068977 261600723
3288 261600723 261307487 260930786 260102501 259415150 259499073 259869099 260333786 260640373 260406265 259828091
3298 259828091 258836517 257843971 257263412 257022381 257336140 257752190 257900715 257745514 256957054 256043911
3308 256043911 255547295 255037537 254069328 253229618 253081093 253249168 253673782 253970871 253593674 252966881
3318 252966881 252284775 251688004 251448402 251365662 251394501 251340637 250896683 250356674 249898682 249562263
3328 249562263 249583721 249549389 248989830 248305550 247714996 247293472 247330666 247400055 247116089 246642590 245972157
3339 245972157 245232353 244518509 243916283 243672142 243395805 242599716 241822014 241529694 241447449 241541862
3349 241541862 241551876 241129875 240500450 239688148 238942375 238627434 238422394 238134155 237741470 237009048
3359 237009048 236385574 236525536 236574402 235603561 234486580 233889103 233503819 233277092 233113060 232887268
3369 232887268 232629776 232293129 231985321 231883526 231732845 231245995 230694294 230233192 229922066 230042934
3379 230042934 230083466 229453812 228668442 228013268 227582932 227728615 227965584 227913857 227607498 226745834
3389 226745834 225950012 225949287 226116657 226053963 225801945 225110531 224452248 224391937 224401703 224061737 223610401
3400 223610401 223130703 222666740 222244740 221998692 222191582 222460518 222487679 222400436 222221851 221945038
3410 221945038 221439838 221096764 221450329 221935043 222222557 222135544 221224785 219976425 218553772 217475166
3420 217475166 217530479 218065739 218780518 219403038 219472656 219255447 218792191 218296528 218003750 217887402
3430 217887402 218090286 218336334 218311310 218271732 218439827 218600998 218556881 218478432 218409538 218530178 219373703
3441 219373703 219920635 219049931 217596531 215670815 214323997 215176582 216628799 217471352 218153000
3450 218153000 218760490 219167709 219185829 219089279 219184399 219186058 218792686 218357315 218111515 218114853 218695641
3461 218695641 219275951 219231377 219026794 218841782 218905926 219683876 220647583 221475830 222012043 221808205
3471 221808205 221413841 221166134 221252670 222286701 223325729 223544846 223203182 221968880 220787525
3480 220787525 220713139 221087685 221721878 222261906 222029209 221807480 222304344 223066330 223995686 224732170
3490 224732170 224690208 224447727 224343300 224507561 225331535 226371994 227547874 228161087 227088928 225522518
3500 225522518 224059830 223356972 224895477 226795673 227560520 227523079 226062298 224540482 224380970
3509 224380970 224779854 225361099 226262817 227677574 229065170 229794731 230328789 231011620 231565475 231869221
3519 231869221 231794834 230969200 230005741 229601860 229130268 227927437 226798782 226317883 226513634 227896690
3529 227896690 229591846 230941772 231801987 231481075 230960846 230888596 231576443 233969688 236812363
3538 236812363 239459515 241022110 240083218 237581024 233115196 229280701 229229698 230888844 233863831
3547 233863831 236268044 235155582 233307610 232525349 232800484 235338688 238297691 239982834 241155396
3556 241155396 241633644 242549419 245561123 248906136 252312183 252966404 246520767 237306118 226618767
3565 226618767 219210854 222645760 229785442 236079216 241326809 243185043 243530998 243345490 242973099
3574 242973099 243116379 243681908 244627476 246500492 250159264 254625797 260473976 263903141 260217667
3583 260217667 252673874 240600815 231083641 233469963 240300903 248127708 254266510 253198395
3591 253198395 249976883 247934113 246714363 247739315 249006500 248320351 247678986 248122215 250329742
3600 250329742 256632805 263114204 266645432 267188797 262140274 256068230 253009796 251951218 254099121
3609 254099121 256828308 256857643 257361412 262531757 266033649 261055717 253217468 244313240 239006996
3618 239006996 244344940 254971733 269529572 283071747 290928116 290908813 275895596 256001472
3626 256001472 236647606 224788666 234974136 249837875 254310608 256049881 257745972 259229431
3634 259229431 261588097 263738155 263980141 265247574 270441284 277957191 288322678 298042526 305836201
3643 305836201 305584679 285846939 261305084 242092133 230411053 234949837 246384392 260399590
3651 260399590 270653496 265413761 256535301 252299309 251691818 258491516 266600132 269574394 272225151
3660 272225151 277598381 284544945 294893742 302753448 301613579 295160522 281775475 270861855
3668 270861855 275477638 283037910 286667347 282292137 255216370 230429878 235087624 247996807
3676 247996807 255200157 262145519 269608727 277647247 287354469 296397438 304517746 306583176 294482956
3685 294482956 276890984 257655373 243139496 244195938 251203766 257862091 265060654 271825562
3693 271825562 277444611 280685654 282131424 282429924 280151844 271415710 264225960 266946564 274615765
3702 274615765 286910534 298277378 303023109 301240444 288842926 272673607 256514072 245460510
3710 245460510 248252392 257739296 271257401 284085503 289209366 290844193 290862312 289277802 286624432
3719 286624432 283212662 279157162 275577545 273198357 273317337 277740250 285664082 300064316 311409225
3728 311409225 308565369 299312820 287528267 273785362 257246494 246018639 250064621 262975922
3736 262975922 285288582 306128502 313664207 311304321 294273148 275289307 265514145 264841080
3744 264841080 285379410 301641693 282648087 256983032 244572639 240410328 248626938 261734486
3752 261734486 274987450 284287682 280985603 273987293 269011497 266969681 272426128 280138016
3760 280138016 286977997 291163445 288147926 283093929 280855179 277810097 269891510 263289223 263865948
3769 263865948 268533230 277590275 286734581 291326294 292675247 290036926 284931908 277094116 271138668
3778 271138668 273933887 278451920 279221764 278438339 275490761 273323784 275781631 279552937 282045364
3787 282045364 284944057 289751778 294421673 297308197 298707485 297791252 296286812 296327362 295865536
3796 295865536 294381866 289425373 273936996 261219025 267481804 276940823 277755013 274303913
3804 274303913 263100395 255899658 268089523 285284767 298123131 306922684 308021545 303996315
3812 303996315 293889771 284641266 286182175 288576355 284320107 276047478 259667397 247848511
3820 247848511 257373333 271806488 278710365 282871723 283980370 284885883 289751053 294322968 294340363
3829 294340363 293990612 297760010 300488701 298182716 291828384 278707027 265937576 261049271
3837 261049271 260092506 262260914 265653381 266809940 269597778 276957741 288208485 306180477
3845 306180477 323277245 334358673 334884644 314892292 285508633 249070396 221982956 228451958
3853 228451958 247410545 266252289 283799400 294015160 298867455 297137489 292347679 286986351
3861 286986351 282936821 284046898 286910286 291073322 291525364 279155960 265810966 261964321
3869 261964321 262619972 266935577 272920380 277752876 283080330 291702499 297338009 291597595 283603668
3878 283603668 280589104 279832611 282719612 284162292 275772572 268835545 275909653 284786224 286350975
3887 286350975 283878803 274532318 267531872 274209499 285392761 296377659 305089226 307270279
3895 307270279 304760704 296792755 286931992 278902779 271460762 263801575 258326302 257484436 260326385
3904 260326385 268137207 276660690 281125298 284360657 287982941 290858269 292608490 292580376 289434204
3913 289434204 284848690 279145012 275055656 276871910 280236721 281994591 282829056 281806469 280620804
3922 280620804 280642033 281907082 286136150 289647331 288612843 285187950 279189110 273805141 272777786
3931 272777786 274262905 278440475 282976875 285110703 286301842 287435532 287472248 284934998 282020798
3940 282020798 280462990 280173531 282733440 284869194 282649994 279625893 278270493 277880192 278839836
3949 278839836 280357361 281877747 283071747 283158302 282935371 283095131 283172836 282898674 282379875 281440010
3959 281440010 280658245 280691376 281126499 281893730 282620907 282763004 282766342 282997856 283149719 283025513
3969 283025513 282657852 281904697 281092167 280483246 280123711 280211926 280553341 281077614 281609058 281882057
3979 281882057 282092571 282369137 282646656 282897472 283134937 283505669 283580551 282706261 281702042 281281471
3989 281281471 281105518 281107674 281183720 281177998 281176090 281203270 281284561 281441689 281709194 282165298 282697906
4000 282697906
##END=$$ End of the data block
